<?xml version="1.0" encoding="UTF-8" standalone="no"?>
<!-- Created with Inkscape (http://www.inkscape.org/) -->

<svg
   width="1000"
   height="1000"
   viewBox="0 0 1000 1000"
   version="1.1"
   id="svg5"
   xml:space="preserve"
   sodipodi:docname="Sombra_Logo.svg"
   inkscape:version="1.2.2 (b0a8486, 2022-12-01)"
   xmlns:inkscape="http://www.inkscape.org/namespaces/inkscape"
   xmlns:sodipodi="http://sodipodi.sourceforge.net/DTD/sodipodi-0.dtd"
   xmlns:xlink="http://www.w3.org/1999/xlink"
   xmlns="http://www.w3.org/2000/svg"
   xmlns:svg="http://www.w3.org/2000/svg"><sodipodi:namedview
     id="namedview7"
     pagecolor="#ffffff"
     bordercolor="#000000"
     borderopacity="0.25"
     inkscape:showpageshadow="true"
     inkscape:pageopacity="1"
     inkscape:pagecheckerboard="0"
     inkscape:deskcolor="#d1d1d1"
     inkscape:document-units="px"
     showgrid="false"
     inkscape:zoom="0.71703288"
     inkscape:cx="754.49818"
     inkscape:cy="458.8353"
     inkscape:window-width="1920"
     inkscape:window-height="1012"
     inkscape:window-x="0"
     inkscape:window-y="0"
     inkscape:window-maximized="1"
     inkscape:current-layer="layer1"
     borderlayer="true" /><defs
     id="defs2"><linearGradient
       inkscape:collect="always"
       id="linearGradient197562"><stop
         style="stop-color:#0a6f84;stop-opacity:1;"
         offset="0.62228262"
         id="stop197558" /><stop
         style="stop-color:#1caccd;stop-opacity:1;"
         offset="1"
         id="stop197560" /></linearGradient><radialGradient
       inkscape:collect="always"
       xlink:href="#linearGradient197562"
       id="radialGradient197564-9"
       cx="435.51791"
       cy="359.3833"
       fx="435.51791"
       fy="359.3833"
       r="83.083656"
       gradientTransform="matrix(1.3063065,0.11139516,-0.09321414,1.0931015,-100.01841,-86.79362)"
       gradientUnits="userSpaceOnUse" /><linearGradient
       id="SVGID_00000044146867005464432120000012155425387655648178_"
       gradientUnits="userSpaceOnUse"
       x1="677.4024"
       y1="247.46001"
       x2="504.3186"
       y2="547.24982"
       gradientTransform="translate(200.75001,-8.6173489)">
		<stop
   offset="0.2024"
   style="stop-color:#BFCAC1"
   id="stop7412" />
		<stop
   offset="0.2844"
   style="stop-color:#B6C2BA"
   id="stop7414" />
		<stop
   offset="0.4182"
   style="stop-color:#9EADA8"
   id="stop7416" />
		<stop
   offset="0.5873"
   style="stop-color:#768B8B"
   id="stop7418" />
		<stop
   offset="0.783"
   style="stop-color:#3F5B62"
   id="stop7420" />
		<stop
   offset="0.8592"
   style="stop-color:#284751"
   id="stop7422" />
	</linearGradient><radialGradient
       id="SVGID_00000089567276596705664950000006666101074281899177_"
       cx="570.60132"
       cy="335.1239"
       r="55.602001"
       fx="591.04187"
       fy="349.79141"
       gradientUnits="userSpaceOnUse"
       gradientTransform="translate(215.00744,-3.1859486)">
		<stop
   offset="0.212"
   style="stop-color:#A7B5AF"
   id="stop7450" />
		<stop
   offset="0.4806"
   style="stop-color:#A9B7B0;stop-opacity:0.4009"
   id="stop7452" />
		<stop
   offset="0.5772"
   style="stop-color:#B0BDB5;stop-opacity:0.1854"
   id="stop7454" />
		<stop
   offset="0.646"
   style="stop-color:#BBC7BE;stop-opacity:3.206629e-02"
   id="stop7456" />
		<stop
   offset="0.6604"
   style="stop-color:#BFCAC1;stop-opacity:0"
   id="stop7458" />
	</radialGradient><radialGradient
       id="SVGID_00000010276421532176069330000017694745292597018774_"
       cx="570.60132"
       cy="335.1239"
       r="55.602001"
       fx="591.04187"
       fy="349.79141"
       gradientUnits="userSpaceOnUse"
       gradientTransform="translate(215.00744,-3.1859486)">
		<stop
   offset="0.212"
   style="stop-color:#A7B5AF"
   id="stop7463" />
		<stop
   offset="0.4806"
   style="stop-color:#A9B7B0;stop-opacity:0.4009"
   id="stop7465" />
		<stop
   offset="0.5772"
   style="stop-color:#B0BDB5;stop-opacity:0.1854"
   id="stop7467" />
		<stop
   offset="0.646"
   style="stop-color:#BBC7BE;stop-opacity:3.206629e-02"
   id="stop7469" />
		<stop
   offset="0.6604"
   style="stop-color:#BFCAC1;stop-opacity:0"
   id="stop7471" />
	</radialGradient><radialGradient
       id="SVGID_00000101785846840370329170000015274465622057108895_"
       cx="584.1665"
       cy="349.7326"
       r="84.558701"
       fx="653.4408"
       fy="398.2222"
       gradientTransform="matrix(1,0,0,1.3581,0.80659608,-124.02576)"
       gradientUnits="userSpaceOnUse">
		<stop
   offset="0.7156"
   style="stop-color:#BFCAC1;stop-opacity:0"
   id="stop7476" />
		<stop
   offset="0.7268"
   style="stop-color:#ACB6AE;stop-opacity:4.101282e-02"
   id="stop7478" />
		<stop
   offset="0.7719"
   style="stop-color:#636964;stop-opacity:0.2071"
   id="stop7480" />
		<stop
   offset="0.8091"
   style="stop-color:#2D302E;stop-opacity:0.3442"
   id="stop7482" />
		<stop
   offset="0.8366"
   style="stop-color:#0C0D0D;stop-opacity:0.4456"
   id="stop7484" />
		<stop
   offset="0.8514"
   style="stop-color:#000000;stop-opacity:0.5"
   id="stop7486" />
	</radialGradient><linearGradient
       id="SVGID_00000169549928522465989410000000563520378755013053_"
       gradientUnits="userSpaceOnUse"
       x1="628.99188"
       y1="378.5"
       x2="628.99188"
       y2="423.78">
			<stop
   offset="0.1551"
   style="stop-color:#DEEAE1"
   id="stop7491" />
			<stop
   offset="0.1854"
   style="stop-color:#CEDCD4"
   id="stop7493" />
			<stop
   offset="0.3168"
   style="stop-color:#8EA29E"
   id="stop7495" />
			<stop
   offset="0.4364"
   style="stop-color:#5B7474"
   id="stop7497" />
			<stop
   offset="0.5402"
   style="stop-color:#375355"
   id="stop7499" />
			<stop
   offset="0.624"
   style="stop-color:#203F43"
   id="stop7501" />
			<stop
   offset="0.6774"
   style="stop-color:#18383C"
   id="stop7503" />
		</linearGradient><linearGradient
       id="SVGID_00000036215429872224060450000008090892767048604559_"
       gradientUnits="userSpaceOnUse"
       x1="701.03223"
       y1="382.08691"
       x2="701.03223"
       y2="372"
       gradientTransform="translate(215.00744,-3.1859486)">
		<stop
   offset="0.1615"
   style="stop-color:#000000;stop-opacity:0.4994"
   id="stop7526" />
		<stop
   offset="0.2187"
   style="stop-color:#000000;stop-opacity:0.4999"
   id="stop7528" />
		<stop
   offset="0.2285"
   style="stop-color:#000000;stop-opacity:0.5"
   id="stop7530" />
		<stop
   offset="0.5298"
   style="stop-color:#020202;stop-opacity:0.3048"
   id="stop7532" />
		<stop
   offset="0.6383"
   style="stop-color:#080908;stop-opacity:0.2344"
   id="stop7534" />
		<stop
   offset="0.7157"
   style="stop-color:#131414;stop-opacity:0.1843"
   id="stop7536" />
		<stop
   offset="0.7783"
   style="stop-color:#232524;stop-opacity:0.1437"
   id="stop7538" />
		<stop
   offset="0.8318"
   style="stop-color:#383B39;stop-opacity:0.109"
   id="stop7540" />
		<stop
   offset="0.8793"
   style="stop-color:#525753;stop-opacity:7.823333e-02"
   id="stop7542" />
		<stop
   offset="0.9222"
   style="stop-color:#717772;stop-opacity:5.038920e-02"
   id="stop7544" />
		<stop
   offset="0.9611"
   style="stop-color:#949C95;stop-opacity:2.520058e-02"
   id="stop7546" />
		<stop
   offset="0.9963"
   style="stop-color:#BAC5BC;stop-opacity:2.409309e-03"
   id="stop7548" />
		<stop
   offset="1"
   style="stop-color:#BFCAC1;stop-opacity:0"
   id="stop7550" />
	</linearGradient><linearGradient
       id="SVGID_00000152232350739354378890000004773114477347753102_"
       gradientUnits="userSpaceOnUse"
       x1="631.5"
       y1="380.5"
       x2="631.5"
       y2="419.5">
			<stop
   offset="0.2982"
   style="stop-color:#A8B7B4"
   id="stop7563" />
			<stop
   offset="0.3169"
   style="stop-color:#9FAFAD"
   id="stop7565" />
			<stop
   offset="0.4341"
   style="stop-color:#6D8386"
   id="stop7567" />
			<stop
   offset="0.5367"
   style="stop-color:#49636A"
   id="stop7569" />
			<stop
   offset="0.6196"
   style="stop-color:#324F58"
   id="stop7571" />
			<stop
   offset="0.6725"
   style="stop-color:#2A4852"
   id="stop7573" />
		</linearGradient><linearGradient
       id="SVGID_00000052813079010618420440000016071082401384157602_"
       gradientUnits="userSpaceOnUse"
       x1="606.14868"
       y1="384.715"
       x2="606.14868"
       y2="369.52759"
       gradientTransform="translate(2.3341775,1.0573328)">
		<stop
   offset="0"
   style="stop-color:#000000;stop-opacity:0.5"
   id="stop7582" />
		<stop
   offset="0.1492"
   style="stop-color:#040404;stop-opacity:0.4254"
   id="stop7584" />
		<stop
   offset="0.2907"
   style="stop-color:#0E0F0F;stop-opacity:0.3547"
   id="stop7586" />
		<stop
   offset="0.4291"
   style="stop-color:#212221;stop-opacity:0.2854"
   id="stop7588" />
		<stop
   offset="0.5657"
   style="stop-color:#3A3D3B;stop-opacity:0.2172"
   id="stop7590" />
		<stop
   offset="0.7009"
   style="stop-color:#5B605C;stop-opacity:0.1495"
   id="stop7592" />
		<stop
   offset="0.8352"
   style="stop-color:#838B84;stop-opacity:8.240432e-02"
   id="stop7594" />
		<stop
   offset="0.9662"
   style="stop-color:#B2BCB4;stop-opacity:1.689544e-02"
   id="stop7596" />
		<stop
   offset="1"
   style="stop-color:#BFCAC1;stop-opacity:0"
   id="stop7598" />
	</linearGradient><clipPath
       clipPathUnits="userSpaceOnUse"
       id="clipPath733"><g
         id="g759"><path
           style="fill:#1a829f;fill-opacity:1;stroke-width:0.147729"
           d="m -522.07161,332.36823 -0.15272,0.72313 5.95624,4.62638 5.95625,4.62638 3.75076,29.84962 3.7508,29.84964 19.09978,14.83533 19.0998,14.83534 0.40511,2.43901 c 0.22284,1.34145 0.84371,5.69302 1.37971,9.67019 0.53602,3.97714 1.06278,7.41712 1.17054,7.64444 0.41393,0.87282 0.89565,0.54006 0.88286,-0.60987 -0.004,-0.40171 -0.50558,-4.96922 -1.11354,-10.14999 l -1.10543,-9.41959 -19.26829,-14.96621 -19.26828,-14.9662 -3.75079,-29.84963 -3.75077,-29.84962 -6.44465,-5.00574 -6.44466,-5.00575 z"
           id="path735" /><path
           style="fill:#1a829f;fill-opacity:1;stroke-width:0.147729"
           d="m -512.31902,323.54832 c -0.0666,0.17978 -0.24341,0.84209 -0.393,1.47179 l -0.27199,1.14491 8.68605,6.7467 c 9.37043,7.27826 8.84537,6.81393 8.39454,7.4241 -0.0805,0.10912 -0.0374,0.61968 0.0959,1.13476 0.13331,0.51507 1.62401,11.79509 3.31262,25.06668 l 3.0702,24.13015 27.29146,21.19803 27.29148,21.19805 1.00738,8.09418 c 0.55406,4.45178 1.4495,11.28719 1.98983,15.18981 l 0.98245,7.09562 13.06599,10.21937 c 7.18624,5.62072 13.15347,10.35543 13.26042,10.52179 0.10694,0.1663 0.13965,0.58924 0.0727,0.93984 -0.17138,0.89768 0.11286,2.8938 0.5282,3.70946 0.77643,1.52471 1.9849,2.53328 3.65196,3.04791 1.14072,0.35214 2.8591,0.16306 4.1002,-0.45112 0.78139,-0.38666 0.98178,-0.56363 1.74683,-1.54258 0.78486,-1.00445 0.88588,-1.20389 1.10104,-2.17524 0.30134,-1.36061 0.13043,-2.72069 -0.49819,-3.96444 -0.44117,-0.87286 -0.60656,-1.06492 -1.54413,-1.79315 -0.93829,-0.7288 -1.16423,-0.84089 -2.12306,-1.05327 -1.47879,-0.32755 -2.84262,-0.17575 -3.97556,0.44252 l -0.91111,0.49724 -12.98641,-10.08691 -12.98639,-10.08688 -1.82848,-14.88838 -1.82849,-14.88839 -27.31518,-21.21645 -27.3152,-21.21646 -3.22974,-25.70378 -3.22974,-25.70377 -9.54581,-7.4145 -9.54582,-7.41449 z"
           id="path737" /><path
           style="fill:#1a829f;fill-opacity:1;stroke-width:0.147729"
           d="m -503.5854,314.33117 -0.50219,1.43375 12.45087,9.71855 12.45089,9.71853 2.87793,22.90442 2.87792,22.90437 10.98048,8.52884 10.98049,8.52885 -0.21829,0.71694 c -0.30924,1.01555 -0.0736,2.63739 0.52418,3.60711 0.57371,0.93076 1.85944,1.9841 2.82967,2.31823 1.06548,0.36692 2.35865,0.29656 3.48616,-0.18965 0.95872,-0.41338 1.04729,-0.48682 1.86361,-1.54537 0.76206,-0.98814 0.87772,-1.21536 1.04354,-2.04964 0.21757,-1.09466 0.0563,-2.28529 -0.4636,-3.4237 -0.3105,-0.67986 -0.51068,-0.91855 -1.24697,-1.48686 -1.48424,-1.14583 -3.48305,-1.40985 -5.36102,-0.70851 l -0.97028,0.36234 -10.33808,-8.02986 -10.33807,-8.02987 -2.89106,-23.00896 -2.89107,-23.00897 -13.32145,-10.34713 -13.32147,-10.34716 z"
           id="path739" /><path
           style="fill:#1a829f;fill-opacity:1;stroke-width:0.147729"
           d="m -492.2631,285.97237 0.60735,0.24158 11.73751,-15.05037 11.7375,-15.05038 12.59953,-1.67263 c 6.92971,-0.91998 17.73428,-2.31373 24.01015,-3.09723 l 11.41061,-1.42457 27.25452,-35.08891 27.25452,-35.0889 -0.52502,-0.40779 -0.52501,-0.4078 -27.13339,34.93296 -27.13337,34.93293 -23.88081,2.93156 -23.88084,2.93154 -12.06946,15.53886 -12.06948,15.53889 z"
           id="path741" /><path
           style="fill:#1a829f;fill-opacity:1;stroke-width:0.147729"
           d="m -504.3462,284.14473 c 0.11438,0.0845 0.67283,0.368 1.24111,0.62979 l 1.03323,0.47597 13.30261,-17.06548 13.30263,-17.06549 23.21557,-2.91704 23.21557,-2.91703 19.25725,-24.79281 19.25726,-24.7928 -2.44898,-19.48487 -2.44901,-19.48484 12.06442,-15.53237 12.0644,-15.53234 0.46892,0.1286 c 1.39981,0.38393 3.10176,10e-4 4.43636,-0.9972 1.31546,-0.98425 2.01183,-2.66926 1.85752,-4.49469 -0.12097,-1.43127 -0.52659,-2.08042 -2.03339,-3.2543 -1.49635,-1.16615 -1.81912,-1.26281 -3.50031,-1.05152 -1.71792,0.21588 -2.25583,0.52479 -3.33005,1.91247 -0.64065,0.82983 -0.94645,1.33797 -1.04949,1.7529 -0.1883,0.7584 -0.0286,2.46031 0.31035,3.30829 0.14662,0.36669 0.23986,0.78976 0.20724,0.94018 -0.0326,0.15045 -5.54802,7.37401 -12.25641,16.05244 l -12.1971,15.77896 2.4535,19.58265 2.45351,19.58264 -18.42046,23.74257 -18.42044,23.74254 -23.23427,2.92009 -23.23427,2.92008 -13.88748,17.87948 c -13.16718,16.95212 -13.8766,17.88754 -13.67959,18.03328 z"
           id="path743" /><path
           style="fill:#1a829f;fill-opacity:1;stroke-width:0.147729"
           d="m -450.96274,139.78478 0.6266,4.97315 -22.02175,28.35197 -22.02176,28.35197 2.38388,18.96662 2.38388,18.96661 -13.61596,17.52991 c -12.90721,16.61742 -13.60526,17.53821 -13.41165,17.68832 0.11235,0.0872 0.7116,0.42646 1.33166,0.75403 0.62006,0.32756 1.14056,0.6057 1.15666,0.61809 0.0161,0.0124 9.0722,-11.61981 20.12463,-25.8493 l 20.09532,-25.87178 20.72874,-2.60448 20.72873,-2.60448 2.68562,-3.45761 2.68561,-3.45759 0.85682,0.2416 c 2.43536,0.68668 5.27243,-0.56982 6.4537,-2.8583 0.92285,-1.78779 0.949,-3.89307 0.0667,-5.36656 -0.6751,-1.12735 -2.3214,-2.39953 -3.59823,-2.78042 -1.08511,-0.32379 -2.81871,-0.1524 -3.9526,0.39082 -0.66515,0.31865 -0.85639,0.5005 -1.78899,1.70118 -0.99564,1.28184 -1.0544,1.39411 -1.26377,2.41209 -0.26307,1.27927 -0.11415,2.26354 0.55543,3.67164 l 0.49901,1.04936 -2.17971,2.80628 c -1.19884,1.54344 -2.29937,2.85958 -2.44562,2.9247 -0.14628,0.0651 -8.55959,1.12164 -18.69626,2.34778 -16.99186,2.05533 -18.419,2.2016 -18.28542,1.87423 0.18396,-0.45087 45.05111,-58.27024 46.89354,-60.43076 l 1.37004,-1.60657 0.49803,0.10999 c 0.84308,0.18615 2.41605,0.0135 3.29121,-0.36125 0.75096,-0.32161 0.91375,-0.46051 1.64882,-1.40687 0.69283,-0.89199 0.84612,-1.18532 1.01847,-1.94893 0.25915,-1.14814 0.0978,-2.42149 -0.43832,-3.45851 -0.342,-0.66158 -0.59893,-0.95494 -1.3531,-1.54475 -1.32253,-1.03426 -2.25188,-1.31781 -3.71471,-1.13321 -1.35968,0.17159 -2.11438,0.60041 -3.2278,1.83406 -0.67569,0.74865 -0.77906,0.93542 -0.97233,1.75695 -0.28921,1.2293 -0.24166,2.3509 0.13522,3.18879 0.17063,0.37937 0.26842,0.8285 0.21729,0.99798 -0.0511,0.16953 -14.20842,18.51128 -31.46068,40.75952 l -31.36775,40.45127 -2.21472,-18.08778 -2.21472,-18.08777 22.01769,-28.35326 22.0177,-28.35328 -0.67666,-4.92144 -0.67667,-4.92143 5.39331,-6.9371 5.39328,-6.93708 12.12934,-1.52752 12.12934,-1.52753 10.08052,-12.97819 10.08054,-12.97822 -0.60221,-0.46776 -0.60221,-0.46775 -9.83493,12.80801 -9.83492,12.80794 -12.11443,1.52168 -12.11442,1.5217 -5.80071,7.46814 -5.80073,7.46817 z"
           id="path745" /><path
           style="fill:#1a829f;fill-opacity:1;stroke-width:0.147729"
           d="m -611.08164,196.76155 14.1331,5.7306 5.54698,13.1145 5.54695,13.11449 11.88162,4.86343 c 10.53683,4.31298 15.74042,6.51912 17.05963,7.23285 0.22877,0.1238 0.70186,0.24594 1.05128,0.2714 0.74625,0.0544 1.96893,0.62471 2.12362,0.99045 0.0595,0.14064 0.15084,0.19549 0.20307,0.12187 0.2253,-0.31766 5.22028,1.703 5.42891,2.19621 0.0391,0.0925 0.17474,0.1143 0.30126,0.0486 0.21788,-0.11323 0.61463,0.78436 7.45176,16.85794 l 7.22166,16.97752 0.84935,-0.46649 c 0.46717,-0.25657 1.01585,-0.57975 1.21936,-0.71829 l 0.37003,-0.25177 -7.37057,-17.43384 -7.37057,-17.43379 -15.35644,-6.15217 -15.35643,-6.15217 -12.18039,-28.79753 -12.18038,-28.79753 -12.19763,-4.94561 -12.19758,-4.94557 -7.64749,-18.1767 -7.64748,-18.17669 0.48669,-0.5559 c 0.26781,-0.30566 0.71326,-0.7455 0.99015,-0.97726 0.33783,-0.28291 0.47086,-0.49848 0.40435,-0.65575 -0.0545,-0.12894 -0.0529,-0.29956 0.004,-0.3792 0.15851,-0.22364 0.23962,-1.92451 0.1358,-2.85124 -0.12191,-1.08812 -0.44396,-1.82185 -1.18359,-2.69664 -1.14463,-1.35375 -2.99905,-2.12575 -4.83669,-2.01341 -1.26564,0.0774 -2.92311,0.87253 -3.77025,1.80869 -2.12883,2.35259 -1.94007,5.89644 0.42957,8.06588 0.8399,0.76898 2.68344,1.5181 3.65155,1.48387 l 0.70404,-0.0249 0.55658,1.07478 c 0.30612,0.59112 3.91012,9.00241 8.00892,18.69169 l 7.45148,17.61721 12.41091,5.03602 12.41092,5.03607 11.59511,27.69485 11.59514,27.69484 -2.87438,-1.1628 -2.87438,-1.16279 -5.58308,-13.19983 -5.58308,-13.19983 -13.93813,-5.65153 -13.93815,-5.65155 -3.92004,-9.17051 -3.92002,-9.17053 -0.73169,0.26104 -0.73169,0.26097 4.01712,9.49762 4.01721,9.49761 z"
           id="path747" /><path
           style="fill:#1a829f;fill-opacity:1;stroke-width:0.147729"
           d="m -595.43942,293.12237 22.38573,-2.81348 9.00769,6.94862 9.00773,6.94862 0.32141,-0.49858 c 0.17676,-0.27423 0.32802,-0.55658 0.33605,-0.62747 0.008,-0.0709 -4.0904,-3.31746 -9.10767,-7.21451 l -9.12233,-7.08556 -22.32516,2.80507 -22.32514,2.80516 -7.37695,-5.62661 -7.37704,-5.62655 -0.40615,0.45065 -0.4062,0.45072 1.08457,0.96377 c 0.59651,0.53009 3.97203,3.20701 7.50113,5.9487 l 6.41707,4.98431 z"
           id="path749" /><path
           style="fill:#1a829f;fill-opacity:1;stroke-width:0.147729"
           d="m -646.55941,252.23516 c 2.44624,1.63829 5.13166,1.23062 7.12858,-1.08218 0.66617,-0.77156 0.7481,-0.82783 1.34756,-0.92549 0.55005,-0.0896 10.11882,0.49951 21.61372,1.33069 l 3.37856,0.24431 5.7786,6.70986 5.7786,6.70991 16.25027,1.21128 16.25025,1.2113 9.33769,10.84256 9.33769,10.84251 0.20064,-0.27638 c 0.1103,-0.15204 0.56089,-0.64756 1.0012,-1.10125 l 0.80056,-0.82488 -9.55689,-11.0971 -9.55692,-11.0971 -16.25025,-1.2113 -16.25029,-1.2113 -5.78194,-6.71374 -5.78192,-6.71377 -12.90163,-0.98173 c -7.0959,-0.53993 -13.16082,-1.05012 -13.47762,-1.13375 -0.54531,-0.14399 -0.59887,-0.19385 -1.0072,-0.93801 -0.52127,-0.94996 -1.30068,-1.70882 -2.33716,-2.27538 -1.08715,-0.5943 -2.16247,-0.71646 -3.42572,-0.38919 -0.95259,0.24679 -1.16734,0.36353 -2.01976,1.09762 -0.79357,0.68343 -1.01599,0.9602 -1.32387,1.64723 -0.67792,1.51294 -0.69534,2.89545 -0.0544,4.32182 0.39223,0.87296 0.72998,1.27325 1.52179,1.80336 z"
           id="path751" /><path
           style="fill:#1a829f;fill-opacity:1;stroke-width:0.147729"
           d="m -594.08318,319.43078 21.70605,6.15496 9.952,-5.51175 9.95204,-5.51176 0.2427,0.54127 c 0.13367,0.29762 0.24044,0.59964 0.2377,0.67094 -0.003,0.0714 -4.54363,2.66315 -10.09091,5.75953 l -10.08597,5.62986 -21.64745,-6.13751 -21.64741,-6.13762 -8.14065,4.45061 -8.14073,4.45054 -0.33356,-0.50673 -0.3336,-0.50681 1.21742,-0.78932 c 0.66959,-0.43414 4.40995,-2.57182 8.31195,-4.75031 l 7.09494,-3.9603 z"
           id="path753" /><path
           style="fill:#1a829f;fill-opacity:1;stroke-width:0.147729"
           d="m -640.61466,350.25717 c 2.61199,-1.35855 5.23607,-0.65725 6.96579,1.86164 0.57706,0.84028 0.65226,0.90526 1.2373,1.06843 0.53681,0.14971 10.11217,0.61932 21.62864,1.06074 l 3.38489,0.12972 6.48325,-6.03174 6.48324,-6.03179 16.28475,0.58798 16.28473,0.58798 10.47633,-9.74679 10.47633,-9.74673 0.16892,0.29681 c 0.0929,0.16329 0.48605,0.70548 0.87363,1.20497 l 0.70468,0.90816 -10.72226,9.97559 -10.7223,9.97561 -16.28473,-0.58797 -16.28476,-0.58799 -6.487,6.03524 -6.48697,6.03526 -12.93121,-0.44689 c -7.11216,-0.24581 -13.19635,-0.4075 -13.52044,-0.35931 -0.55788,0.083 -0.61668,0.12625 -1.10451,0.82122 -0.62284,0.88668 -1.48117,1.55498 -2.57381,2.00378 -1.14605,0.4708 -2.2282,0.47401 -3.44774,0.009 -0.91957,-0.35031 -1.12013,-0.49002 -1.8864,-1.31363 -0.71338,-0.76677 -0.90392,-1.06637 -1.13416,-1.78318 -0.50696,-1.57845 -0.37183,-2.95446 0.4225,-4.30146 0.48609,-0.82438 0.86592,-1.18498 1.71135,-1.62455 z"
           id="path755" /><path
           style="fill:#1a829f;fill-opacity:1;stroke-width:0.147729"
           d="m -529.4549,330.49502 c 0.0767,0.17571 0.29084,0.82691 0.47595,1.4471 l 0.33657,1.12762 -8.28889,7.22909 c -8.94197,7.79866 -8.44413,7.30526 -7.95938,7.88884 0.0866,0.10437 0.0725,0.61656 -0.0313,1.13838 -0.10384,0.5218 -0.95155,11.86828 -1.88374,25.21434 l -1.6949,24.26557 -26.04358,22.7137 -26.0436,22.71372 -0.54608,8.13832 c -0.30035,4.47606 -0.80617,11.35129 -1.124,15.2783 l -0.5779,7.13996 -12.46455,10.9449 c -6.85544,6.01975 -12.54416,11.0857 -12.64149,11.25786 -0.0973,0.17211 -0.10596,0.59622 -0.0192,0.94246 0.22209,0.88649 0.0517,2.89554 -0.31668,3.73347 -0.68859,1.56634 -1.83784,2.64191 -3.47298,3.25038 -1.11888,0.41635 -2.84522,0.32517 -4.1192,-0.21754 -0.80209,-0.34166 -1.0122,-0.50697 -1.83161,-1.44089 -0.84064,-0.95826 -0.95282,-1.15164 -1.2228,-2.1092 -0.37812,-1.3413 -0.28473,-2.70889 0.27225,-3.98633 0.39088,-0.89651 0.5451,-1.09765 1.4398,-1.87795 0.89539,-0.78091 1.1146,-0.90565 2.05982,-1.17214 1.4578,-0.411 2.82805,-0.3369 3.99428,0.21603 l 0.93787,0.4447 12.39262,-10.80813 12.3926,-10.8081 0.98002,-14.96819 0.98003,-14.9682 26.06622,-22.73343 26.06623,-22.73345 1.76482,-25.84572 1.76481,-25.8457 9.10934,-7.94464 9.10934,-7.94463 z"
           id="path757" /></g></clipPath></defs><script
     id="mesh_polyfill"
     type="text/javascript">
!function(){const t=&quot;http://www.w3.org/2000/svg&quot;,e=&quot;http://www.w3.org/1999/xlink&quot;,s=&quot;http://www.w3.org/1999/xhtml&quot;,r=2;if(document.createElementNS(t,&quot;meshgradient&quot;).x)return;const n=(t,e,s,r)=&gt;{let n=new x(.5*(e.x+s.x),.5*(e.y+s.y)),o=new x(.5*(t.x+e.x),.5*(t.y+e.y)),i=new x(.5*(s.x+r.x),.5*(s.y+r.y)),a=new x(.5*(n.x+o.x),.5*(n.y+o.y)),h=new x(.5*(n.x+i.x),.5*(n.y+i.y)),l=new x(.5*(a.x+h.x),.5*(a.y+h.y));return[[t,o,a,l],[l,h,i,r]]},o=t=&gt;{let e=t[0].distSquared(t[1]),s=t[2].distSquared(t[3]),r=.25*t[0].distSquared(t[2]),n=.25*t[1].distSquared(t[3]),o=e&gt;s?e:s,i=r&gt;n?r:n;return 18*(o&gt;i?o:i)},i=(t,e)=&gt;Math.sqrt(t.distSquared(e)),a=(t,e)=&gt;t.scale(2/3).add(e.scale(1/3)),h=t=&gt;{let e,s,r,n,o,i,a,h=new g;return t.match(/(\w+\(\s*[^)]+\))+/g).forEach(t=&gt;{let l=t.match(/[\w.-]+/g),d=l.shift();switch(d){case&quot;translate&quot;:2===l.length?e=new g(1,0,0,1,l[0],l[1]):(console.error(&quot;mesh.js: translate does not have 2 arguments!&quot;),e=new g(1,0,0,1,0,0)),h=h.append(e);break;case&quot;scale&quot;:1===l.length?s=new g(l[0],0,0,l[0],0,0):2===l.length?s=new g(l[0],0,0,l[1],0,0):(console.error(&quot;mesh.js: scale does not have 1 or 2 arguments!&quot;),s=new g(1,0,0,1,0,0)),h=h.append(s);break;case&quot;rotate&quot;:if(3===l.length&amp;&amp;(e=new g(1,0,0,1,l[1],l[2]),h=h.append(e)),l[0]){r=l[0]*Math.PI/180;let t=Math.cos(r),e=Math.sin(r);Math.abs(t)&lt;1e-16&amp;&amp;(t=0),Math.abs(e)&lt;1e-16&amp;&amp;(e=0),a=new g(t,e,-e,t,0,0),h=h.append(a)}else console.error(&quot;math.js: No argument to rotate transform!&quot;);3===l.length&amp;&amp;(e=new g(1,0,0,1,-l[1],-l[2]),h=h.append(e));break;case&quot;skewX&quot;:l[0]?(r=l[0]*Math.PI/180,n=Math.tan(r),o=new g(1,0,n,1,0,0),h=h.append(o)):console.error(&quot;math.js: No argument to skewX transform!&quot;);break;case&quot;skewY&quot;:l[0]?(r=l[0]*Math.PI/180,n=Math.tan(r),i=new g(1,n,0,1,0,0),h=h.append(i)):console.error(&quot;math.js: No argument to skewY transform!&quot;);break;case&quot;matrix&quot;:6===l.length?h=h.append(new g(...l)):console.error(&quot;math.js: Incorrect number of arguments for matrix!&quot;);break;default:console.error(&quot;mesh.js: Unhandled transform type: &quot;+d)}}),h},l=t=&gt;{let e=[],s=t.split(/[ ,]+/);for(let t=0,r=s.length-1;t&lt;r;t+=2)e.push(new x(parseFloat(s[t]),parseFloat(s[t+1])));return e},d=(t,e)=&gt;{for(let s in e)t.setAttribute(s,e[s])},c=(t,e,s,r,n)=&gt;{let o,i,a=[0,0,0,0];for(let h=0;h&lt;3;++h)e[h]&lt;t[h]&amp;&amp;e[h]&lt;s[h]||t[h]&lt;e[h]&amp;&amp;s[h]&lt;e[h]?a[h]=0:(a[h]=.5*((e[h]-t[h])/r+(s[h]-e[h])/n),o=Math.abs(3*(e[h]-t[h])/r),i=Math.abs(3*(s[h]-e[h])/n),a[h]&gt;o?a[h]=o:a[h]&gt;i&amp;&amp;(a[h]=i));return a},u=[[1,0,0,0,0,0,0,0,0,0,0,0,0,0,0,0],[0,0,0,0,1,0,0,0,0,0,0,0,0,0,0,0],[-3,3,0,0,-2,-1,0,0,0,0,0,0,0,0,0,0],[2,-2,0,0,1,1,0,0,0,0,0,0,0,0,0,0],[0,0,0,0,0,0,0,0,1,0,0,0,0,0,0,0],[0,0,0,0,0,0,0,0,0,0,0,0,1,0,0,0],[0,0,0,0,0,0,0,0,-3,3,0,0,-2,-1,0,0],[0,0,0,0,0,0,0,0,2,-2,0,0,1,1,0,0],[-3,0,3,0,0,0,0,0,-2,0,-1,0,0,0,0,0],[0,0,0,0,-3,0,3,0,0,0,0,0,-2,0,-1,0],[9,-9,-9,9,6,3,-6,-3,6,-6,3,-3,4,2,2,1],[-6,6,6,-6,-3,-3,3,3,-4,4,-2,2,-2,-2,-1,-1],[2,0,-2,0,0,0,0,0,1,0,1,0,0,0,0,0],[0,0,0,0,2,0,-2,0,0,0,0,0,1,0,1,0],[-6,6,6,-6,-4,-2,4,2,-3,3,-3,3,-2,-1,-2,-1],[4,-4,-4,4,2,2,-2,-2,2,-2,2,-2,1,1,1,1]],f=t=&gt;{let e=[];for(let s=0;s&lt;16;++s){e[s]=0;for(let r=0;r&lt;16;++r)e[s]+=u[s][r]*t[r]}return e},p=(t,e,s)=&gt;{const r=e*e,n=s*s,o=e*e*e,i=s*s*s;return t[0]+t[1]*e+t[2]*r+t[3]*o+t[4]*s+t[5]*s*e+t[6]*s*r+t[7]*s*o+t[8]*n+t[9]*n*e+t[10]*n*r+t[11]*n*o+t[12]*i+t[13]*i*e+t[14]*i*r+t[15]*i*o},y=t=&gt;{let e=[],s=[],r=[];for(let s=0;s&lt;4;++s)e[s]=[],e[s][0]=n(t[0][s],t[1][s],t[2][s],t[3][s]),e[s][1]=[],e[s][1].push(...n(...e[s][0][0])),e[s][1].push(...n(...e[s][0][1])),e[s][2]=[],e[s][2].push(...n(...e[s][1][0])),e[s][2].push(...n(...e[s][1][1])),e[s][2].push(...n(...e[s][1][2])),e[s][2].push(...n(...e[s][1][3]));for(let t=0;t&lt;8;++t){s[t]=[];for(let r=0;r&lt;4;++r)s[t][r]=[],s[t][r][0]=n(e[0][2][t][r],e[1][2][t][r],e[2][2][t][r],e[3][2][t][r]),s[t][r][1]=[],s[t][r][1].push(...n(...s[t][r][0][0])),s[t][r][1].push(...n(...s[t][r][0][1])),s[t][r][2]=[],s[t][r][2].push(...n(...s[t][r][1][0])),s[t][r][2].push(...n(...s[t][r][1][1])),s[t][r][2].push(...n(...s[t][r][1][2])),s[t][r][2].push(...n(...s[t][r][1][3]))}for(let t=0;t&lt;8;++t){r[t]=[];for(let e=0;e&lt;8;++e)r[t][e]=[],r[t][e][0]=s[t][0][2][e],r[t][e][1]=s[t][1][2][e],r[t][e][2]=s[t][2][2][e],r[t][e][3]=s[t][3][2][e]}return r};class x{constructor(t,e){this.x=t||0,this.y=e||0}toString(){return`(x=${this.x}, y=${this.y})`}clone(){return new x(this.x,this.y)}add(t){return new x(this.x+t.x,this.y+t.y)}scale(t){return void 0===t.x?new x(this.x*t,this.y*t):new x(this.x*t.x,this.y*t.y)}distSquared(t){let e=this.x-t.x,s=this.y-t.y;return e*e+s*s}transform(t){let e=this.x*t.a+this.y*t.c+t.e,s=this.x*t.b+this.y*t.d+t.f;return new x(e,s)}}class g{constructor(t,e,s,r,n,o){void 0===t?(this.a=1,this.b=0,this.c=0,this.d=1,this.e=0,this.f=0):(this.a=t,this.b=e,this.c=s,this.d=r,this.e=n,this.f=o)}toString(){return`affine: ${this.a} ${this.c} ${this.e} \n       ${this.b} ${this.d} ${this.f}`}append(t){t instanceof g||console.error(&quot;mesh.js: argument to Affine.append is not affine!&quot;);let e=this.a*t.a+this.c*t.b,s=this.b*t.a+this.d*t.b,r=this.a*t.c+this.c*t.d,n=this.b*t.c+this.d*t.d,o=this.a*t.e+this.c*t.f+this.e,i=this.b*t.e+this.d*t.f+this.f;return new g(e,s,r,n,o,i)}}class w{constructor(t,e){this.nodes=t,this.colors=e}paintCurve(t,e){if(o(this.nodes)&gt;r){const s=n(...this.nodes);let r=[[],[]],o=[[],[]];for(let t=0;t&lt;4;++t)r[0][t]=this.colors[0][t],r[1][t]=(this.colors[0][t]+this.colors[1][t])/2,o[0][t]=r[1][t],o[1][t]=this.colors[1][t];let i=new w(s[0],r),a=new w(s[1],o);i.paintCurve(t,e),a.paintCurve(t,e)}else{let s=Math.round(this.nodes[0].x);if(s&gt;=0&amp;&amp;s&lt;e){let r=4*(~~this.nodes[0].y*e+s);t[r]=Math.round(this.colors[0][0]),t[r+1]=Math.round(this.colors[0][1]),t[r+2]=Math.round(this.colors[0][2]),t[r+3]=Math.round(this.colors[0][3])}}}}class m{constructor(t,e){this.nodes=t,this.colors=e}split(){let t=[[],[],[],[]],e=[[],[],[],[]],s=[[[],[]],[[],[]]],r=[[[],[]],[[],[]]];for(let s=0;s&lt;4;++s){const r=n(this.nodes[0][s],this.nodes[1][s],this.nodes[2][s],this.nodes[3][s]);t[0][s]=r[0][0],t[1][s]=r[0][1],t[2][s]=r[0][2],t[3][s]=r[0][3],e[0][s]=r[1][0],e[1][s]=r[1][1],e[2][s]=r[1][2],e[3][s]=r[1][3]}for(let t=0;t&lt;4;++t)s[0][0][t]=this.colors[0][0][t],s[0][1][t]=this.colors[0][1][t],s[1][0][t]=(this.colors[0][0][t]+this.colors[1][0][t])/2,s[1][1][t]=(this.colors[0][1][t]+this.colors[1][1][t])/2,r[0][0][t]=s[1][0][t],r[0][1][t]=s[1][1][t],r[1][0][t]=this.colors[1][0][t],r[1][1][t]=this.colors[1][1][t];return[new m(t,s),new m(e,r)]}paint(t,e){let s,n=!1;for(let t=0;t&lt;4;++t)if((s=o([this.nodes[0][t],this.nodes[1][t],this.nodes[2][t],this.nodes[3][t]]))&gt;r){n=!0;break}if(n){let s=this.split();s[0].paint(t,e),s[1].paint(t,e)}else{new w([...this.nodes[0]],[...this.colors[0]]).paintCurve(t,e)}}}class b{constructor(t){this.readMesh(t),this.type=t.getAttribute(&quot;type&quot;)||&quot;bilinear&quot;}readMesh(t){let e=[[]],s=[[]],r=Number(t.getAttribute(&quot;x&quot;)),n=Number(t.getAttribute(&quot;y&quot;));e[0][0]=new x(r,n);let o=t.children;for(let t=0,r=o.length;t&lt;r;++t){e[3*t+1]=[],e[3*t+2]=[],e[3*t+3]=[],s[t+1]=[];let r=o[t].children;for(let n=0,o=r.length;n&lt;o;++n){let o=r[n].children;for(let r=0,i=o.length;r&lt;i;++r){let i=r;0!==t&amp;&amp;++i;let h,d=o[r].getAttribute(&quot;path&quot;),c=&quot;l&quot;;null!=d&amp;&amp;(c=(h=d.match(/\s*([lLcC])\s*(.*)/))[1]);let u=l(h[2]);switch(c){case&quot;l&quot;:0===i?(e[3*t][3*n+3]=u[0].add(e[3*t][3*n]),e[3*t][3*n+1]=a(e[3*t][3*n],e[3*t][3*n+3]),e[3*t][3*n+2]=a(e[3*t][3*n+3],e[3*t][3*n])):1===i?(e[3*t+3][3*n+3]=u[0].add(e[3*t][3*n+3]),e[3*t+1][3*n+3]=a(e[3*t][3*n+3],e[3*t+3][3*n+3]),e[3*t+2][3*n+3]=a(e[3*t+3][3*n+3],e[3*t][3*n+3])):2===i?(0===n&amp;&amp;(e[3*t+3][3*n+0]=u[0].add(e[3*t+3][3*n+3])),e[3*t+3][3*n+1]=a(e[3*t+3][3*n],e[3*t+3][3*n+3]),e[3*t+3][3*n+2]=a(e[3*t+3][3*n+3],e[3*t+3][3*n])):(e[3*t+1][3*n]=a(e[3*t][3*n],e[3*t+3][3*n]),e[3*t+2][3*n]=a(e[3*t+3][3*n],e[3*t][3*n]));break;case&quot;L&quot;:0===i?(e[3*t][3*n+3]=u[0],e[3*t][3*n+1]=a(e[3*t][3*n],e[3*t][3*n+3]),e[3*t][3*n+2]=a(e[3*t][3*n+3],e[3*t][3*n])):1===i?(e[3*t+3][3*n+3]=u[0],e[3*t+1][3*n+3]=a(e[3*t][3*n+3],e[3*t+3][3*n+3]),e[3*t+2][3*n+3]=a(e[3*t+3][3*n+3],e[3*t][3*n+3])):2===i?(0===n&amp;&amp;(e[3*t+3][3*n+0]=u[0]),e[3*t+3][3*n+1]=a(e[3*t+3][3*n],e[3*t+3][3*n+3]),e[3*t+3][3*n+2]=a(e[3*t+3][3*n+3],e[3*t+3][3*n])):(e[3*t+1][3*n]=a(e[3*t][3*n],e[3*t+3][3*n]),e[3*t+2][3*n]=a(e[3*t+3][3*n],e[3*t][3*n]));break;case&quot;c&quot;:0===i?(e[3*t][3*n+1]=u[0].add(e[3*t][3*n]),e[3*t][3*n+2]=u[1].add(e[3*t][3*n]),e[3*t][3*n+3]=u[2].add(e[3*t][3*n])):1===i?(e[3*t+1][3*n+3]=u[0].add(e[3*t][3*n+3]),e[3*t+2][3*n+3]=u[1].add(e[3*t][3*n+3]),e[3*t+3][3*n+3]=u[2].add(e[3*t][3*n+3])):2===i?(e[3*t+3][3*n+2]=u[0].add(e[3*t+3][3*n+3]),e[3*t+3][3*n+1]=u[1].add(e[3*t+3][3*n+3]),0===n&amp;&amp;(e[3*t+3][3*n+0]=u[2].add(e[3*t+3][3*n+3]))):(e[3*t+2][3*n]=u[0].add(e[3*t+3][3*n]),e[3*t+1][3*n]=u[1].add(e[3*t+3][3*n]));break;case&quot;C&quot;:0===i?(e[3*t][3*n+1]=u[0],e[3*t][3*n+2]=u[1],e[3*t][3*n+3]=u[2]):1===i?(e[3*t+1][3*n+3]=u[0],e[3*t+2][3*n+3]=u[1],e[3*t+3][3*n+3]=u[2]):2===i?(e[3*t+3][3*n+2]=u[0],e[3*t+3][3*n+1]=u[1],0===n&amp;&amp;(e[3*t+3][3*n+0]=u[2])):(e[3*t+2][3*n]=u[0],e[3*t+1][3*n]=u[1]);break;default:console.error(&quot;mesh.js: &quot;+c+&quot; invalid path type.&quot;)}if(0===t&amp;&amp;0===n||r&gt;0){let e=window.getComputedStyle(o[r]).stopColor.match(/^rgb\s*\(\s*(\d+)\s*,\s*(\d+)\s*,\s*(\d+)\s*\)$/i),a=window.getComputedStyle(o[r]).stopOpacity,h=255;a&amp;&amp;(h=Math.floor(255*a)),e&amp;&amp;(0===i?(s[t][n]=[],s[t][n][0]=Math.floor(e[1]),s[t][n][1]=Math.floor(e[2]),s[t][n][2]=Math.floor(e[3]),s[t][n][3]=h):1===i?(s[t][n+1]=[],s[t][n+1][0]=Math.floor(e[1]),s[t][n+1][1]=Math.floor(e[2]),s[t][n+1][2]=Math.floor(e[3]),s[t][n+1][3]=h):2===i?(s[t+1][n+1]=[],s[t+1][n+1][0]=Math.floor(e[1]),s[t+1][n+1][1]=Math.floor(e[2]),s[t+1][n+1][2]=Math.floor(e[3]),s[t+1][n+1][3]=h):3===i&amp;&amp;(s[t+1][n]=[],s[t+1][n][0]=Math.floor(e[1]),s[t+1][n][1]=Math.floor(e[2]),s[t+1][n][2]=Math.floor(e[3]),s[t+1][n][3]=h))}}e[3*t+1][3*n+1]=new x,e[3*t+1][3*n+2]=new x,e[3*t+2][3*n+1]=new x,e[3*t+2][3*n+2]=new x,e[3*t+1][3*n+1].x=(-4*e[3*t][3*n].x+6*(e[3*t][3*n+1].x+e[3*t+1][3*n].x)+-2*(e[3*t][3*n+3].x+e[3*t+3][3*n].x)+3*(e[3*t+3][3*n+1].x+e[3*t+1][3*n+3].x)+-1*e[3*t+3][3*n+3].x)/9,e[3*t+1][3*n+2].x=(-4*e[3*t][3*n+3].x+6*(e[3*t][3*n+2].x+e[3*t+1][3*n+3].x)+-2*(e[3*t][3*n].x+e[3*t+3][3*n+3].x)+3*(e[3*t+3][3*n+2].x+e[3*t+1][3*n].x)+-1*e[3*t+3][3*n].x)/9,e[3*t+2][3*n+1].x=(-4*e[3*t+3][3*n].x+6*(e[3*t+3][3*n+1].x+e[3*t+2][3*n].x)+-2*(e[3*t+3][3*n+3].x+e[3*t][3*n].x)+3*(e[3*t][3*n+1].x+e[3*t+2][3*n+3].x)+-1*e[3*t][3*n+3].x)/9,e[3*t+2][3*n+2].x=(-4*e[3*t+3][3*n+3].x+6*(e[3*t+3][3*n+2].x+e[3*t+2][3*n+3].x)+-2*(e[3*t+3][3*n].x+e[3*t][3*n+3].x)+3*(e[3*t][3*n+2].x+e[3*t+2][3*n].x)+-1*e[3*t][3*n].x)/9,e[3*t+1][3*n+1].y=(-4*e[3*t][3*n].y+6*(e[3*t][3*n+1].y+e[3*t+1][3*n].y)+-2*(e[3*t][3*n+3].y+e[3*t+3][3*n].y)+3*(e[3*t+3][3*n+1].y+e[3*t+1][3*n+3].y)+-1*e[3*t+3][3*n+3].y)/9,e[3*t+1][3*n+2].y=(-4*e[3*t][3*n+3].y+6*(e[3*t][3*n+2].y+e[3*t+1][3*n+3].y)+-2*(e[3*t][3*n].y+e[3*t+3][3*n+3].y)+3*(e[3*t+3][3*n+2].y+e[3*t+1][3*n].y)+-1*e[3*t+3][3*n].y)/9,e[3*t+2][3*n+1].y=(-4*e[3*t+3][3*n].y+6*(e[3*t+3][3*n+1].y+e[3*t+2][3*n].y)+-2*(e[3*t+3][3*n+3].y+e[3*t][3*n].y)+3*(e[3*t][3*n+1].y+e[3*t+2][3*n+3].y)+-1*e[3*t][3*n+3].y)/9,e[3*t+2][3*n+2].y=(-4*e[3*t+3][3*n+3].y+6*(e[3*t+3][3*n+2].y+e[3*t+2][3*n+3].y)+-2*(e[3*t+3][3*n].y+e[3*t][3*n+3].y)+3*(e[3*t][3*n+2].y+e[3*t+2][3*n].y)+-1*e[3*t][3*n].y)/9}}this.nodes=e,this.colors=s}paintMesh(t,e){let s=(this.nodes.length-1)/3,r=(this.nodes[0].length-1)/3;if(&quot;bilinear&quot;===this.type||s&lt;2||r&lt;2){let n;for(let o=0;o&lt;s;++o)for(let s=0;s&lt;r;++s){let r=[];for(let t=3*o,e=3*o+4;t&lt;e;++t)r.push(this.nodes[t].slice(3*s,3*s+4));let i=[];i.push(this.colors[o].slice(s,s+2)),i.push(this.colors[o+1].slice(s,s+2)),(n=new m(r,i)).paint(t,e)}}else{let n,o,a,h,l,d,u;const x=s,g=r;s++,r++;let w=new Array(s);for(let t=0;t&lt;s;++t){w[t]=new Array(r);for(let e=0;e&lt;r;++e)w[t][e]=[],w[t][e][0]=this.nodes[3*t][3*e],w[t][e][1]=this.colors[t][e]}for(let t=0;t&lt;s;++t)for(let e=0;e&lt;r;++e)0!==t&amp;&amp;t!==x&amp;&amp;(n=i(w[t-1][e][0],w[t][e][0]),o=i(w[t+1][e][0],w[t][e][0]),w[t][e][2]=c(w[t-1][e][1],w[t][e][1],w[t+1][e][1],n,o)),0!==e&amp;&amp;e!==g&amp;&amp;(n=i(w[t][e-1][0],w[t][e][0]),o=i(w[t][e+1][0],w[t][e][0]),w[t][e][3]=c(w[t][e-1][1],w[t][e][1],w[t][e+1][1],n,o));for(let t=0;t&lt;r;++t){w[0][t][2]=[],w[x][t][2]=[];for(let e=0;e&lt;4;++e)n=i(w[1][t][0],w[0][t][0]),o=i(w[x][t][0],w[x-1][t][0]),w[0][t][2][e]=n&gt;0?2*(w[1][t][1][e]-w[0][t][1][e])/n-w[1][t][2][e]:0,w[x][t][2][e]=o&gt;0?2*(w[x][t][1][e]-w[x-1][t][1][e])/o-w[x-1][t][2][e]:0}for(let t=0;t&lt;s;++t){w[t][0][3]=[],w[t][g][3]=[];for(let e=0;e&lt;4;++e)n=i(w[t][1][0],w[t][0][0]),o=i(w[t][g][0],w[t][g-1][0]),w[t][0][3][e]=n&gt;0?2*(w[t][1][1][e]-w[t][0][1][e])/n-w[t][1][3][e]:0,w[t][g][3][e]=o&gt;0?2*(w[t][g][1][e]-w[t][g-1][1][e])/o-w[t][g-1][3][e]:0}for(let s=0;s&lt;x;++s)for(let r=0;r&lt;g;++r){let n=i(w[s][r][0],w[s+1][r][0]),o=i(w[s][r+1][0],w[s+1][r+1][0]),c=i(w[s][r][0],w[s][r+1][0]),x=i(w[s+1][r][0],w[s+1][r+1][0]),g=[[],[],[],[]];for(let t=0;t&lt;4;++t){(d=[])[0]=w[s][r][1][t],d[1]=w[s+1][r][1][t],d[2]=w[s][r+1][1][t],d[3]=w[s+1][r+1][1][t],d[4]=w[s][r][2][t]*n,d[5]=w[s+1][r][2][t]*n,d[6]=w[s][r+1][2][t]*o,d[7]=w[s+1][r+1][2][t]*o,d[8]=w[s][r][3][t]*c,d[9]=w[s+1][r][3][t]*x,d[10]=w[s][r+1][3][t]*c,d[11]=w[s+1][r+1][3][t]*x,d[12]=0,d[13]=0,d[14]=0,d[15]=0,u=f(d);for(let e=0;e&lt;9;++e){g[t][e]=[];for(let s=0;s&lt;9;++s)g[t][e][s]=p(u,e/8,s/8),g[t][e][s]&gt;255?g[t][e][s]=255:g[t][e][s]&lt;0&amp;&amp;(g[t][e][s]=0)}}h=[];for(let t=3*s,e=3*s+4;t&lt;e;++t)h.push(this.nodes[t].slice(3*r,3*r+4));l=y(h);for(let s=0;s&lt;8;++s)for(let r=0;r&lt;8;++r)(a=new m(l[s][r],[[[g[0][s][r],g[1][s][r],g[2][s][r],g[3][s][r]],[g[0][s][r+1],g[1][s][r+1],g[2][s][r+1],g[3][s][r+1]]],[[g[0][s+1][r],g[1][s+1][r],g[2][s+1][r],g[3][s+1][r]],[g[0][s+1][r+1],g[1][s+1][r+1],g[2][s+1][r+1],g[3][s+1][r+1]]]])).paint(t,e)}}}transform(t){if(t instanceof x)for(let e=0,s=this.nodes.length;e&lt;s;++e)for(let s=0,r=this.nodes[0].length;s&lt;r;++s)this.nodes[e][s]=this.nodes[e][s].add(t);else if(t instanceof g)for(let e=0,s=this.nodes.length;e&lt;s;++e)for(let s=0,r=this.nodes[0].length;s&lt;r;++s)this.nodes[e][s]=this.nodes[e][s].transform(t)}scale(t){for(let e=0,s=this.nodes.length;e&lt;s;++e)for(let s=0,r=this.nodes[0].length;s&lt;r;++s)this.nodes[e][s]=this.nodes[e][s].scale(t)}}document.querySelectorAll(&quot;rect,circle,ellipse,path,text&quot;).forEach((r,n)=&gt;{let o=r.getAttribute(&quot;id&quot;);o||(o=&quot;patchjs_shape&quot;+n,r.setAttribute(&quot;id&quot;,o));const i=r.style.fill.match(/^url\(\s*&quot;?\s*#([^\s&quot;]+)&quot;?\s*\)/),a=r.style.stroke.match(/^url\(\s*&quot;?\s*#([^\s&quot;]+)&quot;?\s*\)/);if(i&amp;&amp;i[1]){const a=document.getElementById(i[1]);if(a&amp;&amp;&quot;meshgradient&quot;===a.nodeName){const i=r.getBBox();let l=document.createElementNS(s,&quot;canvas&quot;);d(l,{width:i.width,height:i.height});const c=l.getContext(&quot;2d&quot;);let u=c.createImageData(i.width,i.height);const f=new b(a);&quot;objectBoundingBox&quot;===a.getAttribute(&quot;gradientUnits&quot;)&amp;&amp;f.scale(new x(i.width,i.height));const p=a.getAttribute(&quot;gradientTransform&quot;);null!=p&amp;&amp;f.transform(h(p)),&quot;userSpaceOnUse&quot;===a.getAttribute(&quot;gradientUnits&quot;)&amp;&amp;f.transform(new x(-i.x,-i.y)),f.paintMesh(u.data,l.width),c.putImageData(u,0,0);const y=document.createElementNS(t,&quot;image&quot;);d(y,{width:i.width,height:i.height,x:i.x,y:i.y});let g=l.toDataURL();y.setAttributeNS(e,&quot;xlink:href&quot;,g),r.parentNode.insertBefore(y,r),r.style.fill=&quot;none&quot;;const w=document.createElementNS(t,&quot;use&quot;);w.setAttributeNS(e,&quot;xlink:href&quot;,&quot;#&quot;+o);const m=&quot;patchjs_clip&quot;+n,M=document.createElementNS(t,&quot;clipPath&quot;);M.setAttribute(&quot;id&quot;,m),M.appendChild(w),r.parentElement.insertBefore(M,r),y.setAttribute(&quot;clip-path&quot;,&quot;url(#&quot;+m+&quot;)&quot;),u=null,l=null,g=null}}if(a&amp;&amp;a[1]){const o=document.getElementById(a[1]);if(o&amp;&amp;&quot;meshgradient&quot;===o.nodeName){const i=parseFloat(r.style.strokeWidth.slice(0,-2))*(parseFloat(r.style.strokeMiterlimit)||parseFloat(r.getAttribute(&quot;stroke-miterlimit&quot;))||1),a=r.getBBox(),l=Math.trunc(a.width+i),c=Math.trunc(a.height+i),u=Math.trunc(a.x-i/2),f=Math.trunc(a.y-i/2);let p=document.createElementNS(s,&quot;canvas&quot;);d(p,{width:l,height:c});const y=p.getContext(&quot;2d&quot;);let g=y.createImageData(l,c);const w=new b(o);&quot;objectBoundingBox&quot;===o.getAttribute(&quot;gradientUnits&quot;)&amp;&amp;w.scale(new x(l,c));const m=o.getAttribute(&quot;gradientTransform&quot;);null!=m&amp;&amp;w.transform(h(m)),&quot;userSpaceOnUse&quot;===o.getAttribute(&quot;gradientUnits&quot;)&amp;&amp;w.transform(new x(-u,-f)),w.paintMesh(g.data,p.width),y.putImageData(g,0,0);const M=document.createElementNS(t,&quot;image&quot;);d(M,{width:l,height:c,x:0,y:0});let S=p.toDataURL();M.setAttributeNS(e,&quot;xlink:href&quot;,S);const k=&quot;pattern_clip&quot;+n,A=document.createElementNS(t,&quot;pattern&quot;);d(A,{id:k,patternUnits:&quot;userSpaceOnUse&quot;,width:l,height:c,x:u,y:f}),A.appendChild(M),o.parentNode.appendChild(A),r.style.stroke=&quot;url(#&quot;+k+&quot;)&quot;,g=null,p=null,S=null}}})}();
</script><g
     inkscape:groupmode="layer"
     id="layer1"
     inkscape:label="Capa"
     style="display:inline"
     transform="translate(6.0025319,-41.081586)"><path
       id="path4186"
       style="fill:#000000;stroke-width:0.834783"
       d="m 295.53683,47.301141 c -35.83412,-0.411071 -37.51702,34.520163 -29.98047,51.814454 8.43802,19.362895 19.24219,21.798825 19.24219,21.798825 0,0 23.56897,6.2636 33.2168,13.22852 8.61461,6.21902 19.36527,22.2711 21.47266,25.47851 -75.07225,56.31268 -110.20417,151.281 -112.87891,242.96485 -6.30533,45.1455 0.17031,91.76444 -10.55859,136.1582 -43.92287,61.53634 -62.87841,137.30223 -66.54493,212.04492 -1.36328,64.22027 -7.44979,140.23655 42.11524,189.51953 32.85754,-17.92805 56.78784,-77.84352 79.10156,-116.12109 18.41287,41.0772 42.25492,80.14783 73.49219,112.76758 36.95585,24.24335 8.09203,72.40036 26.42187,105.43946 13.75148,-0.2456 57.47748,-43.20976 74.66016,-1.6152 35.629,29.6046 -17.50029,-59.25595 27.40039,-22.4531 44.25587,22.0092 5.28664,-31.19693 -12.39258,-38.02937 11.4722,-18.22655 68.28771,-8.84634 94.65625,-9.09179 25.86161,21.36293 56.65274,43.87666 88.43945,49.54686 -4.82155,-22.91083 -1.00193,-40.72458 23.69727,-22.77538 45.81914,-4.36599 -57.48379,-39.91666 -2.72656,-48.51172 62.42664,-25.36064 106.97636,-84.18656 119.64648,-149.80664 10.43476,-18.09828 2.21644,-105.03484 27.05664,-53.72851 12.43807,39.035 39.95289,7.49415 31.08594,-18.65235 -8.31778,-87.97814 -47.83179,-169.36177 -86.61133,-247.47265 -27.43289,-35.12914 27.48525,-56.12242 48.14453,-76.24414 6.36087,-34.27671 -19.63142,-91.39765 -46.38867,-122.98633 -20.72046,-98.31344 -113.63248,-178.97403 -215.1582,-177.92969 -65.50637,-3.872861 -133.39507,8.32043 -187.95703,46.23047 -1.18968,-2.44683 -9.76388,-19.5747 -22.26367,-29.4375 -9.33124,-7.3627 -33.21485,-15.20703 -33.21485,-15.20703 0,0 24.73047,-7.902452 24.73047,-24.529298 0,-16.626845 -13.58378,-32.236113 -27.9043,-32.400391 z"
       inkscape:label="Sombra" /></g></svg>
