<?xml version="1.0" encoding="UTF-8" standalone="no"?>
<!-- Created with Inkscape (http://www.inkscape.org/) -->

<svg
   width="865"
   height="306"
   viewBox="0 0 228.86458 80.962502"
   version="1.1"
   id="svg5"
   inkscape:version="1.1 (c4e8f9e, 2021-05-24)"
   sodipodi:docname="LPI.svg"
   xmlns:inkscape="http://www.inkscape.org/namespaces/inkscape"
   xmlns:sodipodi="http://sodipodi.sourceforge.net/DTD/sodipodi-0.dtd"
   xmlns="http://www.w3.org/2000/svg"
   xmlns:svg="http://www.w3.org/2000/svg">
  <sodipodi:namedview
     id="namedview7"
     pagecolor="#505050"
     bordercolor="#eeeeee"
     borderopacity="1"
     inkscape:pageshadow="0"
     inkscape:pageopacity="0"
     inkscape:pagecheckerboard="0"
     inkscape:document-units="mm"
     showgrid="false"
     inkscape:zoom="0.45255331"
     inkscape:cx="564.57437"
     inkscape:cy="2.2096844"
     inkscape:window-width="1360"
     inkscape:window-height="740"
     inkscape:window-x="0"
     inkscape:window-y="0"
     inkscape:window-maximized="1"
     inkscape:current-layer="layer1"
     units="px"
     width="871px" />
  <defs
     id="defs2" />
  <g
     inkscape:label="Capa 1"
     inkscape:groupmode="layer"
     id="layer1">
    <g
       id="g1424"
       transform="matrix(1.5268168,0,0,1.5268168,-25.837264,-60.585889)">
      <path
         style="fill:#febe01;stroke-width:0.0846667"
         d="m 41.291352,92.551821 -0.296333,-0.03538 -1.016,-0.131735 -1.016,-0.131735 -1.006,-0.211255 L 36.951018,91.830458 35.94916,91.539312 34.947302,91.248166 33.961545,90.86718 32.97579,90.486194 31.947738,89.994082 30.919685,89.501971 30.115352,89.026312 29.311019,88.550652 28.578958,88.058213 27.846897,87.565774 26.929384,86.846108 26.011871,86.126441 24.781455,84.898774 23.55104,83.671108 22.906036,82.866774 22.261031,82.062441 21.741528,81.316013 21.222025,80.569585 20.72689,79.749679 20.231755,78.929774 19.7655,77.998441 l -0.466256,-0.931333 -0.472829,-1.185334 -0.47283,-1.185333 -0.305816,-1.058333 -0.305817,-1.058334 -0.24046,-1.185333 -0.240458,-1.185333 -0.113342,-0.804334 -0.11334,-0.804333 0.0052,-2.497667 0.0052,-2.497667 0.190236,-1.227666 0.190236,-1.227667 0.208357,-0.889 0.208359,-0.889 0.221733,-0.762 0.221732,-0.762 0.37993,-1.016 0.379929,-1.016 0.534355,-1.111739 0.534355,-1.11174 0.547308,-0.92026 0.547308,-0.920261 0.569957,-0.804333 0.569958,-0.804334 0.714432,-0.869328 0.714434,-0.86933 0.966172,-0.966171 0.966172,-0.966172 0.869329,-0.709559 0.869329,-0.709559 0.737424,-0.527413 0.737423,-0.527413 0.998243,-0.593057 0.998243,-0.593058 0.931334,-0.451728 0.931333,-0.451728 0.979232,-0.386224 0.979231,-0.386223 0.968102,-0.29289 0.968102,-0.29289 0.973666,-0.217347 0.973667,-0.217347 0.846667,-0.125566 0.846666,-0.125566 1.058334,-0.09168 1.058333,-0.09168 1.185333,0.01525 1.185334,0.01525 0.889,0.07404 0.889,0.07404 1.035344,0.166912 1.035345,0.166911 0.884076,0.208893 0.884075,0.208894 1.086247,0.351425 1.086246,0.351423 0.931334,0.381612 0.931333,0.381612 0.816919,0.409798 0.816918,0.409798 0.749415,0.441867 0.749415,0.441868 0.677333,0.46288 0.677333,0.462881 0.889,0.686215 0.889,0.686214 1.397072,1.397072 1.397072,1.397071 0.684573,0.889 0.684574,0.889 0.380511,0.550595 0.380511,0.550595 0.537778,0.888739 0.537778,0.888738 0.568417,1.185333 0.568416,1.185334 0.390396,1.079744 0.390397,1.079745 0.248209,0.867589 0.24821,0.867588 0.208583,1.016 0.208584,1.016 0.09578,0.719667 0.09578,0.719667 0.06907,0.846666 0.06907,0.846667 0.0165,0.983954 0.0165,0.983953 -0.09271,1.132714 -0.09271,1.132713 -0.172921,1.100666 -0.172921,1.100667 -0.166867,0.719667 -0.166867,0.719666 -0.297441,1.004325 -0.297441,1.004324 -0.45628,1.137094 -0.45628,1.137094 -0.61596,1.202915 -0.615959,1.202915 -0.820627,1.227667 -0.820626,1.227666 -0.571087,0.719667 -0.571086,0.719667 -1.487658,1.486702 -1.487659,1.486702 -1.143,0.851878 -1.143,0.851877 -0.594782,0.379154 -0.594783,0.379154 -1.013884,0.559512 -1.013884,0.559512 -1.016,0.43721 -1.016,0.437211 -1.354667,0.447793 -1.354667,0.447792 -1.013333,0.225861 -1.013334,0.225861 -1.103332,0.170064 -1.103334,0.170063 -2.243667,0.02687 -2.243666,0.02688 z m 4.275667,-6.722977 0.762,-0.08454 0.919705,-0.173147 0.919705,-0.173147 0.985295,-0.296756 0.985295,-0.296756 0.997546,-0.426032 0.997545,-0.426031 0.780455,-0.428403 0.780454,-0.428403 0.846667,-0.573963 0.846666,-0.573963 0.804334,-0.672397 0.804333,-0.672397 0.683422,-0.713043 0.683422,-0.713041 0.537288,-0.673859 0.537289,-0.673858 0.527184,-0.804334 0.527184,-0.804333 0.427742,-0.804333 0.427742,-0.804334 0.270773,-0.635 0.270772,-0.635 0.290011,-0.846666 0.290011,-0.846667 0.199934,-0.846667 0.199935,-0.846666 0.140734,-0.889 0.140734,-0.889 0.02873,-1.735667 0.02873,-1.735667 -0.120724,-0.889 -0.120725,-0.889 -0.176797,-0.875559 -0.176798,-0.875558 -0.298125,-0.941488 -0.298125,-0.941486 -0.412794,-0.962031 -0.412794,-0.962031 -0.436731,-0.776924 -0.436731,-0.776923 -0.584578,-0.860819 -0.584578,-0.860817 -0.806948,-0.938955 -0.806949,-0.938954 -0.861783,-0.763347 -0.861783,-0.763347 -0.762,-0.545225 -0.762,-0.545226 -0.88546,-0.528463 -0.88546,-0.528463 -0.89254,-0.397838 -0.89254,-0.397836 -0.85347,-0.29667 -0.85347,-0.29667 -0.882197,-0.213784 -0.882197,-0.213784 -0.931333,-0.152999 -0.931333,-0.152998 -1.989667,0.0016 -1.989667,0.0016 -0.931333,0.15057 -0.931333,0.150571 -1.140753,0.296301 -1.140753,0.296301 -0.960205,0.375446 -0.960206,0.375448 -0.904708,0.463089 -0.904709,0.463088 -0.889,0.580038 -0.889,0.580038 -0.852447,0.686829 -0.852446,0.686831 -0.90508,0.944523 -0.905081,0.944525 -0.643004,0.861039 -0.643004,0.861041 -0.526627,0.889 -0.526628,0.889 -0.32025,0.677333 -0.320252,0.677333 -0.235053,0.592667 -0.235053,0.592667 -0.271584,0.846666 -0.271585,0.846667 -0.206438,1.010561 -0.206438,1.010562 -0.08088,0.767438 -0.08088,0.767439 -0.0015,1.498497 -0.0015,1.498497 0.130892,0.99917 0.130893,0.99917 0.13081,0.592666 0.13081,0.592667 0.246501,0.86 0.246502,0.860001 0.38529,0.960332 0.385291,0.960334 0.426434,0.804333 0.426435,0.804333 0.636687,0.96044 0.636689,0.960439 0.613501,0.732895 0.613501,0.732893 0.922382,0.892523 0.922382,0.892523 0.681079,0.516187 0.681079,0.516187 0.734139,0.478536 0.734139,0.478536 0.965851,0.494158 0.965851,0.494159 0.878598,0.338126 0.878598,0.338125 0.762,0.21689 0.762,0.216889 0.677333,0.135977 0.677334,0.135976 0.846666,0.115047 0.846667,0.115046 1.524,0.008 1.524,0.008 0.762,-0.08454 z m -13.316967,-6.625411 0.0372,-0.188992 3.923206,-14.710834 3.923205,-14.710833 h 3.28818 3.28818 v 0.132445 0.132445 l -0.589471,2.217055 -0.589473,2.217055 -2.416194,9.174941 -2.416195,9.17494 v 0.03256 0.03256 h 7.874 7.874 l -0.0024,0.0635 -0.0024,0.0635 -0.872881,3.259667 -0.87288,3.259667 -11.241636,0.01966 -11.241637,0.01966 0.0372,-0.188992 z M 51.017027,59.371045 50.625035,59.245584 50.215981,58.970012 49.806927,58.694441 49.446155,58.24965 49.085383,57.80486 48.90307,57.204635 48.720758,56.60441 l 0.0395,-0.615423 0.03949,-0.615424 0.254306,-0.540894 0.254308,-0.540895 0.367269,-0.365313 0.367268,-0.365313 0.34648,-0.203051 0.346481,-0.203051 0.546945,-0.140121 0.546945,-0.14012 0.503133,0.05259 0.503132,0.05259 0.582003,0.268262 0.582002,0.268261 0.454153,0.490541 0.454155,0.490541 0.189496,0.489761 0.189496,0.489761 0.0082,0.762 0.0082,0.762 -0.27034,0.570717 -0.27034,0.570717 -0.408827,0.408828 -0.408827,0.408828 -0.506155,0.242575 -0.506153,0.242576 -0.762,0.02558 -0.762,0.02558 -0.391992,-0.125462 z M 96.74802,87.481108 v -0.04233 h 0.04233 0.04233 v 0.04233 0.04233 h -0.04233 -0.04233 z m 18.37267,0 v -0.04233 h 0.0423 0.0423 v 0.04233 0.04233 h -0.0423 -0.0423 z m 22.26733,0 v -0.04233 h 0.0423 0.0423 v 0.04233 0.04233 h -0.0423 -0.0423 z m -41.402,-0.08467 v -0.04233 h 0.04233 0.04233 v 0.04233 0.04233 h -0.04233 -0.04233 z m 9.31333,0 v -0.04233 h 0.0423 0.0423 v 0.04233 0.04233 h -0.0423 -0.0423 z m 9.22867,0 v -0.04233 h 0.0423 0.0423 v 0.04233 0.04233 h -0.0423 -0.0423 z m 16.93333,0 v -0.04233 h 0.0423 0.0423 v 0.04233 0.04233 h -0.0423 -0.0423 z m -50.376664,-0.08467 v -0.04233 h 0.04233 0.04233 v 0.04233 0.04233 h -0.04233 -0.04233 z m 6.688667,0 v -0.04233 h 0.04233 0.04233 v 0.04233 0.04233 h -0.04233 -0.04233 z m 20.404667,0 v -0.04233 h 0.0423 0.0423 v 0.04233 0.04233 h -0.0423 -0.0423 z m 14.13933,0 v -0.04233 h 0.0423 0.0423 v 0.04233 0.04233 h -0.0423 -0.0423 z m 3.048,0 v -0.04233 h 0.0423 0.0423 v 0.04233 0.04233 h -0.0423 -0.0423 z m 6.43467,0 v -0.04233 h 0.0423 0.0423 v 0.04233 0.04233 h -0.0423 -0.0423 z m -36.491333,-0.08467 v -0.04233 h 0.04233 0.04233 v 0.04233 0.04233 h -0.04233 -0.04233 z m 34.036003,0 v -0.04233 h 0.0423 0.0423 v 0.04233 0.04233 h -0.0423 -0.0423 z m -34.290003,-0.08467 v -0.04233 h 0.04233 0.04233 v 0.04233 0.04233 h -0.04233 -0.04233 z m 21.928663,0 v -0.04233 h 0.0423 0.0423 v 0.04233 0.04233 h -0.0423 -0.0423 z m 15.494,-0.08467 v -0.04233 h 0.0423 0.0423 v 0.04233 0.04233 h -0.0423 -0.0423 z m 7.366,0 v -0.04233 h 0.0423 0.0423 v 0.04233 0.04233 h -0.0423 -0.0423 z M 98.949353,86.888441 v -0.04233 h 0.04233 0.04233 v 0.04233 0.04233 h -0.04233 -0.04233 z m 3.640667,-0.08467 v -0.04233 h 0.0423 0.0423 v 0.04233 0.04233 h -0.0423 -0.0423 z m 20.701,-0.127 0.0523,-0.08467 h 0.0423 0.0423 l -0.0523,0.08467 -0.0523,0.08467 h -0.0423 -0.0423 z m 11.811,-0.04233 v -0.04233 h 0.0423 0.0423 v 0.04233 0.04233 h -0.0423 -0.0423 z M 99.457353,86.211108 v -0.04233 h 0.04233 0.04233 v 0.04233 0.04233 h -0.04233 -0.04233 z m 35.221337,0 v -0.04233 h 0.0423 0.0423 v 0.04233 0.04233 h -0.0423 -0.0423 z m 3.72533,-0.08467 v -0.04233 h 0.0423 0.0423 v 0.04233 0.04233 h -0.0423 -0.0423 z m -42.164,-0.08467 v -0.04233 h 0.04233 0.04233 v 0.04233 0.04233 h -0.04233 -0.04233 z m 25.908,0 v -0.04233 h 0.0423 0.0423 v 0.04233 0.04233 h -0.0423 -0.0423 z m 16.764,0 v -0.04233 h 0.0423 0.0423 v 0.04233 0.04233 h -0.0423 -0.0423 z m -33.61267,-0.08467 v -0.04233 h 0.0423 0.0423 v 0.04233 0.04233 h -0.0423 -0.0423 z m 10.07534,0 v -0.04233 h 0.0423 0.0423 v 0.04233 0.04233 h -0.0423 -0.0423 z m 3.72533,0 v -0.04233 h 0.0423 0.0423 v 0.04233 0.04233 h -0.0423 -0.0423 z m 2.37067,0 v -0.04233 h 0.0423 0.0423 v 0.04233 0.04233 h -0.0423 -0.0423 z m 9.99066,0 v -0.04233 h 0.0423 0.0423 v 0.04233 0.04233 h -0.0423 -0.0423 z m -14.986,-0.08467 v -0.04233 h 0.0423 0.0423 v 0.04233 0.04233 h -0.0423 -0.0423 z m -18.71133,-0.08467 v -0.04233 h 0.04233 0.04233 v 0.04233 0.04233 h -0.04233 -0.04233 z m 19.13467,-0.08467 v -0.04233 h 0.0423 0.0423 v 0.04233 0.04233 h -0.0423 -0.0423 z m 2.11666,0 v -0.04233 h 0.0423 0.0423 v 0.04233 0.04233 h -0.0423 -0.0423 z m -1.94733,-0.08467 v -0.04233 h 0.0423 0.0423 v 0.04233 0.04233 h -0.0423 -0.0423 z m 19.304,-0.08467 v -0.04233 h 0.0423 0.0423 v 0.04233 0.04233 h -0.0423 -0.0423 z m -38.523333,-0.08467 v -0.04233 h 0.04233 0.04233 v 0.04233 0.04233 h -0.04233 -0.04233 z m 4.148663,0 v -0.04233 h 0.0423 0.0423 v 0.04233 0.04233 h -0.0423 -0.0423 z m 34.036,-0.423334 v -0.04233 h 0.0423 0.0423 v 0.04233 0.04233 h -0.0423 -0.0423 z M 96.917353,84.687108 v -0.04233 h 0.04233 0.04233 v 0.04233 0.04233 h -0.04233 -0.04233 z m -0.169333,-0.08467 v -0.04233 h 0.04233 0.04233 v 0.04233 0.04233 h -0.04233 -0.04233 z m -0.169333,-0.08467 v -0.04233 h 0.04233 0.04233 v 0.04233 0.04233 h -0.04233 -0.04233 z m 2.878666,0 v -0.04233 h 0.04233 0.04233 v 0.04233 0.04233 h -0.04233 -0.04233 z m -3.048,-0.08467 v -0.04233 h 0.04233 0.04233 v 0.04233 0.04233 h -0.04233 -0.04233 z m -0.169333,-0.08467 v -0.04233 h 0.04233 0.04233 v 0.04233 0.04233 h -0.04233 -0.04233 z m -0.169333,-0.08467 v -0.04233 h 0.04233 0.04233 v 0.04233 0.04233 h -0.04233 -0.04233 z m -0.169334,-0.08467 v -0.04233 h 0.04233 0.04233 v 0.04233 0.04233 h -0.04233 -0.04233 z m 38.015337,-0.677334 v -0.04233 h 0.0423 0.0423 v 0.04233 0.04233 h -0.0423 -0.0423 z m -36.40667,-0.508 v -0.04233 h 0.04233 0.04233 v 0.04233 0.04233 h -0.04233 -0.04233 z m -0.169333,-0.08467 v -0.04233 h 0.04233 0.04233 v 0.04233 0.04233 h -0.04233 -0.04233 z m 36.660663,0 v -0.04233 h 0.0423 0.0423 v 0.04233 0.04233 h -0.0423 -0.0423 z m 1.94734,-0.254 v -0.04233 h 0.0423 0.0423 v 0.04233 0.04233 h -0.0423 -0.0423 z m -39.624003,-0.42331 v -0.04233 h 0.04233 0.04233 v 0.04233 0.04233 h -0.04233 -0.04233 z m 37.930663,-0.08467 v -0.04233 h 0.0423 0.0423 v 0.04233 0.04233 h -0.0423 -0.0423 z m 1.94734,0 v -0.04233 h 0.0423 0.0423 v 0.04233 0.04233 h -0.0423 -0.0423 z m 2.37066,-0.08467 v -0.04233 h 0.0423 0.0423 v 0.04233 0.04233 h -0.0423 -0.0423 z m -48.42933,-0.08467 v -0.04233 h 0.04233 0.04233 v 0.04233 0.04233 h -0.04233 -0.04233 z m 4.402667,-0.08467 v -0.04233 h 0.04233 0.04233 v 0.04233 0.04233 h -0.04233 -0.04233 z m 3.725333,-0.08467 v -0.04233 h 0.04233 0.04233 v 0.04233 0.04233 h -0.04233 -0.04233 z m -9.228667,-0.08467 v -0.04233 h 0.04233 0.04233 v 0.04233 0.04233 h -0.04233 -0.04233 z m 7.450667,0 v -0.04233 h 0.04233 0.04233 v 0.04233 0.04233 h -0.04233 -0.04233 z m 1.524,0 v -0.04233 h 0.04233 0.04233 v 0.04233 0.04233 h -0.04233 -0.04233 z m 38.862,-0.08467 v -0.04233 h 0.0423 0.0423 v 0.04233 0.04233 h -0.0423 -0.0423 z m -2.07433,-0.296334 0.0523,-0.08467 h 0.0423 0.0423 l -0.0523,0.08467 -0.0523,0.08467 h -0.0423 -0.0423 z m -33.655,-0.127 v -0.04233 h 0.0423 0.0423 v 0.04233 0.04233 h -0.0423 -0.0423 z m -9.313337,-0.08467 v -0.04233 h 0.04233 0.04233 v 0.04233 0.04233 h -0.04233 -0.04233 z m 35.559997,0.01037 v -0.03197 l 0.14817,-0.116201 0.14817,-0.116199 -0.1162,0.148166 -0.1162,0.148167 h -0.032 -0.032 z m 7.62,-0.01037 v -0.04233 h 0.0423 0.0423 v 0.04233 0.04233 h -0.0423 -0.0423 z m -33.61266,-0.169334 v -0.04233 h 0.0423 0.0423 v 0.04233 0.04233 h -0.0423 -0.0423 z m 11.176,-0.338666 v -0.04233 h 0.0423 0.0423 v 0.04233 0.04233 h -0.0423 -0.0423 z m 26.416,0 v -0.04233 h 0.0423 0.0423 v 0.04233 0.04233 h -0.0423 -0.0423 z m -0.16934,-0.08467 v -0.04233 h 0.0423 0.0423 v 0.04233 0.04233 h -0.0423 -0.0423 z m -26.07733,-0.08467 v -0.04233 h 0.0423 0.0423 v 0.04233 0.04233 h -0.0423 -0.0423 z M 98.102687,80.36907 v -0.04233 h 0.04233 0.04233 v 0.04233 0.04233 h -0.04233 -0.04233 z m 40.216663,0 v -0.04233 h 0.0423 0.0423 v 0.04233 0.04233 h -0.0423 -0.0423 z m -1.35466,-0.08467 v -0.04233 h 0.0423 0.0423 v 0.04233 0.04233 h -0.0423 -0.0423 z m -8.08567,-0.719667 0.15325,-0.169333 h 0.0423 0.0423 l -0.15324,0.169333 -0.15325,0.169334 h -0.0423 -0.0423 z m -26.20433,0.04233 v -0.04233 h 0.0423 0.0423 v 0.04233 0.04233 h -0.0423 -0.0423 z m 5.92666,-0.423334 v -0.04233 h 0.0423 0.0423 v 0.04233 0.04233 h -0.0423 -0.0423 z m 5.37634,-0.04233 0.0523,-0.08467 h 0.0423 0.0423 l -0.0523,0.08467 -0.0523,0.08467 h -0.0423 -0.0423 z m -5.79967,-0.381 v -0.04233 h 0.0423 0.0423 v 0.04233 0.04233 h -0.0423 -0.0423 z m -0.0847,-0.846667 v -0.04233 h 0.0423 0.0423 v 0.04233 0.04233 h -0.0423 -0.0423 z m -7.874,-6.604 v -0.04233 h 0.0423 0.0423 v 0.04233 0.04233 h -0.0423 -0.0423 z m 28.448,0 v -0.04233 h 0.0423 0.0423 v 0.04233 0.04233 h -0.0423 -0.0423 z m -7.874,-0.169333 v -0.04233 h 0.0423 0.0423 v 0.04233 0.04233 h -0.0423 -0.0423 z m 19.72734,0 v -0.04233 h 0.0423 0.0423 v 0.04233 0.04233 h -0.0423 -0.0423 z m 18.71133,0 v -0.04233 h 0.0423 0.0423 v 0.04233 0.04233 h -0.0423 -0.0423 z m -45.88933,-0.08467 v -0.04233 h 0.0423 0.0423 v 0.04233 0.04233 h -0.0423 -0.0423 z m 49.19133,0 v -0.04233 h 0.0423 0.0423 v 0.04233 0.04233 h -0.0423 -0.0423 z m -35.39067,-0.08467 v -0.04233 h 0.0423 0.0423 v 0.04233 0.04233 h -0.0423 -0.0423 z m -28.447997,-0.08467 v -0.04233 h 0.04233 0.04233 v 0.04233 0.04233 h -0.04233 -0.04233 z m 61.383337,-0.169333 v -0.04233 h 0.0423 0.0423 v 0.04233 0.04233 h -0.0423 -0.0423 z m -61.80667,-0.08467 v -0.04233 h 0.04233 0.04233 v 0.04233 0.04233 h -0.04233 -0.04233 z m 61.976,0 v -0.04233 h 0.0423 0.0423 v 0.04233 0.04233 h -0.0423 -0.0423 z m -3.72533,-0.254 v -0.04233 h 0.0423 0.0423 v 0.04233 0.04233 h -0.0423 -0.0423 z m -58.724422,-0.140082 -0.06041,-0.09775 0.09775,0.06041 0.09775,0.06041 v 0.03734 0.03734 h -0.03734 -0.03734 z m 14.308662,0 -0.0604,-0.09775 0.0978,0.06041 0.0977,0.06041 v 0.03734 0.03734 h -0.0373 -0.0373 z m -8.58558,-0.02925 v -0.04233 h 0.0423 0.0423 v 0.04233 0.04233 h -0.0423 -0.0423 z m 52.91667,0 v -0.04233 h 0.0423 0.0423 v 0.04233 0.04233 h -0.0423 -0.0423 z m 6.18067,-0.254 v -0.04233 h 0.0423 0.0423 v 0.04233 0.04233 h -0.0423 -0.0423 z m -46.39734,-0.08467 v -0.04233 h 0.0423 0.0423 v 0.04233 0.04233 h -0.0423 -0.0423 z m -16.340663,-0.08467 v -0.04233 h 0.04233 0.04233 v 0.04233 0.04233 h -0.04233 -0.04233 z m 1.524003,0 v -0.04233 h 0.0423 0.0423 v 0.04233 0.04233 h -0.0423 -0.0423 z m 19.72733,0 v -0.04233 h 0.0423 0.0423 v 0.04233 0.04233 h -0.0423 -0.0423 z m 6.858,0 v -0.04233 h 0.0423 0.0423 v 0.04233 0.04233 h -0.0423 -0.0423 z m -28.278667,-0.08467 v -0.04233 h 0.04233 0.04233 v 0.04233 0.04233 h -0.04233 -0.04233 z m 21.166667,0 v -0.04233 h 0.0423 0.0423 v 0.04233 0.04233 h -0.0423 -0.0423 z m 39.20067,0 v -0.04233 h 0.0423 0.0423 v 0.04233 0.04233 h -0.0423 -0.0423 z m -58.25067,-0.158967 v -0.03197 l 0.14817,-0.116201 0.14816,-0.1162 -0.11619,0.148167 -0.11621,0.148167 h -0.032 -0.032 z m 28.10933,-0.01037 v -0.04233 h 0.0423 0.0423 v 0.04233 0.04233 h -0.0423 -0.0423 z m -12.7,-0.08467 v -0.04233 h 0.0423 0.0423 v 0.04233 0.04233 h -0.0423 -0.0423 z m 28.02467,0 v -0.04233 h 0.0423 0.0423 v 0.04233 0.04233 h -0.0423 -0.0423 z m -41.148,-0.08467 v -0.04233 h 0.0423 0.0423 v 0.04233 0.04233 h -0.0423 -0.0423 z m 16.002,0 v -0.04233 h 0.0423 0.0423 v 0.04233 0.04233 h -0.0423 -0.0423 z m 20.32,-0.08467 v -0.04233 h 0.0423 0.0423 v 0.04233 0.04233 h -0.0423 -0.0423 z m 4.91067,0 v -0.04233 h 0.0423 0.0423 v 0.04233 0.04233 h -0.0423 -0.0423 z m 11.00666,-0.08467 v -0.04233 h 0.0423 0.0423 v 0.04233 0.04233 h -0.0423 -0.0423 z m -44.958,-0.08467 v -0.04233 h 0.0423 0.0423 v 0.04233 0.04233 h -0.0423 -0.0423 z m 11.34534,-0.254 v -0.04233 h 0.0423 0.0423 v 0.04233 0.04233 h -0.0423 -0.0423 z m -20.40467,-0.08467 v -0.04233 h 0.0423 0.0423 v 0.04233 0.04233 h -0.0423 -0.0423 z m 35.814,0 v -0.04233 h 0.0423 0.0423 v 0.04233 0.04233 h -0.0423 -0.0423 z m 20.32,-0.08467 v -0.04233 h 0.0423 0.0423 v 0.04233 0.04233 h -0.0423 -0.0423 z m -61.552667,-0.08467 v -0.04233 h 0.04233 0.04233 v 0.04233 0.04233 h -0.04233 -0.04233 z m 32.257997,0 v -0.04233 h 0.0423 0.0423 v 0.04233 0.04233 h -0.0423 -0.0423 z m 10.922,0 v -0.04233 h 0.0423 0.0423 v 0.04233 0.04233 h -0.0423 -0.0423 z m -18.11866,-0.169333 v -0.04233 h 0.0423 0.0423 v 0.04233 0.04233 h -0.0423 -0.0423 z m -0.16934,-0.08467 v -0.04233 h 0.0423 0.0423 v 0.04233 0.04233 h -0.0423 -0.0423 z m 16.256,0 v -0.04233 h 0.0423 0.0423 v 0.04233 0.04233 h -0.0423 -0.0423 z m -16.42533,-0.08467 v -0.04233 h 0.0423 0.0423 v 0.04233 0.04233 h -0.0423 -0.0423 z m -8.55133,-0.08467 v -0.04233 h 0.0423 0.0423 v 0.04233 0.04233 h -0.0423 -0.0423 z m 15.24,0 v -0.04233 h 0.0423 0.0423 v 0.04233 0.04233 h -0.0423 -0.0423 z m 28.61733,-0.08467 v -0.04233 h 0.0423 0.0423 v 0.04233 0.04233 h -0.0423 -0.0423 z m 2.54,0 v -0.04233 h 0.0423 0.0423 v 0.04233 0.04233 h -0.0423 -0.0423 z m -55.03333,-0.08467 v -0.04233 h 0.0423 0.0423 v 0.04233 0.04233 h -0.0423 -0.0423 z m -7.620003,-0.08467 v -0.04233 h 0.04233 0.04233 v 0.04233 0.04233 h -0.04233 -0.04233 z m 63.076663,0 v -0.04233 h 0.0423 0.0423 v 0.04233 0.04233 h -0.0423 -0.0423 z m -2.286,-0.254 v -0.04233 h 0.0423 0.0423 v 0.04233 0.04233 h -0.0423 -0.0423 z M 120.36999,67.49966 v -0.04233 h 0.0423 0.0423 v 0.04233 0.04233 h -0.0423 -0.0423 z m 19.64267,-0.338666 v -0.04233 h 0.0423 0.0423 v 0.04233 0.04233 h -0.0423 -0.0423 z m 3.64066,-0.08467 v -0.04233 h 0.0423 0.0423 v 0.04233 0.04233 h -0.0423 -0.0423 z m -51.138663,-0.08467 v -0.04233 h 0.04233 0.04233 v 0.04233 0.04233 h -0.04233 -0.04233 z m 37.253333,-0.08467 v -0.04233 h 0.0423 0.0423 v 0.04233 0.04233 h -0.0423 -0.0423 z m -44.196,-0.08467 v -0.04233 h 0.04233 0.04233 v 0.04233 0.04233 h -0.04233 -0.04233 z m 7.027333,0 v -0.04233 h 0.04233 0.04233 v 0.04233 0.04233 h -0.04233 -0.04233 z m 30.141337,0 v -0.04233 h 0.0423 0.0423 v 0.04233 0.04233 h -0.0423 -0.0423 z m -0.16934,-0.08467 v -0.04233 h 0.0423 0.0423 v 0.04233 0.04233 h -0.0423 -0.0423 z m 4.14867,0 v -0.04233 h 0.0423 0.0423 v 0.04233 0.04233 h -0.0423 -0.0423 z m 16.84867,0 v -0.04233 h 0.0423 0.0423 v 0.04233 0.04233 h -0.0423 -0.0423 z m -32.258,-0.169333 v -0.04233 h 0.0423 0.0423 v 0.04233 0.04233 h -0.0423 -0.0423 z m 10.922,0 v -0.04233 h 0.0423 0.0423 v 0.04233 0.04233 h -0.0423 -0.0423 z m -23.19867,-0.08467 v -0.04233 h 0.04233 0.04233 v 0.04233 0.04233 h -0.04233 -0.04233 z m 20.74333,0 v -0.04233 h 0.0423 0.0423 v 0.04233 0.04233 h -0.0423 -0.0423 z m 18.45734,-0.08467 v -0.04233 h 0.0423 0.0423 v 0.04233 0.04233 h -0.0423 -0.0423 z m -43.180003,-0.08467 v -0.04233 h 0.04233 0.04233 v 0.04233 0.04233 h -0.04233 -0.04233 z m 54.864003,0 v -0.04233 h 0.0423 0.0423 v 0.04233 0.04233 h -0.0423 -0.0423 z m 10.24466,-0.08467 v -0.04233 h 0.0423 0.0423 v 0.04233 0.04233 h -0.0423 -0.0423 z m -64.769997,-0.08467 v -0.04233 h 0.04233 0.04233 v 0.04233 0.04233 h -0.04233 -0.04233 z m 56.895997,0 v -0.04233 h 0.0423 0.0423 v 0.04233 0.04233 h -0.0423 -0.0423 z m -57.657997,-0.08467 v -0.04233 h 0.04233 0.04233 v 0.04233 0.04233 h -0.04233 -0.04233 z m 26.923997,0 v -0.04233 h 0.0423 0.0423 v 0.04233 0.04233 h -0.0423 -0.0423 z m 18.96534,0 v -0.04233 h 0.0423 0.0423 v 0.04233 0.04233 h -0.0423 -0.0423 z m -46.05867,-0.08467 v -0.04233 h 0.04233 0.04233 v 0.04233 0.04233 h -0.04233 -0.04233 z m -0.254,-0.08467 v -0.04233 h 0.04233 0.04233 v 0.04233 0.04233 h -0.04233 -0.04233 z m 7.62,0 v -0.04233 h 0.0423 0.0423 v 0.04233 0.04233 h -0.0423 -0.0423 z m 38.862,0 v -0.04233 h 0.0423 0.0423 v 0.04233 0.04233 h -0.0423 -0.0423 z m 9.652,0 v -0.04233 h 0.0423 0.0423 v 0.04233 0.04233 h -0.0423 -0.0423 z m 1.72758,-0.05542 -0.0604,-0.09775 0.0978,0.06041 0.0977,0.06041 v 0.03734 0.03734 h -0.0373 -0.0373 z m 5.55375,0.05542 v -0.04233 h 0.0423 0.0423 v 0.04233 0.04233 h -0.0423 -0.0423 z m 2.32025,-0.05542 -0.0604,-0.09775 0.0977,0.06041 0.0977,0.06041 v 0.03734 0.03734 h -0.0373 -0.0373 z m 2.08242,0.05542 v -0.04233 h 0.0423 0.0423 v 0.04233 0.04233 h -0.0423 -0.0423 z M 87.688686,65.721774 v -0.04233 h 0.04233 0.04233 v 0.04233 0.04233 h -0.04233 -0.04233 z m 13.885334,0 v -0.04233 h 0.0423 0.0423 v 0.04233 0.04233 h -0.0423 -0.0423 z m 52.578,0 v -0.04233 h 0.0423 0.0423 v 0.04233 0.04233 h -0.0423 -0.0423 z m -32.512,-0.08467 v -0.04233 h 0.0423 0.0423 v 0.04233 0.04233 h -0.0423 -0.0423 z m 30.14133,0 v -0.04233 h 0.0423 0.0423 v 0.04233 0.04233 h -0.0423 -0.0423 z m -0.762,-0.08467 v -0.04233 h 0.0423 0.0423 v 0.04233 0.04233 h -0.0423 -0.0423 z m 8.21267,0 v -0.04233 h 0.0423 0.0423 v 0.04233 0.04233 h -0.0423 -0.0423 z m -45.04267,-0.08467 v -0.04233 h 0.0423 0.0423 v 0.04233 0.04233 h -0.0423 -0.0423 z m 15.57867,0 v -0.04233 h 0.0423 0.0423 v 0.04233 0.04233 h -0.0423 -0.0423 z m 15.15533,0 v -0.04233 h 0.0423 0.0423 v 0.04233 0.04233 h -0.0423 -0.0423 z m -6.096,-0.08467 v -0.04233 h 0.0423 0.0423 v 0.04233 0.04233 h -0.0423 -0.0423 z m -12.02266,-0.08467 v -0.04233 h 0.0423 0.0423 v 0.04233 0.04233 h -0.0423 -0.0423 z m 12.446,-0.338667 v -0.04233 h 0.0423 0.0423 v 0.04233 0.04233 h -0.0423 -0.0423 z m 5.16466,0 v -0.04233 h 0.0423 0.0423 v 0.04233 0.04233 h -0.0423 -0.0423 z M 93.022687,64.790441 v -0.04233 h 0.04233 0.04233 v 0.04233 0.04233 h -0.04233 -0.04233 z m 34.374663,-0.169334 v -0.04233 h 0.0423 0.0423 v 0.04233 0.04233 h -0.0423 -0.0423 z m 12.36134,0 v -0.04233 h 0.0423 0.0423 v 0.04233 0.04233 h -0.0423 -0.0423 z m -46.482003,-0.08467 v -0.04233 h 0.04233 0.04233 v 0.04233 0.04233 h -0.04233 -0.04233 z m 60.028663,0 v -0.04233 h 0.0423 0.0423 v 0.04233 0.04233 h -0.0423 -0.0423 z m -32.512,-0.08467 v -0.04233 h 0.0423 0.0423 v 0.04233 0.04233 h -0.0423 -0.0423 z m 3.302,0 v -0.04233 h 0.0423 0.0423 v 0.04233 0.04233 h -0.0423 -0.0423 z m 16.002,0 v -0.04233 h 0.0423 0.0423 v 0.04233 0.04233 h -0.0423 -0.0423 z m 3.47134,0 v -0.04233 h 0.0423 0.0423 v 0.04233 0.04233 h -0.0423 -0.0423 z m -44.450003,-0.08467 v -0.04233 h 0.04233 0.04233 v 0.04233 0.04233 h -0.04233 -0.04233 z m 3.048003,0 v -0.04233 h 0.0423 0.0423 v 0.04233 0.04233 h -0.0423 -0.0423 z m 13.88533,0 v -0.04233 h 0.0423 0.0423 v 0.04233 0.04233 h -0.0423 -0.0423 z m 4.91067,0 v -0.04233 h 0.0423 0.0423 v 0.04233 0.04233 h -0.0423 -0.0423 z m 29.718,0 v -0.04233 h 0.0423 0.0423 v 0.04233 0.04233 h -0.0423 -0.0423 z m -51.308003,-0.08467 v -0.04233 h 0.04233 0.04233 v 0.04233 0.04233 h -0.04233 -0.04233 z m 2.540003,0 v -0.04233 h 0.0423 0.0423 v 0.04233 0.04233 h -0.0423 -0.0423 z m 58.674,0 v -0.04233 h 0.0423 0.0423 v 0.04233 0.04233 h -0.0423 -0.0423 z m -60.875337,-0.08467 v -0.04233 h 0.04233 0.04233 v 0.04233 0.04233 h -0.04233 -0.04233 z m 14.054667,0 v -0.04233 h 0.0423 0.0423 v 0.04233 0.04233 h -0.0423 -0.0423 z m -19.558,-0.08467 v -0.04233 h 0.04233 0.04233 v 0.04233 0.04233 h -0.04233 -0.04233 z m 35.306,0 v -0.04233 h 0.0423 0.0423 v 0.04233 0.04233 h -0.0423 -0.0423 z M 88.281353,63.266441 v -0.04233 h 0.04233 0.04233 v 0.04233 0.04233 h -0.04233 -0.04233 z m 46.905337,-0.169334 v -0.04233 h 0.0423 0.0423 v 0.04233 0.04233 h -0.0423 -0.0423 z m -26.416,-0.08467 v -0.04233 h 0.0423 0.0423 v 0.04233 0.04233 h -0.0423 -0.0423 z m 27.00866,-0.423334 v -0.04233 h 0.0423 0.0423 v 0.04233 0.04233 h -0.0423 -0.0423 z m -1.94733,-0.254 v -0.04233 h 0.0423 0.0423 v 0.04233 0.04233 h -0.0423 -0.0423 z m -26.75467,-0.08467 v -0.04233 h 0.0423 0.0423 v 0.04233 0.04233 h -0.0423 -0.0423 z m 0.42334,-0.677334 v -0.04233 h 0.0423 0.0423 v 0.04233 0.04233 h -0.0423 -0.0423 z m 26.75466,-0.338666 v -0.04233 h 0.0423 0.0423 v 0.04233 0.04233 h -0.0423 -0.0423 z m -47.582664,-0.08467 v -0.04233 h 0.04233 0.04233 v 0.04233 0.04233 h -0.04233 -0.04233 z m -0.762,-0.254 v -0.04233 h 0.04233 0.04233 v 0.04233 0.04233 h -0.04233 -0.04233 z m 20.404664,-5.842 v -0.04233 h 0.0423 0.0423 v 0.04233 0.04233 h -0.0423 -0.0423 z m 13.03867,-0.254 v -0.04233 h 0.0423 0.0423 v 0.04233 0.04233 h -0.0423 -0.0423 z m -12.192,-0.08467 v -0.04233 h 0.0423 0.0423 v 0.04233 0.04233 h -0.0423 -0.0423 z m 9.82133,-0.08467 v -0.04233 h 0.0423 0.0423 v 0.04233 0.04233 h -0.0423 -0.0423 z m -9.56733,-0.08467 v -0.04233 h 0.0423 0.0423 v 0.04233 0.04233 h -0.0423 -0.0423 z m 6.604,-0.08467 v -0.04233 h 0.0423 0.0423 v 0.04233 0.04233 h -0.0423 -0.0423 z m 4.91067,-0.169333 v -0.04233 h 0.0423 0.0423 v 0.04233 0.04233 h -0.0423 -0.0423 z m -15.15534,-0.254 v -0.04233 h 0.0423 0.0423 v 0.04233 0.04233 h -0.0423 -0.0423 z m 8.636,-0.254 v -0.04233 h 0.0423 0.0423 v 0.04233 0.04233 h -0.0423 -0.0423 z m 2.20134,-0.08467 v -0.04233 h 0.0423 0.0423 v 0.04233 0.04233 h -0.0423 -0.0423 z m 1.60866,0 v -0.04233 h 0.0423 0.0423 v 0.04233 0.04233 h -0.0423 -0.0423 z m 2.20134,0 v -0.04233 h 0.0423 0.0423 v 0.04233 0.04233 h -0.0423 -0.0423 z m -14.90134,-0.169333 v -0.04233 h 0.0423 0.0423 v 0.04233 0.04233 h -0.0423 -0.0423 z m 9.22867,-0.169333 v -0.04233 h 0.0423 0.0423 v 0.04233 0.04233 h -0.0423 -0.0423 z m 5.16467,-0.254 v -0.04233 h 0.0423 0.0423 v 0.04233 0.04233 h -0.0423 -0.0423 z m -2.45534,-0.338667 v -0.04233 h 0.0423 0.0423 v 0.04233 0.04233 h -0.0423 -0.0423 z m -12.10733,-0.169333 v -0.04233 h 0.0423 0.0423 v 0.04233 0.04233 h -0.0423 -0.0423 z m 14.13933,0 v -0.04233 h 0.0423 0.0423 v 0.04233 0.04233 h -0.0423 -0.0423 z m -12.27666,-0.08467 v -0.04233 h 0.0423 0.0423 v 0.04233 0.04233 h -0.0423 -0.0423 z m 8.29733,-0.08467 v -0.04233 h 0.0423 0.0423 v 0.04233 0.04233 h -0.0423 -0.0423 z m 0.33867,-0.423333 v -0.04233 h 0.0423 0.0423 v 0.04233 0.04233 h -0.0423 -0.0423 z m 3.13266,0 v -0.04233 h 0.0423 0.0423 v 0.04233 0.04233 h -0.0423 -0.0423 z m -0.42333,-0.508 v -0.04233 h 0.0423 0.0423 v 0.04233 0.04233 h -0.0423 -0.0423 z m -2.96333,-0.931333 v -0.04233 h 0.0423 0.0423 v 0.04233 0.04233 h -0.0423 -0.0423 z m 3.81,-0.254 v -0.04233 h 0.0423 0.0423 v 0.04233 0.04233 h -0.0423 -0.0423 z m -4.23334,-0.254 v -0.04233 h 0.0423 0.0423 v 0.04233 0.04233 h -0.0423 -0.0423 z m 2.37067,-0.08467 v -0.04233 h 0.0423 0.0423 v 0.04233 0.04233 h -0.0423 -0.0423 z m -0.762,-0.592667 v -0.04233 h 0.0423 0.0423 v 0.04233 0.04233 h -0.0423 -0.0423 z m -16.933333,-0.08467 v -0.04233 h 0.04233 0.04233 v 0.04233 0.04233 h -0.04233 -0.04233 z m 16.594663,-0.338667 v -0.04233 h 0.0423 0.0423 v 0.04233 0.04233 h -0.0423 -0.0423 z m -13.97,-0.08467 v -0.04233 h 0.0423 0.0423 v 0.04233 0.04233 h -0.0423 -0.0423 z m 13.63134,-0.338666 v -0.04233 h 0.0423 0.0423 v 0.04233 0.04233 h -0.0423 -0.0423 z m 2.54,0 v -0.04233 h 0.0423 0.0423 v 0.04233 0.04233 h -0.0423 -0.0423 z m -4.826,-0.08467 v -0.04233 h 0.0423 0.0423 v 0.04233 0.04233 h -0.0423 -0.0423 z m 1.94733,-0.338667 v -0.04233 h 0.0423 0.0423 v 0.04233 0.04233 h -0.0423 -0.0423 z m -3.97933,-0.08467 v -0.04233 h 0.0423 0.0423 v 0.04233 0.04233 h -0.0423 -0.0423 z m -18.034004,-1.524 v -0.04233 h 0.04233 0.04233 v 0.04233 0.04233 h -0.04233 -0.04233 z m -0.423333,-1.608667 v -0.04233 h 0.04233 0.04233 v 0.04233 0.04233 h -0.04233 -0.04233 z"
         id="path1428" />
      <path
         style="fill:#1a2221;stroke-width:0.0846667"
         d="m 95.968783,87.429747 -0.559655,-0.07227 -0.541012,-0.192625 -0.541011,-0.192625 -0.02434,-0.782725 -0.02435,-0.782725 h 0.04889 0.04889 l 0.352382,0.179775 0.352392,0.179775 0.461822,0.158891 0.461832,0.158893 h 0.498949 0.498949 l 0.239039,-0.12361 0.239031,-0.123609 0.05197,-0.193891 0.05198,-0.19389 -0.153459,-0.20802 -0.153458,-0.20802 -1.090007,-0.574935 -1.089999,-0.574934 -0.289755,-0.275379 -0.289754,-0.275379 -0.157133,-0.338667 -0.157142,-0.338666 -0.0014,-0.296334 -0.0014,-0.296333 0.09062,-0.326365 0.09062,-0.326364 0.340139,-0.369008 0.34014,-0.369009 0.453467,-0.169662 0.453457,-0.169661 0.533476,-0.0527 0.533468,-0.0527 0.611294,0.12948 0.611301,0.129482 0.383532,0.169657 0.38354,0.169656 v 0.724427 0.724428 h -0.03355 -0.03355 l -0.65482,-0.310974 -0.654829,-0.310973 -0.656015,-0.03798 -0.656014,-0.03798 -0.179612,0.179617 -0.179679,0.179616 v 0.163568 0.163568 l 0.232833,0.163898 0.232833,0.163899 0.879992,0.476632 0.879991,0.476631 0.370857,0.303885 0.370849,0.303887 0.17791,0.348722 0.177901,0.34872 -0.0028,0.511795 -0.0028,0.511795 -0.13208,0.308264 -0.132071,0.308265 -0.266505,0.266505 -0.266506,0.266506 -0.31866,0.162568 -0.31866,0.162568 -0.539386,0.08752 -0.539394,0.08752 -0.127,-0.01007 -0.127,-0.01007 -0.559655,-0.07227 z m 7.622587,0.0098 -0.38773,-0.06727 -0.33194,-0.170997 -0.33193,-0.170997 -0.27087,-0.282586 -0.27087,-0.282586 -0.14925,-0.338667 -0.14924,-0.338667 -0.0323,-1.9685 -0.0323,-1.9685 h -0.50008 -0.50008 v -0.191865 -0.191866 l 1.3655,-1.459134 1.36549,-1.459135 h 0.0738 0.0738 v 0.931334 0.931333 h 1.18533 1.18534 v 0.719667 0.719666 h -1.18534 -1.18533 v 1.65372 1.653719 l 0.12033,0.287991 0.12033,0.28799 0.25647,0.132623 0.25646,0.132624 0.36404,-0.002 0.36404,-0.002 0.508,-0.209265 0.508,-0.209265 0.0245,-4.24e-4 0.0245,-4.23e-4 -0.0245,0.740833 -0.0245,0.740834 -0.55034,0.180955 -0.55033,0.180956 -0.46567,0.04357 -0.46566,0.04357 -0.38774,-0.06728 z m 10.84862,-0.0099 -0.46112,-0.07889 -0.36151,-0.211859 -0.36151,-0.211859 -0.22446,-0.294273 -0.22445,-0.294275 -0.11336,-0.317672 -0.11337,-0.317671 -0.004,-1.926167 -0.004,-1.926167 h -0.55033 -0.55033 l 0.003,-0.1905 0.003,-0.1905 1.36504,-1.439333 1.36504,-1.439333 h 0.0924 0.0924 l 0.024,0.910166 0.024,0.910167 h 1.18589 1.1859 l -0.0246,0.6985 -0.0246,0.6985 -1.16416,0.02356 -1.16417,0.02356 v 1.784077 1.784078 l 0.29923,0.299226 0.29922,0.299226 0.52628,-0.04472 0.52627,-0.04472 0.40217,-0.175299 0.40216,-0.175299 v 0.748374 0.748374 l -0.5715,0.176136 -0.5715,0.176137 -0.42333,0.03867 -0.42333,0.03867 -0.46112,-0.07889 z m 6.12055,0.0093 -0.35189,-0.07323 -0.33751,-0.172184 -0.3375,-0.172183 -0.30084,-0.351458 -0.30083,-0.351458 -0.14863,-0.392295 -0.14861,-0.392296 -0.0309,-2.561166 -0.0309,-2.561167 h 0.93692 0.93692 v 2.284286 2.284287 l 0.13663,0.341472 0.13664,0.341472 0.26174,0.186384 0.26176,0.186385 h 0.44529 0.44529 l 0.36158,-0.254122 0.36157,-0.254123 0.19175,-0.284541 0.19175,-0.284542 V 82.68492 80.411441 h 0.93229 0.93228 l -0.0221,3.450167 -0.0221,3.450166 -0.91017,0.02403 -0.91017,0.02403 v -0.426197 -0.426198 h -0.0505 -0.0505 l -0.37955,0.334097 -0.37956,0.334097 -0.39544,0.129182 -0.39544,0.129181 -0.33866,0.03905 -0.33867,0.03905 z m 9.19283,6.78e-4 -0.38773,-0.06728 -0.33194,-0.170997 -0.33193,-0.170997 -0.27087,-0.282586 -0.27087,-0.282586 -0.14925,-0.338666 -0.14924,-0.338667 -0.0323,-1.9685 -0.0323,-1.9685 h -0.50008 -0.50008 v -0.192525 -0.192526 l 1.34658,-1.43461 1.34658,-1.434612 0.0927,-0.03092 0.0928,-0.03092 v 0.938389 0.938389 h 1.18533 1.18534 v 0.719666 0.719667 h -1.18534 -1.18533 v 1.653719 1.65372 l 0.12033,0.28799 0.12033,0.28799 0.25647,0.132624 0.25646,0.132624 0.36404,-0.002 0.36404,-0.002 0.508,-0.209264 0.508,-0.209266 0.0245,-4.23e-4 0.0245,-4.23e-4 -0.0245,0.740833 -0.0245,0.740833 -0.55034,0.180956 -0.55033,0.180955 -0.46567,0.04357 -0.46566,0.04357 -0.38774,-0.06728 z m 6.87795,-0.0051 -0.53711,-0.07184 -0.52644,-0.246353 -0.52645,-0.246354 -0.43123,-0.431224 -0.43122,-0.431222 -0.21736,-0.459468 -0.21736,-0.459467 -0.0935,-0.602883 -0.0935,-0.602884 0.0949,-0.611451 0.0949,-0.611452 0.2204,-0.491125 0.22041,-0.491126 0.53224,-0.497883 0.53223,-0.497883 0.45018,-0.167552 0.45017,-0.167552 0.51374,-0.05884 0.51374,-0.05884 0.54459,0.0982 0.5446,0.0982 0.49393,0.262571 0.49393,0.262571 0.28694,0.35017 0.28693,0.350169 0.21169,0.462378 0.21168,0.462379 0.0853,0.59004 0.0853,0.590039 0.002,0.232834 0.002,0.232833 h -2.46592 -2.46591 l 0.0521,0.26076 0.0522,0.260759 0.1357,0.285961 0.1357,0.285961 0.2249,0.227719 0.2249,0.227718 0.381,0.17187 0.381,0.171868 0.67733,0.003 0.67733,0.003 0.43361,-0.148165 0.4336,-0.148164 0.47656,-0.286972 0.47657,-0.286971 v 0.712271 0.712271 l -0.51014,0.25752 -0.51015,0.257521 -0.48469,0.118218 -0.48469,0.118219 -0.55033,0.04025 -0.55034,0.04025 -0.53711,-0.07184 z m 1.97285,-4.588866 -0.0594,-0.275167 -0.15637,-0.308968 -0.15636,-0.308968 -0.3015,-0.186332 -0.30149,-0.186332 h -0.50967 -0.50969 l -0.3321,0.219772 -0.33209,0.219772 -0.1428,0.275528 -0.14279,0.275528 -0.0623,0.275167 -0.0623,0.275166 h 1.56415 1.56414 z m -57.827186,4.402666 -0.04047,-0.105833 0.02196,-5.08 0.02196,-5.08 0.994833,-0.02385 0.994833,-0.02385 v 5.209686 5.209688 h -0.976323 -0.976325 z m 4.871787,-3.36264 v -3.474198 h 0.931333 0.931334 v 0.433185 0.433185 l 0.34947,-0.315724 0.34947,-0.315725 0.391363,-0.176782 0.391363,-0.176783 0.635492,-0.0031 0.635482,-0.0031 0.487748,0.23863 0.487748,0.238631 0.295478,0.386983 0.295487,0.386983 0.126449,0.425806 0.12645,0.425806 v 2.482299 2.4823 H 91.152104 90.220771 V 85.01017 82.666235 L 90.047696,82.308708 89.87462,81.951181 89.590402,81.816311 89.306176,81.681439 H 89.040433 88.77469 l -0.314122,0.16216 -0.31413,0.162158 -0.316105,0.326815 -0.316105,0.326815 -0.02256,2.326193 -0.02256,2.326194 -0.910166,0.02403 -0.910167,0.02403 z m 22.239119,3.412024 -0.0564,-0.05644 V 83.82633 80.411441 h 0.93133 0.93134 v 3.471333 3.471334 h -0.87489 -0.87489 z m 0.39216,-8.152795 -0.27106,-0.165272 -0.14041,-0.271523 -0.14041,-0.271524 0.0447,-0.33321 0.0447,-0.333209 0.18464,-0.196537 0.18464,-0.196537 0.24422,-0.101161 0.24423,-0.101162 0.31048,0.05825 0.31048,0.05825 0.23503,0.235035 0.23504,0.235033 0.0554,0.295386 0.0554,0.295386 -0.12876,0.308167 -0.12876,0.308166 -0.28026,0.170871 -0.28026,0.17087 h -0.254 -0.254 z m -8.745945,-7.889481 -0.465667,-0.07693 -0.529886,-0.247734 -0.529895,-0.247733 -0.454432,-0.429783 -0.454431,-0.429782 -0.22043,-0.49119 -0.220429,-0.491189 -0.08405,-0.592614 -0.08405,-0.592615 0.08674,-0.543691 0.08675,-0.54369 0.201295,-0.441797 0.201303,-0.441796 0.384887,-0.411471 0.384886,-0.411472 0.404198,-0.218754 0.404208,-0.218753 0.508,-0.149123 0.508006,-0.149122 h 0.677332 0.67733 l 0.508,0.149122 0.508,0.149123 0.40421,0.218753 0.4042,0.218754 0.38489,0.411472 0.38488,0.411471 0.20964,0.457902 0.20963,0.457901 0.084,0.521585 0.084,0.521584 -0.08,0.577081 -0.08,0.577082 -0.2301,0.512723 -0.23009,0.512724 -0.45443,0.429782 -0.45443,0.429783 -0.52989,0.246155 -0.52989,0.246155 -0.55033,0.08776 -0.55034,0.08776 -0.254,-0.0093 -0.254002,-0.0093 z m 1.701185,-1.539686 0.37315,-0.197074 0.22957,-0.374426 0.22958,-0.374427 0.0865,-0.552699 0.0866,-0.552699 -0.0802,-0.492987 -0.0802,-0.492988 -0.21397,-0.365112 -0.21397,-0.365111 -0.29921,-0.184924 -0.29921,-0.184924 -0.50533,-0.04582 -0.50533,-0.04582 -0.380642,0.14537 -0.380648,0.14537 -0.283642,0.331365 -0.283634,0.331365 -0.105731,0.352899 -0.105732,0.352899 v 0.565485 0.565484 l 0.105732,0.352899 0.105731,0.3529 0.29851,0.348744 0.298517,0.348745 0.259394,0.112966 0.259393,0.112967 0.515852,0.0033 0.51585,0.0033 0.37315,-0.197073 z m 12.5331,1.545937 -0.45538,-0.0806 -0.53029,-0.253081 -0.53028,-0.253081 -0.46766,-0.505121 -0.46765,-0.505121 -0.18833,-0.489761 -0.18832,-0.489761 -0.0417,-0.708837 -0.0417,-0.708836 0.10462,-0.476497 0.10461,-0.476497 0.2571,-0.48701 0.25711,-0.487012 0.37544,-0.346075 0.37545,-0.346075 0.43817,-0.199773 0.43815,-0.199773 0.5715,-0.0906 0.5715,-0.0906 0.56343,0.09001 0.56344,0.09001 0.4435,0.209806 0.44349,0.209806 0.35533,0.385481 0.35532,0.38548 0.20343,0.444357 0.20343,0.444357 0.0853,0.449861 0.0853,0.449862 v 0.454111 0.45411 h -2.45128 -2.45128 l 0.11581,0.384818 0.11581,0.384817 0.22861,0.299725 0.22862,0.299724 0.26321,0.160072 0.26322,0.16007 0.46781,0.09884 0.46781,0.09884 0.6016,-0.08498 0.60159,-0.08498 0.45674,-0.217349 0.45673,-0.217348 0.27517,-0.183775 0.27517,-0.183775 v 0.716184 0.716185 l -0.49374,0.263155 -0.49372,0.263156 -0.48115,0.125322 -0.48114,0.125322 -0.6973,0.04172 -0.69729,0.04172 z m 2.10638,-4.505924 v -0.193726 l -0.1905,-0.377091 -0.1905,-0.37709 -0.28769,-0.191183 -0.28768,-0.191183 h -0.49968 -0.49969 l -0.22863,0.118956 -0.22863,0.118955 -0.18646,0.1997 -0.18645,0.199699 -0.13105,0.313626 -0.13104,0.313625 v 0.129719 0.12972 h 1.524 1.524 z m 5.37634,4.541325 -0.254,-0.04056 -0.50425,-0.12835 -0.50424,-0.128351 -0.2366,-0.122344 -0.23658,-0.122345 v -0.766881 -0.766882 l 0.0635,0.03077 0.0635,0.03077 0.49092,0.227438 0.49093,0.227439 0.31341,0.08705 0.31341,0.08704 0.49104,5.08e-4 0.49103,5.08e-4 0.2438,-0.126071 0.2438,-0.126072 0.0573,-0.180437 0.0573,-0.180436 -0.1589,-0.212829 -0.1589,-0.212829 -1.05653,-0.541328 -1.05654,-0.541327 -0.39412,-0.406272 -0.39412,-0.406272 -0.0922,-0.33223 -0.0922,-0.33223 v -0.211667 -0.211667 l 0.0888,-0.319813 0.0888,-0.319815 0.26293,-0.299457 0.26293,-0.299456 0.40099,-0.2032 0.401,-0.2032 0.55272,-0.0883 0.55273,-0.0883 0.59783,0.08479 0.59783,0.08479 0.48807,0.195969 0.48807,0.19597 0.0245,0.735844 0.0245,0.735845 h -0.0485 -0.0484 l -0.39935,-0.202225 -0.39936,-0.202223 -0.45986,-0.136443 -0.45987,-0.136442 h -0.36165 -0.36165 l -0.21768,0.09918 -0.21768,0.09918 -0.0514,0.204854 -0.0514,0.204854 0.15928,0.155585 0.15928,0.155585 0.97366,0.521916 0.97367,0.521915 0.36185,0.295781 0.36184,0.29578 0.15588,0.310183 0.15587,0.310183 0.0554,0.305735 0.0554,0.305735 -0.0924,0.43081 -0.0924,0.430811 -0.24276,0.335114 -0.24276,0.335115 -0.53431,0.26294 -0.53432,0.262941 -0.67733,0.03398 -0.67733,0.03398 -0.254,-0.04056 z m 6.985,0.0064 -0.21167,-0.03621 -0.45945,-0.09398 -0.45945,-0.09398 -0.36605,-0.156906 -0.36605,-0.156907 v -0.765008 -0.765009 h 0.0304 0.0304 l 0.66809,0.315847 0.66809,0.315847 0.77406,0.0017 0.77405,0.0017 0.17845,-0.161289 0.17844,-0.161289 v -0.144793 -0.144793 l -0.16373,-0.208142 -0.16372,-0.208142 -1.03851,-0.536783 -1.03852,-0.536782 -0.36398,-0.335512 -0.36399,-0.335511 -0.12899,-0.433815 -0.12897,-0.433816 0.0518,-0.34649 0.0518,-0.34649 0.18474,-0.330844 0.18473,-0.330842 0.40817,-0.274016 0.40816,-0.274016 0.352,-0.09891 0.35198,-0.09891 0.67733,6.78e-4 0.67734,6.77e-4 0.50688,0.147616 0.50688,0.147616 0.23395,0.120981 0.23395,0.12098 v 0.717492 0.717493 h -0.0457 -0.0457 l -0.35238,-0.179775 -0.35239,-0.179775 -0.46183,-0.158891 -0.46183,-0.158892 h -0.41564 -0.41565 l -0.16182,0.08661 -0.16184,0.08661 -0.0896,0.167393 -0.0896,0.167393 0.0805,0.150417 0.0805,0.150419 1.08664,0.590415 1.08665,0.590415 0.42802,0.423334 0.42802,0.423333 0.11248,0.403377 0.11249,0.403378 -0.0521,0.38006 -0.0521,0.38006 -0.16846,0.330206 -0.16846,0.330207 -0.31522,0.259827 -0.31521,0.259827 -0.38574,0.131854 -0.38574,0.131853 -0.59267,0.03361 -0.59267,0.03361 -0.21166,-0.03621 z m 12.53066,-0.03893 -0.381,-0.06768 -0.37738,-0.13647 -0.37739,-0.13647 -0.40344,-0.258887 -0.40344,-0.258888 -0.25649,-0.292134 -0.2565,-0.292134 -0.20364,-0.401863 -0.20364,-0.401863 -0.10382,-0.52769 -0.10382,-0.52769 0.0437,-0.570155 0.0436,-0.570155 0.181,-0.475123 0.181,-0.475123 0.30481,-0.39123 0.3048,-0.39123 0.43889,-0.291322 0.4389,-0.291323 0.54577,-0.186412 0.54576,-0.186412 h 0.80433 0.80434 l 0.55033,0.184713 0.55033,0.184713 0.44682,0.303445 0.44682,0.303446 0.25303,0.319489 0.25304,0.319491 0.23148,0.494106 0.23148,0.494106 v 0.978057 0.978058 l -0.31939,0.646245 -0.31939,0.646245 -0.39002,0.343308 -0.39002,0.343308 -0.43507,0.212859 -0.43506,0.212857 -0.59119,0.125228 -0.59119,0.125227 -0.33867,-0.0085 -0.33867,-0.0085 z m 1.56984,-1.510886 0.34217,-0.155426 0.2286,-0.271678 0.2286,-0.271679 0.1378,-0.474009 0.1378,-0.474008 -0.0384,-0.642194 -0.0384,-0.642195 -0.17964,-0.349183 -0.17965,-0.349183 -0.25556,-0.215041 -0.25556,-0.215041 -0.30746,-0.10147 -0.30745,-0.101469 -0.49137,0.03554 -0.49137,0.03554 -0.32632,0.215944 -0.32631,0.215945 -0.25285,0.456539 -0.25284,0.456541 0.003,0.804333 0.003,0.804334 0.22055,0.423333 0.22056,0.423333 0.15984,0.144414 0.15984,0.144412 0.29381,0.12744 0.29381,0.12744 0.46567,0.0015 0.46567,0.0015 0.34217,-0.155426 z m 15.04431,1.515494 -0.27684,-0.06565 -0.33609,-0.232908 -0.33609,-0.232908 -0.22388,-0.457612 -0.22389,-0.457611 0.0553,-0.470121 0.0553,-0.470123 0.11818,-0.225541 0.11819,-0.225541 0.28239,-0.269722 0.28238,-0.269722 0.51964,-0.244778 0.51963,-0.244778 0.9832,-0.280613 0.9832,-0.280613 V 66.55233 66.263739 l -0.123,-0.23787 -0.12301,-0.23787 -0.23683,-0.09368 -0.23683,-0.09368 -0.22162,-0.05161 -0.22161,-0.05161 -0.49252,0.09105 -0.49251,0.09105 -0.35795,0.173277 -0.35794,0.173278 -0.38842,0.341902 -0.38843,0.341902 v -0.855727 -0.855727 l 0.40217,-0.255172 0.40217,-0.255173 0.55033,-0.175478 0.55033,-0.175478 0.84667,-0.0015 0.84667,-0.0015 0.48815,0.186573 0.48816,0.186573 0.25638,0.21574 0.2564,0.215739 0.1864,0.349183 0.1864,0.349183 0.0427,2.159 0.0427,2.159 0.23463,0.02696 0.23463,0.02696 0.29454,-0.182035 0.29453,-0.182036 v 0.55109 0.551091 l -0.48261,0.228314 -0.48262,0.228313 -0.51222,0.08349 -0.51221,0.08349 -0.33867,-0.115154 -0.33867,-0.115154 -0.13092,-0.2619 -0.13094,-0.261898 -0.4194,0.236586 -0.4194,0.236586 -0.50462,0.131146 -0.50463,0.131146 -0.21504,-0.0087 -0.21505,-0.0087 -0.27685,-0.06565 z m 2.16069,-1.408558 0.35983,-0.20893 v -0.926528 -0.92653 l -0.42751,0.168513 -0.42752,0.168511 -0.31332,0.161546 -0.31332,0.161548 -0.19569,0.184836 -0.19568,0.184837 -0.083,0.218244 -0.083,0.218246 0.0502,0.228658 0.0502,0.228659 0.18611,0.16919 0.18611,0.169189 0.127,0.04913 0.127,0.04913 0.29633,-0.04466 0.29633,-0.04466 z m -78.803506,-3.8471 v -5.169307 l 2.518834,0.02581 2.518833,0.02581 0.527838,0.2438 0.527839,0.2438 0.388316,0.415142 0.388317,0.415141 0.181791,0.399392 0.18179,0.399392 0.0027,0.804333 0.0027,0.804333 -0.224194,0.478194 -0.224194,0.478194 -0.355939,0.355946 -0.355945,0.355945 -0.442055,0.20238 -0.442056,0.202379 -0.449861,0.08531 -0.449862,0.08531 h -1.131408 -1.131444 v 2.159 2.159 h -1.016 -1.016 z m 4.478484,-0.969028 0.287483,-0.169334 0.172698,-0.231695 0.172699,-0.231695 0.03182,-0.487972 0.03182,-0.487971 -0.159128,-0.296333 -0.159127,-0.296334 -0.394073,-0.198374 -0.394073,-0.198375 -1.018298,-0.04692 -1.018299,-0.04692 v 1.460294 1.460294 l 1.0795,-0.02967 1.0795,-0.02967 z m 4.919516,2.667 v -3.471334 h 0.931334 0.931333 l 10e-4,0.8255 0.001,0.8255 0.216163,-0.381 0.216162,-0.381 0.354322,-0.366624 0.354313,-0.366624 0.252019,-0.132304 0.252018,-0.132304 h 0.427296 0.427296 l 0.294352,0.14909 0.294352,0.14909 0.270163,0.202163 0.270163,0.202163 -0.256066,0.613342 -0.256066,0.613342 -0.07566,0.19091 -0.07566,0.190911 -0.412886,-0.254049 -0.412877,-0.25405 -0.258809,-0.05176 -0.258817,-0.05176 -0.317035,0.104632 -0.317042,0.104633 -0.354644,0.354649 -0.354651,0.35465 -0.140225,0.411535 -0.140225,0.411535 v 1.80525 1.805251 H 91.067393 90.13606 v -3.471333 z m 16.340666,0.719667 v -2.751667 h -0.46566 -0.46567 V 64.95981 64.240143 h 0.45309 0.45309 l 0.0498,-0.70508 0.0498,-0.70508 0.14646,-0.37442 0.14647,-0.37442 0.25179,-0.35671 0.2518,-0.356712 0.31832,-0.220596 0.31833,-0.220597 0.40269,-0.121192 0.40269,-0.121193 h 0.45705 0.45705 l 0.37616,0.09472 0.37616,0.09472 v 0.738217 0.738215 l -0.65961,-0.0074 -0.65959,-0.0074 -0.22822,0.149347 -0.22822,0.149345 -0.1324,0.202067 -0.1324,0.202067 -0.0504,0.601087 -0.0504,0.601087 h 0.60495 0.60494 v 0.719667 0.719667 h -0.59266 -0.59267 v 2.751667 2.751666 h -0.93133 -0.93134 z m 27.178,-0.719667 v -3.471334 h 0.93134 0.93133 v 3.471334 3.471333 h -0.93133 -0.93134 z m 13.88534,0 v -3.471334 h 0.93133 0.93133 v 0.432104 0.432104 l 0.31364,-0.275375 0.31363,-0.275377 0.46564,-0.213172 0.46562,-0.213172 h 0.6092 0.60921 l 0.47247,0.231159 0.47247,0.23116 0.25745,0.312118 0.25745,0.312118 0.16761,0.447676 0.16761,0.447677 v 2.536823 2.536824 h -0.93133 -0.93133 v -2.39319 -2.393154 l -0.15471,-0.288471 -0.15471,-0.288471 -0.28847,-0.154708 -0.28847,-0.154709 h -0.24976 -0.24976 l -0.36516,0.176777 -0.36518,0.176776 -0.29655,0.346464 -0.29657,0.346464 v 2.313093 2.313093 h -0.93133 -0.93133 z m 17.10266,-1.693334 v -5.164666 h 0.93134 0.93133 v 5.164666 5.164667 h -0.93133 -0.93134 z m -30.63326,-3.05017 -0.28026,-0.17087 -0.12876,-0.308167 -0.12876,-0.308166 0.0557,-0.297134 0.0557,-0.297133 0.25351,-0.236814 0.25352,-0.236815 0.27658,-0.05189 0.27658,-0.05189 0.30816,0.12876 0.30817,0.128761 0.17088,0.280261 0.17086,0.280261 v 0.262647 0.262645 l -0.19304,0.286454 -0.19304,0.286454 -0.20912,0.105819 -0.20913,0.105819 -0.254,9.31e-4 -0.254,9.32e-4 -0.28026,-0.170871 z m -29.3954,-8.03213 -0.46567,-0.165128 -0.39459,-0.427613 -0.39458,-0.427612 -0.1553,-0.446841 -0.15531,-0.446839 -8.4e-4,-2.497667 -8.5e-4,-2.497666 0.90531,-0.02398 0.90531,-0.02398 0.026,2.394649 0.026,2.394648 0.127,0.25084 0.127,0.250839 0.28768,0.193661 0.28769,0.19366 h 0.34175 0.34175 l 0.373,-0.180569 0.37301,-0.180569 0.24639,-0.340135 0.24639,-0.340134 v -2.318494 -2.318494 l 0.91017,0.02403 0.91017,0.02403 0.0221,3.450166 0.0221,3.450167 h -0.93229 -0.93228 v -0.42993 -0.429932 l -0.35343,0.302528 -0.35344,0.302527 -0.37532,0.181692 -0.37533,0.181692 -0.5624,0.03279 -0.56241,0.03279 -0.46567,-0.165129 z m -23.876006,-5.1737 v -5.164666 h 1.016 1.016 v 4.360333 4.360333 h 2.497667 2.497667 v 0.804334 0.804333 h -3.513667 -3.513667 z m 8.974667,1.690469 v -3.474197 l 0.910167,0.02403 0.910167,0.02403 0.02211,3.450166 0.02211,3.450167 h -0.932281 -0.932282 z m 4.422885,0.02403 0.02211,-3.450166 0.910167,-0.02403 0.910167,-0.02403 v 0.478383 0.478382 l 0.334848,-0.302518 0.334856,-0.302518 0.363644,-0.193932 0.363652,-0.193934 h 0.804333 0.804333 l 0.346685,0.185278 0.346677,0.185278 0.27937,0.318186 0.279372,0.318187 0.17828,0.385301 0.17828,0.385302 0.0267,2.6035 0.0267,2.6035 H 99.708968 98.77213 v -2.284323 -2.284287 l -0.136652,-0.341472 -0.136635,-0.341472 -0.249995,-0.178011 -0.249987,-0.17801 h -0.41308 -0.413072 l -0.299508,0.185106 -0.299517,0.185107 -0.29779,0.347902 -0.297789,0.347903 v 2.27076 2.27076 h -0.932282 -0.932282 z m 17.143554,3.344334 0.0818,-0.105834 1.32703,-1.637466 1.32703,-1.637468 -0.14967,-0.196204 -0.14967,-0.196205 -1.24883,-1.47846 -1.24883,-1.478461 v -0.05337 -0.05337 l 1.0795,0.0041 1.0795,0.0041 0.83304,1.054209 0.83304,1.054209 0.056,-1.69e-4 0.056,-1.69e-4 0.80143,-1.058163 0.80143,-1.058164 h 1.0824 1.0824 v 0.05019 0.05018 l -1.29451,1.579648 -1.29451,1.579647 -0.0654,0.106329 -0.0655,0.106328 1.38631,1.629338 1.38631,1.629338 0.0633,0.105834 0.0633,0.105833 h -1.09009 -1.09009 l -0.8834,-1.095756 -0.88341,-1.095756 -0.0447,-0.0049 -0.0448,-0.0049 -0.84425,1.095751 -0.84426,1.095751 -1.08987,0.0049 -1.08987,0.0049 0.0818,-0.105833 z m -21.300289,-8.151938 -0.254847,-0.214437 -0.09688,-0.293563 -0.09688,-0.293562 0.09688,-0.293562 0.09688,-0.293563 0.254847,-0.214437 0.254846,-0.214438 h 0.336373 0.336372 l 0.248361,0.128433 0.248361,0.128433 0.12844,0.248363 0.128431,0.248362 -8.47e-4,0.279371 -8.47e-4,0.279371 -0.163669,0.248291 -0.163678,0.248292 -0.195605,0.108542 -0.195597,0.108541 -0.353339,0.003 -0.353331,0.003 -0.254847,-0.214438 z"
         id="path1426" />
    </g>
  </g>
</svg>
