<svg width="26" height="29" viewBox="0 0 26 29" fill="none" xmlns="http://www.w3.org/2000/svg">
<g id="instagram logo" clip-path="url(#clip0_137_216)">
<path id="Vector" d="M12.5474 8.42582C9.00036 8.42582 6.13929 11.2422 6.13929 14.7338C6.13929 18.2254 9.00036 21.0418 12.5474 21.0418C16.0945 21.0418 18.9555 18.2254 18.9555 14.7338C18.9555 11.2422 16.0945 8.42582 12.5474 8.42582ZM12.5474 18.8348C10.2552 18.8348 8.3813 16.9957 8.3813 14.7338C8.3813 12.4719 10.2496 10.6328 12.5474 10.6328C14.8452 10.6328 16.7135 12.4719 16.7135 14.7338C16.7135 16.9957 14.8396 18.8348 12.5474 18.8348ZM20.7123 8.16779C20.7123 8.9858 20.0431 9.6391 19.2177 9.6391C18.3867 9.6391 17.723 8.98031 17.723 8.16779C17.723 7.35527 18.3922 6.69647 19.2177 6.69647C20.0431 6.69647 20.7123 7.35527 20.7123 8.16779ZM24.9565 9.66106C24.8617 7.69016 24.4044 5.94435 22.9376 4.50597C21.4764 3.06759 19.7029 2.61742 17.7007 2.5186C15.6371 2.40331 9.4521 2.40331 7.38857 2.5186C5.39196 2.61193 3.61843 3.0621 2.15165 4.50048C0.684866 5.93886 0.233119 7.68467 0.132731 9.65557C0.0156115 11.6869 0.0156115 17.7753 0.132731 19.8065C0.227542 21.7775 0.684866 23.5233 2.15165 24.9616C3.61843 26.4 5.38638 26.8502 7.38857 26.949C9.4521 27.0643 15.6371 27.0643 17.7007 26.949C19.7029 26.8557 21.4764 26.4055 22.9376 24.9616C24.3988 23.5233 24.8561 21.7775 24.9565 19.8065C25.0736 17.7753 25.0736 11.6924 24.9565 9.66106ZM22.2906 21.9861C21.8556 23.0621 21.0135 23.8911 19.9148 24.3248C18.2695 24.9671 14.3656 24.8189 12.5474 24.8189C10.7293 24.8189 6.8197 24.9616 5.18003 24.3248C4.08691 23.8966 3.24477 23.0676 2.80417 21.9861C2.15165 20.3665 2.30223 16.5235 2.30223 14.7338C2.30223 12.9441 2.15723 9.0956 2.80417 7.48154C3.23919 6.4055 4.08133 5.57652 5.18003 5.14281C6.82528 4.50048 10.7293 4.64871 12.5474 4.64871C14.3656 4.64871 18.2751 4.50597 19.9148 5.14281C21.0079 5.57103 21.8501 6.40001 22.2906 7.48154C22.9432 9.10109 22.7926 12.9441 22.7926 14.7338C22.7926 16.5235 22.9432 20.372 22.2906 21.9861Z" fill="black"/>
</g>
<defs>
<clipPath id="clip0_137_216">
<rect width="24.9855" height="28.1087" fill="white" transform="translate(0.0490494 0.684937)"/>
</clipPath>
</defs>
</svg>
