{
    "DesktopAudioDevice1": {
        "balance": 0.5,
        "deinterlace_field_order": 0,
        "deinterlace_mode": 0,
        "enabled": true,
        "flags": 0,
        "hotkeys": {
            "libobs.mute": [],
            "libobs.push-to-mute": [],
            "libobs.push-to-talk": [],
            "libobs.unmute": []
        },
        "id": "pulse_output_capture",
        "mixers": 255,
        "monitoring_type": 0,
        "muted": false,
        "name": "Audio del escritorio",
        "prev_ver": 452984833,
        "private_settings": {},
        "push-to-mute": false,
        "push-to-mute-delay": 0,
        "push-to-talk": false,
        "push-to-talk-delay": 0,
        "settings": {
            "device_id": "default"
        },
        "sync": 0,
        "versioned_id": "pulse_output_capture",
        "volume": 1.0
    },
    "current_program_scene": "Jitsi",
    "current_scene": "Jitsi",
    "current_transition": "Desvanecimiento",
    "groups": [],
    "modules": {
        "auto-scene-switcher": {
            "active": false,
            "interval": 300,
            "non_matching_scene": "",
            "switch_if_not_matching": false,
            "switches": []
        },
        "decklink_captions": {
            "source": ""
        },
        "output-timer": {
            "autoStartRecordTimer": false,
            "autoStartStreamTimer": false,
            "pauseRecordTimer": true,
            "recordTimerHours": 0,
            "recordTimerMinutes": 0,
            "recordTimerSeconds": 30,
            "streamTimerHours": 0,
            "streamTimerMinutes": 0,
            "streamTimerSeconds": 30
        },
        "scripts-tool": []
    },
    "name": "SLUD_XVIII",
    "preview_locked": false,
    "quick_transitions": [{
        "duration": 300,
        "fade_to_black": false,
        "hotkeys": [],
        "id": 4,
        "name": "Corte"
    }, {
        "duration": 300,
        "fade_to_black": false,
        "hotkeys": [],
        "id": 5,
        "name": "Desvanecimiento"
    }, {
        "duration": 300,
        "fade_to_black": true,
        "hotkeys": [],
        "id": 6,
        "name": "Desvanecimiento"
    }],
    "saved_projectors": [],
    "scaling_enabled": false,
    "scaling_level": 0,
    "scaling_off_x": 0.0,
    "scaling_off_y": 0.0,
    "scene_order": [{
        "name": "Inicio"
    }, {
        "name": "Jitsi"
    }, {
        "name": "Jitsi Publicidad"
    }, {
        "name": "Intermedios"
    }, {
        "name": "Fin"
    }],
    "sources": [{
        "balance": 0.0,
        "deinterlace_field_order": 0,
        "deinterlace_mode": 0,
        "enabled": true,
        "flags": 0,
        "hotkeys": {
            "OBSBasic.SelectScene": [],
            "libobs.hide_scene_item.1_Linux_Presentation": [],
            "libobs.hide_scene_item.2_Satelites_Presentation": [],
            "libobs.hide_scene_item.3_VSCodium_Presentation": [],
            "libobs.hide_scene_item.4_Taller_Presentation": [],
            "libobs.hide_scene_item.5_ReactiveX_Presentation": [],
            "libobs.show_scene_item.1_Linux_Presentation": [],
            "libobs.show_scene_item.2_Satelites_Presentation": [],
            "libobs.show_scene_item.3_VSCodium_Presentation": [],
            "libobs.show_scene_item.4_Taller_Presentation": [],
            "libobs.show_scene_item.5_ReactiveX_Presentation": []
        },
        "id": "scene",
        "mixers": 0,
        "monitoring_type": 0,
        "muted": false,
        "name": "Inicio",
        "prev_ver": 452984833,
        "private_settings": {},
        "push-to-mute": false,
        "push-to-mute-delay": 0,
        "push-to-talk": false,
        "push-to-talk-delay": 0,
        "settings": {
            "custom_size": false,
            "id_counter": 5,
            "items": [{
                "align": 5,
                "bounds": {
                    "x": 1280.0,
                    "y": 720.0
                },
                "bounds_align": 0,
                "bounds_type": 2,
                "crop_bottom": 0,
                "crop_left": 0,
                "crop_right": 0,
                "crop_top": 0,
                "group_item_backup": false,
                "hide_transition": {
                    "duration": 0
                },
                "id": 5,
                "locked": false,
                "name": "5_ReactiveX_Presentation",
                "pos": {
                    "x": 0.0,
                    "y": 0.0
                },
                "private_settings": {},
                "rot": 0.0,
                "scale": {
                    "x": 1.0,
                    "y": 1.0
                },
                "scale_filter": "disable",
                "show_transition": {
                    "duration": 0
                },
                "visible": false
            }, {
                "align": 5,
                "bounds": {
                    "x": 1280.0,
                    "y": 720.0
                },
                "bounds_align": 0,
                "bounds_type": 2,
                "crop_bottom": 0,
                "crop_left": 0,
                "crop_right": 0,
                "crop_top": 0,
                "group_item_backup": false,
                "hide_transition": {
                    "duration": 0
                },
                "id": 4,
                "locked": false,
                "name": "4_Taller_Presentation",
                "pos": {
                    "x": 0.0,
                    "y": 0.0
                },
                "private_settings": {},
                "rot": 0.0,
                "scale": {
                    "x": 1.0,
                    "y": 1.0
                },
                "scale_filter": "disable",
                "show_transition": {
                    "duration": 0
                },
                "visible": false
            }, {
                "align": 5,
                "bounds": {
                    "x": 1280.0,
                    "y": 720.0
                },
                "bounds_align": 0,
                "bounds_type": 2,
                "crop_bottom": 0,
                "crop_left": 0,
                "crop_right": 0,
                "crop_top": 0,
                "group_item_backup": false,
                "hide_transition": {
                    "duration": 0
                },
                "id": 3,
                "locked": false,
                "name": "3_VSCodium_Presentation",
                "pos": {
                    "x": 0.0,
                    "y": 0.0
                },
                "private_settings": {},
                "rot": 0.0,
                "scale": {
                    "x": 1.0,
                    "y": 1.0
                },
                "scale_filter": "disable",
                "show_transition": {
                    "duration": 0
                },
                "visible": false
            }, {
                "align": 5,
                "bounds": {
                    "x": 1280.0,
                    "y": 720.0
                },
                "bounds_align": 0,
                "bounds_type": 2,
                "crop_bottom": 0,
                "crop_left": 0,
                "crop_right": 0,
                "crop_top": 0,
                "group_item_backup": false,
                "hide_transition": {
                    "duration": 0
                },
                "id": 2,
                "locked": false,
                "name": "2_Satelites_Presentation",
                "pos": {
                    "x": 0.0,
                    "y": 0.0
                },
                "private_settings": {},
                "rot": 0.0,
                "scale": {
                    "x": 1.0,
                    "y": 1.0
                },
                "scale_filter": "disable",
                "show_transition": {
                    "duration": 0
                },
                "visible": false
            }, {
                "align": 5,
                "bounds": {
                    "x": 1280.0,
                    "y": 720.0
                },
                "bounds_align": 0,
                "bounds_type": 2,
                "crop_bottom": 0,
                "crop_left": 0,
                "crop_right": 0,
                "crop_top": 0,
                "group_item_backup": false,
                "hide_transition": {
                    "duration": 0
                },
                "id": 1,
                "locked": false,
                "name": "1_Linux_Presentation",
                "pos": {
                    "x": 0.0,
                    "y": 0.0
                },
                "private_settings": {},
                "rot": 0.0,
                "scale": {
                    "x": 1.0,
                    "y": 1.0
                },
                "scale_filter": "disable",
                "show_transition": {
                    "duration": 0
                },
                "visible": false
            }]
        },
        "sync": 0,
        "versioned_id": "scene",
        "volume": 1.0
    }, {
        "balance": 0.0,
        "deinterlace_field_order": 0,
        "deinterlace_mode": 0,
        "enabled": true,
        "flags": 0,
        "hotkeys": {
            "OBSBasic.SelectScene": [],
            "libobs.hide_scene_item.1_Linux_Name": [],
            "libobs.hide_scene_item.2_Satelites_Name": [],
            "libobs.hide_scene_item.3_VSCodium_Name": [],
            "libobs.hide_scene_item.4_Taller_Name": [],
            "libobs.hide_scene_item.5_ReactiveX_Name": [],
            "libobs.hide_scene_item.Llamada": [],
            "libobs.hide_scene_item.Marco_General": [],
            "libobs.hide_scene_item.Redes_Sociales": [],
            "libobs.hide_scene_item.marco": [],
            "libobs.show_scene_item.1_Linux_Name": [],
            "libobs.show_scene_item.2_Satelites_Name": [],
            "libobs.show_scene_item.3_VSCodium_Name": [],
            "libobs.show_scene_item.4_Taller_Name": [],
            "libobs.show_scene_item.5_ReactiveX_Name": [],
            "libobs.show_scene_item.Llamada": [],
            "libobs.show_scene_item.Marco_General": [],
            "libobs.show_scene_item.Redes_Sociales": [],
            "libobs.show_scene_item.marco": []
        },
        "id": "scene",
        "mixers": 0,
        "monitoring_type": 0,
        "muted": false,
        "name": "Jitsi",
        "prev_ver": 452984833,
        "private_settings": {},
        "push-to-mute": false,
        "push-to-mute-delay": 0,
        "push-to-talk": false,
        "push-to-talk-delay": 0,
        "settings": {
            "custom_size": false,
            "id_counter": 10,
            "items": [{
                "align": 5,
                "bounds": {
                    "x": 1280.0,
                    "y": 720.0
                },
                "bounds_align": 0,
                "bounds_type": 2,
                "crop_bottom": 0,
                "crop_left": 0,
                "crop_right": 0,
                "crop_top": 80,
                "group_item_backup": false,
                "hide_transition": {
                    "duration": 0
                },
                "id": 3,
                "locked": false,
                "name": "Llamada",
                "pos": {
                    "x": 0.0,
                    "y": 0.0
                },
                "private_settings": {},
                "rot": 0.0,
                "scale": {
                    "x": 1.0,
                    "y": 1.0
                },
                "scale_filter": "disable",
                "show_transition": {
                    "duration": 0
                },
                "visible": true
            }, {
                "align": 5,
                "bounds": {
                    "x": 1280.0,
                    "y": 720.0
                },
                "bounds_align": 0,
                "bounds_type": 2,
                "crop_bottom": 0,
                "crop_left": 0,
                "crop_right": 0,
                "crop_top": 0,
                "group_item_backup": false,
                "hide_transition": {
                    "duration": 0
                },
                "id": 2,
                "locked": false,
                "name": "marco",
                "pos": {
                    "x": 0.0,
                    "y": 0.0
                },
                "private_settings": {},
                "rot": 0.0,
                "scale": {
                    "x": 1.0,
                    "y": 1.0
                },
                "scale_filter": "disable",
                "show_transition": {
                    "duration": 0
                },
                "visible": false
            }, {
                "align": 5,
                "bounds": {
                    "x": 1280.0,
                    "y": 720.0
                },
                "bounds_align": 0,
                "bounds_type": 2,
                "crop_bottom": 0,
                "crop_left": 0,
                "crop_right": 0,
                "crop_top": 0,
                "group_item_backup": false,
                "hide_transition": {
                    "duration": 0
                },
                "id": 9,
                "locked": false,
                "name": "Marco_General",
                "pos": {
                    "x": 0.0,
                    "y": 0.0
                },
                "private_settings": {},
                "rot": 0.0,
                "scale": {
                    "x": 1.0,
                    "y": 1.0
                },
                "scale_filter": "disable",
                "show_transition": {
                    "duration": 0
                },
                "visible": true
            }, {
                "align": 5,
                "bounds": {
                    "x": 1280.0,
                    "y": 720.0
                },
                "bounds_align": 0,
                "bounds_type": 2,
                "crop_bottom": 0,
                "crop_left": 0,
                "crop_right": 0,
                "crop_top": 0,
                "group_item_backup": false,
                "hide_transition": {
                    "duration": 0
                },
                "id": 10,
                "locked": false,
                "name": "Redes_Sociales",
                "pos": {
                    "x": 0.0,
                    "y": 0.0
                },
                "private_settings": {},
                "rot": 0.0,
                "scale": {
                    "x": 1.0,
                    "y": 1.0
                },
                "scale_filter": "disable",
                "show_transition": {
                    "duration": 0
                },
                "visible": true
            }, {
                "align": 5,
                "bounds": {
                    "x": 1280.0,
                    "y": 720.0
                },
                "bounds_align": 0,
                "bounds_type": 2,
                "crop_bottom": 0,
                "crop_left": 0,
                "crop_right": 0,
                "crop_top": 0,
                "group_item_backup": false,
                "hide_transition": {
                    "duration": 0
                },
                "id": 8,
                "locked": false,
                "name": "5_ReactiveX_Name",
                "pos": {
                    "x": 0.0,
                    "y": 0.0
                },
                "private_settings": {},
                "rot": 0.0,
                "scale": {
                    "x": 1.0,
                    "y": 1.0
                },
                "scale_filter": "disable",
                "show_transition": {
                    "duration": 0
                },
                "visible": false
            }, {
                "align": 5,
                "bounds": {
                    "x": 1280.0,
                    "y": 720.0
                },
                "bounds_align": 0,
                "bounds_type": 2,
                "crop_bottom": 0,
                "crop_left": 0,
                "crop_right": 0,
                "crop_top": 0,
                "group_item_backup": false,
                "hide_transition": {
                    "duration": 0
                },
                "id": 7,
                "locked": false,
                "name": "4_Taller_Name",
                "pos": {
                    "x": 0.0,
                    "y": 0.0
                },
                "private_settings": {},
                "rot": 0.0,
                "scale": {
                    "x": 1.0,
                    "y": 1.0
                },
                "scale_filter": "disable",
                "show_transition": {
                    "duration": 0
                },
                "visible": false
            }, {
                "align": 5,
                "bounds": {
                    "x": 1280.0,
                    "y": 720.0
                },
                "bounds_align": 0,
                "bounds_type": 2,
                "crop_bottom": 0,
                "crop_left": 0,
                "crop_right": 0,
                "crop_top": 0,
                "group_item_backup": false,
                "hide_transition": {
                    "duration": 0
                },
                "id": 6,
                "locked": false,
                "name": "3_VSCodium_Name",
                "pos": {
                    "x": 0.0,
                    "y": 0.0
                },
                "private_settings": {},
                "rot": 0.0,
                "scale": {
                    "x": 1.0,
                    "y": 1.0
                },
                "scale_filter": "disable",
                "show_transition": {
                    "duration": 0
                },
                "visible": false
            }, {
                "align": 5,
                "bounds": {
                    "x": 1280.0,
                    "y": 720.0
                },
                "bounds_align": 0,
                "bounds_type": 2,
                "crop_bottom": 0,
                "crop_left": 0,
                "crop_right": 0,
                "crop_top": 0,
                "group_item_backup": false,
                "hide_transition": {
                    "duration": 0
                },
                "id": 5,
                "locked": false,
                "name": "2_Satelites_Name",
                "pos": {
                    "x": 0.0,
                    "y": 0.0
                },
                "private_settings": {},
                "rot": 0.0,
                "scale": {
                    "x": 1.0,
                    "y": 1.0
                },
                "scale_filter": "disable",
                "show_transition": {
                    "duration": 0
                },
                "visible": false
            }, {
                "align": 5,
                "bounds": {
                    "x": 1280.0,
                    "y": 720.0
                },
                "bounds_align": 0,
                "bounds_type": 2,
                "crop_bottom": 0,
                "crop_left": 0,
                "crop_right": 0,
                "crop_top": 0,
                "group_item_backup": false,
                "hide_transition": {
                    "duration": 0
                },
                "id": 4,
                "locked": false,
                "name": "1_Linux_Name",
                "pos": {
                    "x": 0.0,
                    "y": 0.0
                },
                "private_settings": {},
                "rot": 0.0,
                "scale": {
                    "x": 1.0,
                    "y": 1.0
                },
                "scale_filter": "disable",
                "show_transition": {
                    "duration": 0
                },
                "visible": true
            }]
        },
        "sync": 0,
        "versioned_id": "scene",
        "volume": 1.0
    }, {
        "balance": 0.0,
        "deinterlace_field_order": 0,
        "deinterlace_mode": 0,
        "enabled": true,
        "flags": 0,
        "hotkeys": {
            "OBSBasic.SelectScene": [],
            "libobs.hide_scene_item.Frame-FIN": [],
            "libobs.show_scene_item.Frame-FIN": []
        },
        "id": "scene",
        "mixers": 0,
        "monitoring_type": 0,
        "muted": false,
        "name": "Fin",
        "prev_ver": 452984833,
        "private_settings": {},
        "push-to-mute": false,
        "push-to-mute-delay": 0,
        "push-to-talk": false,
        "push-to-talk-delay": 0,
        "settings": {
            "custom_size": false,
            "id_counter": 1,
            "items": [{
                "align": 5,
                "bounds": {
                    "x": 1280.0,
                    "y": 720.0
                },
                "bounds_align": 0,
                "bounds_type": 2,
                "crop_bottom": 0,
                "crop_left": 0,
                "crop_right": 0,
                "crop_top": 0,
                "group_item_backup": false,
                "hide_transition": {
                    "duration": 0
                },
                "id": 1,
                "locked": false,
                "name": "Frame-FIN",
                "pos": {
                    "x": 0.0,
                    "y": 0.0
                },
                "private_settings": {},
                "rot": 0.0,
                "scale": {
                    "x": 1.0,
                    "y": 1.0
                },
                "scale_filter": "disable",
                "show_transition": {
                    "duration": 0
                },
                "visible": true
            }]
        },
        "sync": 0,
        "versioned_id": "scene",
        "volume": 1.0
    }, {
        "balance": 0.0,
        "deinterlace_field_order": 0,
        "deinterlace_mode": 0,
        "enabled": true,
        "flags": 0,
        "hotkeys": {
            "OBSBasic.SelectScene": [],
            "libobs.hide_scene_item.Jorels": [],
            "libobs.hide_scene_item.Jorge_Sanabria": [],
            "libobs.hide_scene_item.Linux": [],
            "libobs.hide_scene_item.Linux_Professional_Institute": [],
            "libobs.hide_scene_item.Llamada": [],
            "libobs.hide_scene_item.marcoPublicidad": [],
            "libobs.show_scene_item.Jorels": [],
            "libobs.show_scene_item.Jorge_Sanabria": [],
            "libobs.show_scene_item.Linux": [],
            "libobs.show_scene_item.Linux_Professional_Institute": [],
            "libobs.show_scene_item.Llamada": [],
            "libobs.show_scene_item.marcoPublicidad": []
        },
        "id": "scene",
        "mixers": 0,
        "monitoring_type": 0,
        "muted": false,
        "name": "Jitsi Publicidad",
        "prev_ver": 452984833,
        "private_settings": {},
        "push-to-mute": false,
        "push-to-mute-delay": 0,
        "push-to-talk": false,
        "push-to-talk-delay": 0,
        "settings": {
            "custom_size": false,
            "id_counter": 7,
            "items": [{
                "align": 5,
                "bounds": {
                    "x": 1280.0,
                    "y": 720.0
                },
                "bounds_align": 0,
                "bounds_type": 2,
                "crop_bottom": 0,
                "crop_left": 0,
                "crop_right": 0,
                "crop_top": 0,
                "group_item_backup": false,
                "hide_transition": {
                    "duration": 0
                },
                "id": 2,
                "locked": false,
                "name": "Llamada",
                "pos": {
                    "x": 0.0,
                    "y": 0.0
                },
                "private_settings": {},
                "rot": 0.0,
                "scale": {
                    "x": 1.0,
                    "y": 1.0
                },
                "scale_filter": "disable",
                "show_transition": {
                    "duration": 0
                },
                "visible": true
            }, {
                "align": 5,
                "bounds": {
                    "x": 1280.0,
                    "y": 720.0
                },
                "bounds_align": 0,
                "bounds_type": 2,
                "crop_bottom": 0,
                "crop_left": 0,
                "crop_right": 0,
                "crop_top": 0,
                "group_item_backup": false,
                "hide_transition": {
                    "duration": 0
                },
                "id": 1,
                "locked": false,
                "name": "marcoPublicidad",
                "pos": {
                    "x": 0.0,
                    "y": 0.0
                },
                "private_settings": {},
                "rot": 0.0,
                "scale": {
                    "x": 1.0,
                    "y": 1.0
                },
                "scale_filter": "disable",
                "show_transition": {
                    "duration": 0
                },
                "visible": true
            }, {
                "align": 5,
                "bounds": {
                    "x": 0.0,
                    "y": 0.0
                },
                "bounds_align": 0,
                "bounds_type": 0,
                "crop_bottom": 0,
                "crop_left": 0,
                "crop_right": 0,
                "crop_top": 0,
                "group_item_backup": false,
                "hide_transition": {
                    "duration": 0
                },
                "id": 3,
                "locked": false,
                "name": "Linux",
                "pos": {
                    "x": 0.0,
                    "y": 0.0
                },
                "private_settings": {},
                "rot": 0.0,
                "scale": {
                    "x": 1.0,
                    "y": 1.0
                },
                "scale_filter": "disable",
                "show_transition": {
                    "duration": 0
                },
                "visible": true
            }, {
                "align": 5,
                "bounds": {
                    "x": 0.0,
                    "y": 0.0
                },
                "bounds_align": 0,
                "bounds_type": 0,
                "crop_bottom": 0,
                "crop_left": 0,
                "crop_right": 0,
                "crop_top": 0,
                "group_item_backup": false,
                "hide_transition": {
                    "duration": 0
                },
                "id": 4,
                "locked": false,
                "name": "Linux_Professional_Institute",
                "pos": {
                    "x": 1018.0,
                    "y": 158.0
                },
                "private_settings": {},
                "rot": 0.0,
                "scale": {
                    "x": 0.052400000393390656,
                    "y": 0.052350018173456192
                },
                "scale_filter": "disable",
                "show_transition": {
                    "duration": 0
                },
                "visible": true
            }, {
                "align": 5,
                "bounds": {
                    "x": 0.0,
                    "y": 0.0
                },
                "bounds_align": 0,
                "bounds_type": 0,
                "crop_bottom": 0,
                "crop_left": 0,
                "crop_right": 0,
                "crop_top": 0,
                "group_item_backup": false,
                "hide_transition": {
                    "duration": 0
                },
                "id": 6,
                "locked": false,
                "name": "Jorge_Sanabria",
                "pos": {
                    "x": 1050.0,
                    "y": 314.0
                },
                "private_settings": {},
                "rot": 0.0,
                "scale": {
                    "x": 0.30476191639900208,
                    "y": 0.30476191639900208
                },
                "scale_filter": "disable",
                "show_transition": {
                    "duration": 0
                },
                "visible": true
            }, {
                "align": 5,
                "bounds": {
                    "x": 0.0,
                    "y": 0.0
                },
                "bounds_align": 0,
                "bounds_type": 0,
                "crop_bottom": 0,
                "crop_left": 0,
                "crop_right": 0,
                "crop_top": 0,
                "group_item_backup": false,
                "hide_transition": {
                    "duration": 0
                },
                "id": 7,
                "locked": false,
                "name": "Jorels",
                "pos": {
                    "x": 971.0,
                    "y": 152.0
                },
                "private_settings": {},
                "rot": 90.0,
                "scale": {
                    "x": 0.48493149876594543,
                    "y": 0.48557692766189575
                },
                "scale_filter": "disable",
                "show_transition": {
                    "duration": 0
                },
                "visible": true
            }]
        },
        "sync": 0,
        "versioned_id": "scene",
        "volume": 1.0
    }, {
        "balance": 0.0,
        "deinterlace_field_order": 0,
        "deinterlace_mode": 0,
        "enabled": true,
        "flags": 0,
        "hotkeys": {},
        "id": "image_source",
        "mixers": 0,
        "monitoring_type": 0,
        "muted": false,
        "name": "marco",
        "prev_ver": 452984833,
        "private_settings": {},
        "push-to-mute": false,
        "push-to-mute-delay": 0,
        "push-to-talk": false,
        "push-to-talk-delay": 0,
        "settings": {
            "file": "$PWD/sludxviii-trasmision/marcos/marco.png"
        },
        "sync": 0,
        "versioned_id": "image_source",
        "volume": 1.0
    }, {
        "balance": 0.0,
        "deinterlace_field_order": 0,
        "deinterlace_mode": 0,
        "enabled": true,
        "flags": 0,
        "hotkeys": {},
        "id": "image_source",
        "mixers": 0,
        "monitoring_type": 0,
        "muted": false,
        "name": "marcoPublicidad",
        "prev_ver": 452984833,
        "private_settings": {},
        "push-to-mute": false,
        "push-to-mute-delay": 0,
        "push-to-talk": false,
        "push-to-talk-delay": 0,
        "settings": {
            "file": "$PWD/sludxviii-trasmision/marcos/marco_publicidad.png"
        },
        "sync": 0,
        "versioned_id": "image_source",
        "volume": 1.0
    }, {
        "balance": 0.0,
        "deinterlace_field_order": 0,
        "deinterlace_mode": 0,
        "enabled": true,
        "flags": 0,
        "hotkeys": {
            "OBSBasic.SelectScene": [],
            "libobs.hide_scene_item.Intermedio": [],
            "libobs.hide_scene_item.Problemas_Tecnicos": [],
            "libobs.hide_scene_item.problemas tecnicos": [],
            "libobs.show_scene_item.Intermedio": [],
            "libobs.show_scene_item.Problemas_Tecnicos": [],
            "libobs.show_scene_item.problemas tecnicos": []
        },
        "id": "scene",
        "mixers": 0,
        "monitoring_type": 0,
        "muted": false,
        "name": "Intermedios",
        "prev_ver": 452984833,
        "private_settings": {},
        "push-to-mute": false,
        "push-to-mute-delay": 0,
        "push-to-talk": false,
        "push-to-talk-delay": 0,
        "settings": {
            "custom_size": false,
            "id_counter": 3,
            "items": [{
                "align": 5,
                "bounds": {
                    "x": 1280.0,
                    "y": 720.0
                },
                "bounds_align": 0,
                "bounds_type": 2,
                "crop_bottom": 0,
                "crop_left": 0,
                "crop_right": 0,
                "crop_top": 0,
                "group_item_backup": false,
                "hide_transition": {
                    "duration": 0
                },
                "id": 1,
                "locked": false,
                "name": "problemas tecnicos",
                "pos": {
                    "x": 0.0,
                    "y": 0.0
                },
                "private_settings": {},
                "rot": 0.0,
                "scale": {
                    "x": 1.0,
                    "y": 1.0
                },
                "scale_filter": "disable",
                "show_transition": {
                    "duration": 0
                },
                "visible": false
            }, {
                "align": 5,
                "bounds": {
                    "x": 1280.0,
                    "y": 720.0
                },
                "bounds_align": 0,
                "bounds_type": 2,
                "crop_bottom": 0,
                "crop_left": 0,
                "crop_right": 0,
                "crop_top": 0,
                "group_item_backup": false,
                "hide_transition": {
                    "duration": 0
                },
                "id": 2,
                "locked": false,
                "name": "Problemas_Tecnicos",
                "pos": {
                    "x": 0.0,
                    "y": 0.0
                },
                "private_settings": {},
                "rot": 0.0,
                "scale": {
                    "x": 1.0,
                    "y": 1.0
                },
                "scale_filter": "disable",
                "show_transition": {
                    "duration": 0
                },
                "visible": false
            }, {
                "align": 5,
                "bounds": {
                    "x": 1280.0,
                    "y": 720.0
                },
                "bounds_align": 0,
                "bounds_type": 2,
                "crop_bottom": 0,
                "crop_left": 0,
                "crop_right": 0,
                "crop_top": 0,
                "group_item_backup": false,
                "hide_transition": {
                    "duration": 0
                },
                "id": 3,
                "locked": false,
                "name": "Intermedio",
                "pos": {
                    "x": 0.0,
                    "y": 0.0
                },
                "private_settings": {},
                "rot": 0.0,
                "scale": {
                    "x": 1.0,
                    "y": 1.0
                },
                "scale_filter": "disable",
                "show_transition": {
                    "duration": 0
                },
                "visible": false
            }]
        },
        "sync": 0,
        "versioned_id": "scene",
        "volume": 1.0
    }, {
        "balance": 0.0,
        "deinterlace_field_order": 0,
        "deinterlace_mode": 0,
        "enabled": true,
        "flags": 0,
        "hotkeys": {},
        "id": "image_source",
        "mixers": 0,
        "monitoring_type": 0,
        "muted": false,
        "name": "problemas tecnicos",
        "prev_ver": 452984833,
        "private_settings": {},
        "push-to-mute": false,
        "push-to-mute-delay": 0,
        "push-to-talk": false,
        "push-to-talk-delay": 0,
        "settings": {
            "file": "$PWD/sludxviii-trasmision/marcos/ProblemasTecnicos.png"
        },
        "sync": 0,
        "versioned_id": "image_source",
        "volume": 1.0
    }, {
        "balance": 0.0,
        "deinterlace_field_order": 0,
        "deinterlace_mode": 0,
        "enabled": true,
        "flags": 0,
        "hotkeys": {},
        "id": "xcomposite_input",
        "mixers": 0,
        "monitoring_type": 0,
        "muted": false,
        "name": "Llamada",
        "prev_ver": 452984833,
        "private_settings": {},
        "push-to-mute": false,
        "push-to-mute-delay": 0,
        "push-to-talk": false,
        "push-to-talk-delay": 0,
        "settings": {
            "capture_window": "31457282\r\nGLUD | Jitsi Meet - Brave\r\nbrave-browser",
            "cut_bot": 0,
            "cut_left": 0,
            "cut_right": 0,
            "cut_top": 0,
            "exclude_alpha": false,
            "include_border": false,
            "lock_x": false,
            "show_cursor": false,
            "swap_redblue": false
        },
        "sync": 0,
        "versioned_id": "xcomposite_input",
        "volume": 1.0
    }, {
        "balance": 0.0,
        "deinterlace_field_order": 0,
        "deinterlace_mode": 0,
        "enabled": true,
        "flags": 0,
        "hotkeys": {},
        "id": "image_source",
        "mixers": 0,
        "monitoring_type": 0,
        "muted": false,
        "name": "Frame-FIN",
        "prev_ver": 452984833,
        "private_settings": {},
        "push-to-mute": false,
        "push-to-mute-delay": 0,
        "push-to-talk": false,
        "push-to-talk-delay": 0,
        "settings": {
            "file": "$PWD/sludxviii-trasmision/marcos/FRAME_FIN.png"
        },
        "sync": 0,
        "versioned_id": "image_source",
        "volume": 1.0
    }, {
        "balance": 0.5,
        "deinterlace_field_order": 0,
        "deinterlace_mode": 0,
        "enabled": true,
        "flags": 0,
        "hotkeys": {
            "MediaSource.Pause": [],
            "MediaSource.Play": [],
            "MediaSource.Restart": [],
            "MediaSource.Stop": [],
            "libobs.mute": [],
            "libobs.push-to-mute": [],
            "libobs.push-to-talk": [],
            "libobs.unmute": []
        },
        "id": "ffmpeg_source",
        "mixers": 255,
        "monitoring_type": 0,
        "muted": false,
        "name": "1_Linux_Presentation",
        "prev_ver": 452984833,
        "private_settings": {},
        "push-to-mute": false,
        "push-to-mute-delay": 0,
        "push-to-talk": false,
        "push-to-talk-delay": 0,
        "settings": {
            "buffering_mb": 2,
            "clear_on_media_end": true,
            "is_local_file": true,
            "linear_alpha": false,
            "local_file": "$PWD/sludxviii-trasmision/SLUD_ANIMACIONES/Animaciones_Conferencistas/3_Miercoles/1_Linux/Salida_Linux.mp4",
            "looping": true,
            "reconnect_delay_sec": 10,
            "restart_on_activate": true,
            "speed_percent": 100
        },
        "sync": 0,
        "versioned_id": "ffmpeg_source",
        "volume": 1.0
    }, {
        "balance": 0.5,
        "deinterlace_field_order": 0,
        "deinterlace_mode": 0,
        "enabled": true,
        "flags": 0,
        "hotkeys": {
            "MediaSource.Pause": [],
            "MediaSource.Play": [],
            "MediaSource.Restart": [],
            "MediaSource.Stop": [],
            "libobs.mute": [],
            "libobs.push-to-mute": [],
            "libobs.push-to-talk": [],
            "libobs.unmute": []
        },
        "id": "ffmpeg_source",
        "mixers": 255,
        "monitoring_type": 0,
        "muted": false,
        "name": "2_Satelites_Presentation",
        "prev_ver": 452984833,
        "private_settings": {},
        "push-to-mute": false,
        "push-to-mute-delay": 0,
        "push-to-talk": false,
        "push-to-talk-delay": 0,
        "settings": {
            "local_file": "$PWD/sludxviii-trasmision/SLUD_ANIMACIONES/Animaciones_Conferencistas/3_Miercoles/2_Satelites/Salida_satelites.mp4",
            "looping": true
        },
        "sync": 0,
        "versioned_id": "ffmpeg_source",
        "volume": 1.0
    }, {
        "balance": 0.5,
        "deinterlace_field_order": 0,
        "deinterlace_mode": 0,
        "enabled": true,
        "flags": 0,
        "hotkeys": {
            "MediaSource.Pause": [],
            "MediaSource.Play": [],
            "MediaSource.Restart": [],
            "MediaSource.Stop": [],
            "libobs.mute": [],
            "libobs.push-to-mute": [],
            "libobs.push-to-talk": [],
            "libobs.unmute": []
        },
        "id": "ffmpeg_source",
        "mixers": 255,
        "monitoring_type": 0,
        "muted": false,
        "name": "3_VSCodium_Presentation",
        "prev_ver": 452984833,
        "private_settings": {},
        "push-to-mute": false,
        "push-to-mute-delay": 0,
        "push-to-talk": false,
        "push-to-talk-delay": 0,
        "settings": {
            "local_file": "$PWD/sludxviii-trasmision/SLUD_ANIMACIONES/Animaciones_Conferencistas/3_Miercoles/3_VSCodium/Salida_VSCodium.mp4",
            "looping": true
        },
        "sync": 0,
        "versioned_id": "ffmpeg_source",
        "volume": 1.0
    }, {
        "balance": 0.5,
        "deinterlace_field_order": 0,
        "deinterlace_mode": 0,
        "enabled": true,
        "flags": 0,
        "hotkeys": {
            "MediaSource.Pause": [],
            "MediaSource.Play": [],
            "MediaSource.Restart": [],
            "MediaSource.Stop": [],
            "libobs.mute": [],
            "libobs.push-to-mute": [],
            "libobs.push-to-talk": [],
            "libobs.unmute": []
        },
        "id": "ffmpeg_source",
        "mixers": 255,
        "monitoring_type": 0,
        "muted": false,
        "name": "4_Taller_Presentation",
        "prev_ver": 452984833,
        "private_settings": {},
        "push-to-mute": false,
        "push-to-mute-delay": 0,
        "push-to-talk": false,
        "push-to-talk-delay": 0,
        "settings": {
            "local_file": "$PWD/sludxviii-trasmision/SLUD_ANIMACIONES/Animaciones_Conferencistas/3_Miercoles/4_Taller/Salida_Taller.mp4",
            "looping": true
        },
        "sync": 0,
        "versioned_id": "ffmpeg_source",
        "volume": 1.0
    }, {
        "balance": 0.5,
        "deinterlace_field_order": 0,
        "deinterlace_mode": 0,
        "enabled": true,
        "flags": 0,
        "hotkeys": {
            "MediaSource.Pause": [],
            "MediaSource.Play": [],
            "MediaSource.Restart": [],
            "MediaSource.Stop": [],
            "libobs.mute": [],
            "libobs.push-to-mute": [],
            "libobs.push-to-talk": [],
            "libobs.unmute": []
        },
        "id": "ffmpeg_source",
        "mixers": 255,
        "monitoring_type": 0,
        "muted": false,
        "name": "5_ReactiveX_Presentation",
        "prev_ver": 452984833,
        "private_settings": {},
        "push-to-mute": false,
        "push-to-mute-delay": 0,
        "push-to-talk": false,
        "push-to-talk-delay": 0,
        "settings": {
            "buffering_mb": 2,
            "clear_on_media_end": true,
            "is_local_file": true,
            "linear_alpha": false,
            "local_file": "$PWD/sludxviii-trasmision/SLUD_ANIMACIONES/Animaciones_Conferencistas/3_Miercoles/5_ReactiveX/Salida_ReactiveX.mp4",
            "looping": true,
            "reconnect_delay_sec": 10,
            "restart_on_activate": true,
            "speed_percent": 100
        },
        "sync": 0,
        "versioned_id": "ffmpeg_source",
        "volume": 1.0
    }, {
        "balance": 0.5,
        "deinterlace_field_order": 0,
        "deinterlace_mode": 0,
        "enabled": true,
        "flags": 0,
        "hotkeys": {
            "MediaSource.Pause": [],
            "MediaSource.Play": [],
            "MediaSource.Restart": [],
            "MediaSource.Stop": [],
            "libobs.mute": [],
            "libobs.push-to-mute": [],
            "libobs.push-to-talk": [],
            "libobs.unmute": []
        },
        "id": "ffmpeg_source",
        "mixers": 255,
        "monitoring_type": 0,
        "muted": false,
        "name": "1_Linux_Name",
        "prev_ver": 452984833,
        "private_settings": {},
        "push-to-mute": false,
        "push-to-mute-delay": 0,
        "push-to-talk": false,
        "push-to-talk-delay": 0,
        "settings": {
            "buffering_mb": 2,
            "clear_on_media_end": true,
            "is_local_file": true,
            "linear_alpha": false,
            "local_file": "$PWD/sludxviii-trasmision/SLUD_ANIMACIONES/Animaciones_Texto/Dia_3/1_Linux/Salida_Linux_Texto.mov",
            "looping": true,
            "reconnect_delay_sec": 10,
            "restart_on_activate": true,
            "speed_percent": 100
        },
        "sync": 0,
        "versioned_id": "ffmpeg_source",
        "volume": 1.0
    }, {
        "balance": 0.5,
        "deinterlace_field_order": 0,
        "deinterlace_mode": 0,
        "enabled": true,
        "flags": 0,
        "hotkeys": {
            "MediaSource.Pause": [],
            "MediaSource.Play": [],
            "MediaSource.Restart": [],
            "MediaSource.Stop": [],
            "libobs.mute": [],
            "libobs.push-to-mute": [],
            "libobs.push-to-talk": [],
            "libobs.unmute": []
        },
        "id": "ffmpeg_source",
        "mixers": 255,
        "monitoring_type": 0,
        "muted": false,
        "name": "2_Satelites_Name",
        "prev_ver": 452984833,
        "private_settings": {},
        "push-to-mute": false,
        "push-to-mute-delay": 0,
        "push-to-talk": false,
        "push-to-talk-delay": 0,
        "settings": {
            "local_file": "$PWD/sludxviii-trasmision/SLUD_ANIMACIONES/Animaciones_Texto/Dia_3/2_Satelites/Salida_Satelites_Texto.mov",
            "looping": true
        },
        "sync": 0,
        "versioned_id": "ffmpeg_source",
        "volume": 1.0
    }, {
        "balance": 0.5,
        "deinterlace_field_order": 0,
        "deinterlace_mode": 0,
        "enabled": true,
        "flags": 0,
        "hotkeys": {
            "MediaSource.Pause": [],
            "MediaSource.Play": [],
            "MediaSource.Restart": [],
            "MediaSource.Stop": [],
            "libobs.mute": [],
            "libobs.push-to-mute": [],
            "libobs.push-to-talk": [],
            "libobs.unmute": []
        },
        "id": "ffmpeg_source",
        "mixers": 255,
        "monitoring_type": 0,
        "muted": false,
        "name": "3_VSCodium_Name",
        "prev_ver": 452984833,
        "private_settings": {},
        "push-to-mute": false,
        "push-to-mute-delay": 0,
        "push-to-talk": false,
        "push-to-talk-delay": 0,
        "settings": {
            "local_file": "$PWD/sludxviii-trasmision/SLUD_ANIMACIONES/Animaciones_Texto/Dia_3/3_VSCodium/Salida_VSCodium_Texto.mov",
            "looping": true
        },
        "sync": 0,
        "versioned_id": "ffmpeg_source",
        "volume": 1.0
    }, {
        "balance": 0.5,
        "deinterlace_field_order": 0,
        "deinterlace_mode": 0,
        "enabled": true,
        "flags": 0,
        "hotkeys": {
            "MediaSource.Pause": [],
            "MediaSource.Play": [],
            "MediaSource.Restart": [],
            "MediaSource.Stop": [],
            "libobs.mute": [],
            "libobs.push-to-mute": [],
            "libobs.push-to-talk": [],
            "libobs.unmute": []
        },
        "id": "ffmpeg_source",
        "mixers": 255,
        "monitoring_type": 0,
        "muted": false,
        "name": "4_Taller_Name",
        "prev_ver": 452984833,
        "private_settings": {},
        "push-to-mute": false,
        "push-to-mute-delay": 0,
        "push-to-talk": false,
        "push-to-talk-delay": 0,
        "settings": {
            "local_file": "$PWD/sludxviii-trasmision/SLUD_ANIMACIONES/Animaciones_Texto/Dia_3/4_Taller/Salida_Taller_Texto.mov",
            "looping": true
        },
        "sync": 0,
        "versioned_id": "ffmpeg_source",
        "volume": 1.0
    }, {
        "balance": 0.5,
        "deinterlace_field_order": 0,
        "deinterlace_mode": 0,
        "enabled": true,
        "flags": 0,
        "hotkeys": {
            "MediaSource.Pause": [],
            "MediaSource.Play": [],
            "MediaSource.Restart": [],
            "MediaSource.Stop": [],
            "libobs.mute": [],
            "libobs.push-to-mute": [],
            "libobs.push-to-talk": [],
            "libobs.unmute": []
        },
        "id": "ffmpeg_source",
        "mixers": 255,
        "monitoring_type": 0,
        "muted": false,
        "name": "5_ReactiveX_Name",
        "prev_ver": 452984833,
        "private_settings": {},
        "push-to-mute": false,
        "push-to-mute-delay": 0,
        "push-to-talk": false,
        "push-to-talk-delay": 0,
        "settings": {
            "local_file": "$PWD/sludxviii-trasmision/SLUD_ANIMACIONES/Animaciones_Texto/Dia_3/5_Reactivex/Salida_ReactiveX_Texto.mov",
            "looping": true
        },
        "sync": 0,
        "versioned_id": "ffmpeg_source",
        "volume": 1.0
    }, {
        "balance": 0.5,
        "deinterlace_field_order": 0,
        "deinterlace_mode": 0,
        "enabled": true,
        "flags": 0,
        "hotkeys": {
            "MediaSource.Pause": [],
            "MediaSource.Play": [],
            "MediaSource.Restart": [],
            "MediaSource.Stop": [],
            "libobs.mute": [],
            "libobs.push-to-mute": [],
            "libobs.push-to-talk": [],
            "libobs.unmute": []
        },
        "id": "ffmpeg_source",
        "mixers": 255,
        "monitoring_type": 0,
        "muted": false,
        "name": "Problemas_Tecnicos",
        "prev_ver": 452984833,
        "private_settings": {},
        "push-to-mute": false,
        "push-to-mute-delay": 0,
        "push-to-talk": false,
        "push-to-talk-delay": 0,
        "settings": {
            "local_file": "$PWD/sludxviii-trasmision/SLUD_ANIMACIONES/Animaciones_Generales/Problemas_Tecnicos.mp4",
            "looping": true
        },
        "sync": 0,
        "versioned_id": "ffmpeg_source",
        "volume": 1.0
    }, {
        "balance": 0.5,
        "deinterlace_field_order": 0,
        "deinterlace_mode": 0,
        "enabled": true,
        "flags": 0,
        "hotkeys": {
            "MediaSource.Pause": [],
            "MediaSource.Play": [],
            "MediaSource.Restart": [],
            "MediaSource.Stop": [],
            "libobs.mute": [],
            "libobs.push-to-mute": [],
            "libobs.push-to-talk": [],
            "libobs.unmute": []
        },
        "id": "ffmpeg_source",
        "mixers": 255,
        "monitoring_type": 0,
        "muted": false,
        "name": "Marco_General",
        "prev_ver": 452984833,
        "private_settings": {},
        "push-to-mute": false,
        "push-to-mute-delay": 0,
        "push-to-talk": false,
        "push-to-talk-delay": 0,
        "settings": {
            "local_file": "$PWD/sludxviii-trasmision/SLUD_ANIMACIONES/Animaciones_Generales/Marco_General.mov",
            "looping": true
        },
        "sync": 0,
        "versioned_id": "ffmpeg_source",
        "volume": 1.0
    }, {
        "balance": 0.5,
        "deinterlace_field_order": 0,
        "deinterlace_mode": 0,
        "enabled": true,
        "flags": 0,
        "hotkeys": {
            "MediaSource.Pause": [],
            "MediaSource.Play": [],
            "MediaSource.Restart": [],
            "MediaSource.Stop": [],
            "libobs.mute": [],
            "libobs.push-to-mute": [],
            "libobs.push-to-talk": [],
            "libobs.unmute": []
        },
        "id": "ffmpeg_source",
        "mixers": 255,
        "monitoring_type": 0,
        "muted": false,
        "name": "Redes_Sociales",
        "prev_ver": 452984833,
        "private_settings": {},
        "push-to-mute": false,
        "push-to-mute-delay": 0,
        "push-to-talk": false,
        "push-to-talk-delay": 0,
        "settings": {
            "local_file": "$PWD/sludxviii-trasmision/SLUD_ANIMACIONES/Animaciones_Generales/Redes_Sociales_GLUD.mov",
            "looping": true
        },
        "sync": 0,
        "versioned_id": "ffmpeg_source",
        "volume": 1.0
    }, {
        "balance": 0.5,
        "deinterlace_field_order": 0,
        "deinterlace_mode": 0,
        "enabled": true,
        "flags": 0,
        "hotkeys": {
            "MediaSource.Pause": [],
            "MediaSource.Play": [],
            "MediaSource.Restart": [],
            "MediaSource.Stop": [],
            "libobs.mute": [],
            "libobs.push-to-mute": [],
            "libobs.push-to-talk": [],
            "libobs.unmute": []
        },
        "id": "ffmpeg_source",
        "mixers": 255,
        "monitoring_type": 0,
        "muted": false,
        "name": "Intermedio",
        "prev_ver": 452984833,
        "private_settings": {},
        "push-to-mute": false,
        "push-to-mute-delay": 0,
        "push-to-talk": false,
        "push-to-talk-delay": 0,
        "settings": {
            "local_file": "$PWD/sludxviii-trasmision/SLUD_ANIMACIONES/Animaciones_Generales/Intermedios.mp4",
            "looping": true
        },
        "sync": 0,
        "versioned_id": "ffmpeg_source",
        "volume": 1.0
    }, {
        "balance": 0.5,
        "deinterlace_field_order": 0,
        "deinterlace_mode": 0,
        "enabled": true,
        "flags": 0,
        "hotkeys": {
            "MediaSource.Pause": [],
            "MediaSource.Play": [],
            "MediaSource.Restart": [],
            "MediaSource.Stop": [],
            "libobs.mute": [],
            "libobs.push-to-mute": [],
            "libobs.push-to-talk": [],
            "libobs.unmute": []
        },
        "id": "ffmpeg_source",
        "mixers": 255,
        "monitoring_type": 0,
        "muted": false,
        "name": "Linux",
        "prev_ver": 452984833,
        "private_settings": {},
        "push-to-mute": false,
        "push-to-mute-delay": 0,
        "push-to-talk": false,
        "push-to-talk-delay": 0,
        "settings": {
            "buffering_mb": 2,
            "clear_on_media_end": true,
            "is_local_file": true,
            "linear_alpha": false,
            "looping": false,
            "reconnect_delay_sec": 10,
            "restart_on_activate": true,
            "speed_percent": 100
        },
        "sync": 0,
        "versioned_id": "ffmpeg_source",
        "volume": 1.0
    }, {
        "balance": 0.5,
        "deinterlace_field_order": 0,
        "deinterlace_mode": 0,
        "enabled": true,
        "flags": 0,
        "hotkeys": {},
        "id": "image_source",
        "mixers": 0,
        "monitoring_type": 0,
        "muted": false,
        "name": "Linux_Professional_Institute",
        "prev_ver": 452984833,
        "private_settings": {},
        "push-to-mute": false,
        "push-to-mute-delay": 0,
        "push-to-talk": false,
        "push-to-talk-delay": 0,
        "settings": {
            "file": "$PWD/sludxviii-trasmision/sponsors/photo_2021-05-28_20-55-44.jpg",
            "linear_alpha": false,
            "unload": false
        },
        "sync": 0,
        "versioned_id": "image_source",
        "volume": 1.0
    }, {
        "balance": 0.5,
        "deinterlace_field_order": 0,
        "deinterlace_mode": 0,
        "enabled": true,
        "flags": 0,
        "hotkeys": {},
        "id": "image_source",
        "mixers": 0,
        "monitoring_type": 0,
        "muted": false,
        "name": "Jorge_Sanabria",
        "prev_ver": 452984833,
        "private_settings": {},
        "push-to-mute": false,
        "push-to-mute-delay": 0,
        "push-to-talk": false,
        "push-to-talk-delay": 0,
        "settings": {
            "file": "$PWD/sludxviii-trasmision/sponsors/photo_2021-08-18_17-59-16.jpg"
        },
        "sync": 0,
        "versioned_id": "image_source",
        "volume": 1.0
    }, {
        "balance": 0.5,
        "deinterlace_field_order": 0,
        "deinterlace_mode": 0,
        "enabled": true,
        "flags": 0,
        "hotkeys": {},
        "id": "image_source",
        "mixers": 0,
        "monitoring_type": 0,
        "muted": false,
        "name": "Jorels",
        "prev_ver": 452984833,
        "private_settings": {},
        "push-to-mute": false,
        "push-to-mute-delay": 0,
        "push-to-talk": false,
        "push-to-talk-delay": 0,
        "settings": {
            "file": "$PWD/sludxviii-trasmision/sponsors/photo_2021-08-22_21-45-49.jpg"
        },
        "sync": 0,
        "versioned_id": "image_source",
        "volume": 1.0
    }],
    "transition_duration": 300,
    "transitions": []
}