<?xml version="1.0" encoding="UTF-8" standalone="no"?>
<svg
   xmlns:dc="http://purl.org/dc/elements/1.1/"
   xmlns:cc="http://creativecommons.org/ns#"
   xmlns:rdf="http://www.w3.org/1999/02/22-rdf-syntax-ns#"
   xmlns:svg="http://www.w3.org/2000/svg"
   xmlns="http://www.w3.org/2000/svg"
   xmlns:sodipodi="http://sodipodi.sourceforge.net/DTD/sodipodi-0.dtd"
   xmlns:inkscape="http://www.inkscape.org/namespaces/inkscape"
   width="28.560581mm"
   height="16.613693mm"
   viewBox="0 0 28.560581 16.613693"
   version="1.1"
   id="svg8"
   inkscape:export-filename="/home/juferoga/Logo_Slud1.png"
   inkscape:export-xdpi="96"
   inkscape:export-ydpi="96"
   inkscape:version="1.0.2 (e86c870879, 2021-01-15)"
   sodipodi:docname="Intento-Remix.svg">
  <defs
     id="defs2" />
  <sodipodi:namedview
     id="base"
     pagecolor="#ffffff"
     bordercolor="#666666"
     borderopacity="1.0"
     inkscape:pageopacity="0.0"
     inkscape:pageshadow="2"
     inkscape:zoom="1.166351"
     inkscape:cx="-46.219599"
     inkscape:cy="-84.008636"
     inkscape:document-units="mm"
     inkscape:current-layer="g1650"
     inkscape:document-rotation="0"
     showgrid="false"
     inkscape:window-width="1269"
     inkscape:window-height="707"
     inkscape:window-x="0"
     inkscape:window-y="0"
     inkscape:window-maximized="0" />
  <metadata
     id="metadata5">
    <rdf:RDF>
      <cc:Work
         rdf:about="">
        <dc:format>image/svg+xml</dc:format>
        <dc:type
           rdf:resource="http://purl.org/dc/dcmitype/StillImage" />
        <dc:title></dc:title>
      </cc:Work>
    </rdf:RDF>
  </metadata>
  <g
     inkscape:label="Capa 1"
     inkscape:groupmode="layer"
     id="layer1"
     transform="translate(-149.54048,-155.03552)">
    <g
       id="g1584"
       transform="matrix(0.26458333,0,0,0.26458333,96.727265,155.11471)">
	
	
	<g
   id="g1520"
   transform="matrix(1,0,0,-1,0,102.32434)">
		<g
   id="g1518"
   transform="translate(-0.11191809,-16.615836)">
			
			<path
   class="st1"
   d="m 76.6223,116.83458 c 1.04061,-0.9204 1.54069,-2.75613 0.74658,-3.86039 -0.66783,-1.16791 -2.53387,-1.2568 -3.09963,-0.1798 -0.44049,0.69711 -0.0899,1.54981 0.66985,1.80036 0.75976,0.25055 1.29319,-1.04771 0.53343,-1.29825 2.12166,0.91026 0.51428,2.59143 0.51428,2.59143 -1.41846,1.42758 -4.14429,-0.5243 -3.64623,-2.99249 0.0929,-0.60114 0.37582,-1.13963 0.75367,-1.64681 0.22125,-0.0323 0.5688,-0.12832 0.79006,-0.16065 0.85269,-0.35058 1.54677,-0.85878 2.11354,-1.61954 0.56678,-0.76077 0.84864,-1.61549 1.00422,-2.40657 0.0919,-0.91735 0.0576,-1.77106 -0.29301,-2.62376 -0.35059,-0.8527 -1.04872,-1.60941 -1.87212,-1.98624 -0.44353,-0.25157 -0.9497,-0.31319 -1.36089,-0.34349 -0.4112,-0.0303 -0.94868,0.003 -1.42251,0.16267 -0.47384,0.15963 -0.97899,0.41424 -1.32552,0.82645 -0.34653,0.4122 -0.59809,0.85573 -0.75468,1.33058 -0.1869,0.88604 -0.0566,2.08729 0.83151,2.90664 0.41221,0.34653 1.14064,0.69205 1.83573,0.50009 0.69509,-0.19197 1.23055,-0.85777 1.38714,-1.33261 v 0 c 0.15659,-0.47485 -0.098,-0.98 -0.57285,-1.13659 -0.47485,-0.1566 -0.98,0.098 -1.13659,0.57285 -0.0626,0.18994 -0.15761,0.15862 -0.0626,0.18994 0,0 -0.095,-0.0313 -0.18994,-0.0626 -0.25359,-0.18892 -0.41322,-0.66276 -0.25663,-1.1376 0.15659,-0.47485 0.34552,-0.72844 0.81935,-0.88807 0.47383,-0.15963 1.07497,-0.0667 1.54981,0.0899 0.91838,0.40815 1.45991,1.63971 1.27403,2.84198 -0.18588,1.20227 -0.87793,2.34291 -1.95189,2.72583 -0.97898,0.41423 -2.4025,0.26068 -3.44818,-0.40005 -1.71147,-1.19618 -2.73191,-3.84924 -0.90733,-6.82764 0.69205,-1.14065 1.76398,-2.15602 2.80459,-3.076419 3.05918,-2.571264 7.4156,-4.925325 10.88598,-7.466284 2.49241,-1.810497 5.39398,-4.223141 5.54247,-7.227796 0.0303,-0.411195 0.0293,-0.727422 -0.0667,-1.074966 0.79208,0.471805 1.71045,0.879959 2.69147,1.098175 1.20226,0.185884 2.46717,0.18183 3.54112,-0.201088 2.93796,-0.926482 5.9335,-3.624034 6.39618,-7.262155 0.0626,-0.189938 0.86678,-5.821399 -5.12236,-9.691823 -2.59853,-1.69931 -7.63392,-3.991644 -13.31383,-0.178685 -1.7357,1.112366 -3.21679,2.729884 -4.38166,4.346387 -1.19618,1.711473 -1.91752,3.579539 -2.63886,5.447604 -2.16098,6.552875 -2.14274,12.244946 -1.0475,18.502777 -1.19922,0.762795 -2.42977,1.620558 -3.59666,2.60461 -1.1669,0.984051 -2.27014,2.094393 -3.1198,3.393653 -2.2974,3.45427 -1.24159,7.27726 1.32562,9.07154 0.85574,0.59809 1.99537,0.97391 3.03902,1.00219 -0.22025,0.34856 -0.34552,0.72843 -0.4708,1.10831 -1.03249,3.45021 2.95925,5.71427 5.00915,3.96843 z m 8.64077,-37.058158 c 0.0323,0.221256 0.19095,0.378863 0.22328,0.60012 -0.47484,-0.156593 -1.01233,-0.123247 -1.45484,-0.05858 0.59911,-0.53951 0.97594,-1.362915 1.03655,-2.185305 0.002,0.632452 0.0354,1.169935 0.19501,1.643768 z M 88.7,66.8 c 0,0 0.095,0.03132 0,0 1.16993,-0.03537 2.34088,0.24548 3.38554,0.589984 0,0 0,0 0,0 1.96304,0.752658 3.42194,2.076145 4.88185,3.715859 1.20733,1.767014 1.81455,3.757313 1.53572,5.560714 -0.52633,3.511834 -4.47156,5.8962 -7.16201,5.11425 -3.79776,-0.936515 -3.71596,-5.016136 -1.81962,-5.338444 1.01131,-0.192979 1.73569,-1.112366 1.54272,-2.123682 -0.45164,-2.781371 -4.55853,-1.503289 -5.68701,1.599376 -0.21923,0.664785 -0.31217,1.265918 -0.40511,1.867052 -0.0667,-1.074966 -0.70219,-2.021617 -1.71553,-2.46109 -1.10831,-0.470792 -2.62376,0.293016 -2.84198,1.274027 -0.12426,0.696103 0.41525,1.295209 0.8901,1.451802 0.6961,0.12426 1.45281,-0.57387 1.07091,-1.331596 1.58113,-0.0051 1.52356,1.766001 0.86182,2.49545 -0.63043,0.634479 -1.26187,0.952733 -2.14791,0.765835 -1.48717,-0.27984 -2.24997,-1.479066 -2.6339,-2.869245 -0.4486,-1.832692 0.0838,-3.447169 0.83749,-5.093978 1.00726,-1.457883 2.23679,-2.631873 3.71992,-3.616938 C 84.84366,67.318328 86.80264,66.806082 88.7,66.8 Z M 75.44405,94.544185 c -0.83962,-5.436455 -0.7629,-11.097207 1.24149,-17.175236 0.21922,-0.664784 0.50211,-1.203281 0.72133,-1.868065 -0.0909,1.233586 0.16572,2.371189 0.67493,3.381491 0.85877,1.546771 2.53791,2.5217 4.08671,2.295375 -0.47282,0.47586 -0.7557,1.014356 -0.87996,1.710459 -0.33741,3.258245 3.86952,3.592612 4.30494,1.314365 0.0616,-0.506165 -0.31927,-0.947665 -0.73047,-0.97797 -0.50616,-0.06162 -0.94766,0.319267 -0.97797,0.730463 0.0626,-0.189939 0.0636,0.126287 -0.37886,0.190952 -1.42251,0.162674 -1.30636,-3.063238 1.66799,-2.503559 1.86705,0.405114 2.66725,3.406728 -0.0747,6.293204 -1.92259,1.998408 -4.5423,3.556329 -7.03572,5.050599 0,0 0,0 -0.12629,0.06365 1.10223,-1.426565 1.91955,-2.947086 2.16706,-4.655518 0.12325,-1.012329 0.0566,-2.087295 -0.51529,-2.907659 -0.41322,-0.662757 -1.61853,-1.797319 -3.32291,-0.779922 -0.82036,0.571842 -1.48109,1.617517 -0.68799,2.405548 0.69813,0.756713 1.70742,-0.06872 1.79935,-0.986078 1.39018,-0.383931 2.09135,1.32146 1.55792,2.61971 -0.15659,0.474846 -0.34349,1.360887 -1.31842,3.040028 -0.47181,0.792086 -1.03858,1.552853 -1.60535,2.313621 -0.15761,0.158619 -0.31522,0.317239 -0.56779,0.444541 0,0 0,0 0,10e-7 z"
   id="path1512" />

			<path
   class="st1"
   d="m 93.219587,59.165731 c 1.677062,-0.327813 2.810053,1.990879 1.576288,3.305346 -0.756757,0.88731 -2.318692,1.132991 -3.468895,0.129481 -0.969442,-0.871884 -1.658778,-2.812198 -0.605774,-4.25829 0.921378,-1.265331 3.091946,-2.118931 5.968348,-1.130847 1.347821,0.42823 2.448888,1.119353 3.648586,1.826973 1.10107,0.691123 2.20213,1.382246 3.2867,2.171999 2.18564,1.480875 4.27265,2.945253 6.50778,4.130239 2.05437,1.053361 4.84864,1.926318 6.77281,0.727335 2.26955,-1.445377 2.50124,-4.042746 1.02251,-5.506766 -1.97152,-2.154785 -6.24738,0.374447 -4.29236,2.627862 0.69005,0.723761 1.6932,0.181834 1.85782,-0.196187 0.0165,-0.09863 0.033,-0.197259 0.033,-0.197259 -0.0986,-0.0165 -0.92066,0.04878 -0.98594,-0.773255 -0.11441,-1.134421 1.61179,-1.149846 2.26884,-0.228826 1.5935,1.990165 -2.2387,4.897776 -4.25936,2.430603 -1.10071,-1.299399 -1.08314,-3.222857 0.26575,-4.619456 1.59565,-1.659493 4.68652,-1.953595 6.39515,-0.04556 2.07015,2.171283 1.75562,5.870077 -1.40196,7.77525 -2.38468,1.527509 -5.57347,0.588561 -8.10449,-0.645919 -2.43239,-1.217982 -4.5029,-2.780989 -6.68854,-4.261864 -2.087,-1.464378 -4.256144,-3.043883 -6.540768,-3.93298 -4.388486,-1.646569 -6.39622,1.87039 -4.325711,3.433397 1.068071,0.888383 2.482598,-0.294459 1.693918,-1.034718 -0.08213,-0.115128 -0.19726,-0.033 -0.09863,-0.0165 -1.134421,0.114413 -1.478731,-1.46402 -0.525072,-1.710058 z"
   id="path1514" />

			<path
   class="st1"
   d="m 151.33474,59.967434 c -1.66541,-0.382637 -2.87383,1.897651 -1.68384,3.251873 0.72725,0.911651 2.28029,1.208424 3.46279,0.243176 0.99751,-0.839622 1.75011,-2.756284 0.7451,-4.236133 -0.87939,-1.294868 -3.02079,-2.219193 -5.92805,-1.325974 -1.36114,0.383796 -2.48428,1.038437 -3.70654,1.706332 -1.12314,0.654641 -2.24628,1.309282 -3.35617,2.063041 -2.23303,1.408399 -4.36694,2.803544 -6.63973,3.91459 -2.08781,0.98542 -4.9092,1.766267 -6.79302,0.504825 -2.22093,-1.519032 -2.36731,-4.122601 -0.84136,-5.537338 2.04113,-2.088969 6.23174,0.579133 4.20387,2.76722 -0.71342,0.700741 -1.69826,0.126206 -1.8504,-0.25701 -0.0132,-0.09912 -0.0265,-0.198236 -0.0265,-0.198236 0.0991,-0.01325 0.91856,0.07895 1.01076,-0.740504 0.15156,-1.130058 -1.5732,-1.202087 -2.26011,-0.303111 -1.65791,1.936834 2.07687,4.968561 4.17736,2.568984 1.14273,-1.262601 1.18825,-3.185601 -0.11411,-4.625687 -1.54037,-1.71093 -4.61993,-2.106241 -6.39022,-0.25527 -2.14025,2.102223 -1.94719,5.809342 1.14621,7.817045 2.33331,1.604895 5.55117,0.771031 8.12132,-0.379778 2.47102,-1.137555 4.59168,-2.631818 6.82471,-4.040218 2.13391,-1.395145 4.35368,-2.902662 6.66623,-3.716355 4.44013,-1.501759 6.33144,2.079153 4.21079,3.573416 -1.09664,0.852876 -2.47161,-0.37572 -1.65908,-1.089715 0.0859,-0.112372 0.19824,-0.02651 0.0991,-0.01326 1.13006,0.151555 1.52595,-1.414736 0.58087,-1.691918 z"
   id="path1516"
   inkscape:transform-center-x="1.6138818"
   inkscape:transform-center-y="0.64622192" />

		<path
   class="st1"
   d="m 166.48774,118.30818 c -1.04061,-0.9204 -1.54069,-2.75613 -0.74658,-3.86039 0.66783,-1.16791 2.53387,-1.2568 3.09963,-0.1798 0.44049,0.69711 0.0899,1.54981 -0.66985,1.80036 -0.75976,0.25055 -1.29319,-1.04771 -0.53343,-1.29825 -2.12166,0.91026 -0.51428,2.59143 -0.51428,2.59143 1.41846,1.42758 4.14429,-0.5243 3.64623,-2.99249 -0.0929,-0.60114 -0.37582,-1.13963 -0.75367,-1.64681 -0.22125,-0.0323 -0.5688,-0.12832 -0.79006,-0.16065 -0.85269,-0.35058 -1.54677,-0.85878 -2.11354,-1.61954 -0.56678,-0.76077 -0.84864,-1.61549 -1.00422,-2.40657 -0.0919,-0.91735 -0.0576,-1.77106 0.29301,-2.62376 0.35059,-0.85269 1.04872,-1.60941 1.87212,-1.98624 0.44353,-0.25156 0.9497,-0.31319 1.36089,-0.34349 0.4112,-0.0303 0.94868,0.003 1.42251,0.16267 0.47384,0.15964 0.97899,0.41424 1.32552,0.82645 0.34653,0.41221 0.59809,0.85573 0.75468,1.33058 0.1869,0.88604 0.0566,2.08729 -0.83151,2.90664 -0.41221,0.34653 -1.14064,0.69205 -1.83573,0.50009 -0.69509,-0.19197 -1.23055,-0.85777 -1.38714,-1.33261 v 0 c -0.15659,-0.47485 0.098,-0.98 0.57285,-1.13659 0.47485,-0.15659 0.98,0.098 1.13659,0.57286 0.0626,0.18993 0.15761,0.15861 0.0626,0.18993 0,0 0.095,-0.0313 0.18994,-0.0626 0.25359,-0.18892 0.41322,-0.66275 0.25663,-1.1376 -0.15659,-0.47485 -0.34552,-0.72843 -0.81935,-0.88807 -0.47383,-0.15963 -1.07497,-0.0667 -1.54981,0.0899 -0.91838,0.40816 -1.45991,1.63971 -1.27403,2.84198 0.18588,1.20227 0.87793,2.34291 1.95189,2.72583 0.97898,0.41423 2.4025,0.26068 3.44818,-0.40005 1.71147,-1.19618 2.73191,-3.84924 0.90733,-6.82764 -0.69205,-1.14065 -1.76398,-2.15602 -2.80459,-3.07642 -3.05918,-2.57126 -7.4156,-4.925321 -10.88598,-7.46628 -2.49241,-1.810497 -5.39398,-4.223141 -5.54247,-7.227796 -0.0303,-0.411195 -0.0293,-0.727422 0.0667,-1.074966 -0.79208,0.471805 -1.71045,0.879959 -2.69147,1.098175 -1.20226,0.185884 -2.46717,0.18183 -3.54112,-0.201088 -2.93796,-0.926482 -5.9335,-3.624034 -6.39618,-7.262155 -0.0626,-0.189938 -0.86678,-5.821399 5.12236,-9.691823 2.59853,-1.69931 7.63392,-3.991644 13.31383,-0.178685 1.7357,1.112366 3.21679,2.729884 4.38166,4.346387 1.19618,1.711473 1.91752,3.579539 2.63886,5.447604 2.16098,6.552875 2.14274,12.244946 1.0475,18.502777 1.19922,0.7628 2.42977,1.62056 3.59666,2.60461 1.1669,0.98405 2.27014,2.09439 3.1198,3.39365 2.2974,3.45427 1.24159,7.27726 -1.32562,9.07154 -0.85574,0.59809 -1.99537,0.97391 -3.03902,1.00219 0.22025,0.34856 0.34552,0.72843 0.4708,1.10831 1.03249,3.45021 -2.95925,5.71427 -5.00915,3.96843 z m -8.64077,-37.058155 c -0.0323,0.221256 -0.19095,0.378863 -0.22328,0.60012 0.47484,-0.156593 1.01233,-0.123247 1.45484,-0.05858 -0.59911,-0.53951 -0.97594,-1.362915 -1.03655,-2.185305 -0.002,0.632452 -0.0354,1.169935 -0.19501,1.643768 z m -3.43693,-12.976422 c 0,0 -0.095,0.03132 0,0 -1.16993,-0.03537 -2.34088,0.24548 -3.38554,0.589984 0,0 0,0 0,0 -1.96304,0.752658 -3.42194,2.076145 -4.88185,3.715859 -1.20733,1.767014 -1.81455,3.757313 -1.53572,5.560714 0.52633,3.511834 4.47156,5.8962 7.16201,5.11425 3.79776,-0.936515 3.71596,-5.016136 1.81962,-5.338444 -1.01131,-0.192979 -1.73569,-1.112366 -1.54272,-2.123682 0.45164,-2.781371 4.55853,-1.503289 5.68701,1.599376 0.21923,0.664785 0.31217,1.265918 0.40511,1.867052 0.0667,-1.074966 0.70219,-2.021617 1.71553,-2.46109 1.10831,-0.470792 2.62376,0.293016 2.84198,1.274027 0.12426,0.696103 -0.41525,1.295209 -0.8901,1.451802 -0.6961,0.12426 -1.45281,-0.57387 -1.07091,-1.331596 -1.58113,-0.0051 -1.52356,1.766001 -0.86182,2.49545 0.63043,0.634479 1.26187,0.952733 2.14791,0.765835 1.48717,-0.27984 2.24997,-1.479066 2.6339,-2.869245 0.4486,-1.832692 -0.0838,-3.447169 -0.83749,-5.093978 -1.00726,-1.457883 -2.23679,-2.631873 -3.71992,-3.616938 -1.83066,-1.081048 -3.78964,-1.593294 -5.687,-1.599376 z m 13.25595,27.744187 c 0.83962,-5.436457 0.7629,-11.097209 -1.24149,-17.175238 -0.21922,-0.664784 -0.50211,-1.203281 -0.72133,-1.868065 0.0909,1.233586 -0.16572,2.371189 -0.67493,3.381491 -0.85877,1.546771 -2.53791,2.5217 -4.08671,2.295375 0.47282,0.47586 0.7557,1.014356 0.87996,1.710459 0.33741,3.258245 -3.86952,3.592612 -4.30494,1.314365 -0.0616,-0.506165 0.31927,-0.947665 0.73047,-0.97797 0.50616,-0.06162 0.94766,0.319267 0.97797,0.730463 -0.0626,-0.189939 -0.0636,0.126287 0.37886,0.190952 1.42251,0.162674 1.30636,-3.063238 -1.66799,-2.503559 -1.86705,0.405114 -2.66725,3.406728 0.0747,6.293204 1.92259,1.998408 4.5423,3.556329 7.03572,5.050599 0,0 0,0 0.12629,0.06365 -1.10223,-1.426565 -1.91955,-2.947086 -2.16706,-4.655518 -0.12325,-1.012329 -0.0566,-2.087295 0.51529,-2.907659 0.41322,-0.662757 1.61853,-1.797319 3.32291,-0.779922 0.82036,0.571842 1.48109,1.617517 0.68799,2.405548 -0.69813,0.756713 -1.70742,-0.06872 -1.79935,-0.986078 -1.39018,-0.383931 -2.09135,1.32146 -1.55792,2.61971 0.15659,0.474846 0.34349,1.360887 1.31842,3.040028 0.47181,0.792086 1.03858,1.552853 1.60535,2.313621 0.15761,0.158619 0.31522,0.317239 0.56779,0.444544 0,0 0,0 0,0 z"
   id="path1640" />
</g>

	<g
   id="g1650"
   transform="translate(132.06349,-16.634205)">
			
			<path
   class="st1"
   d="m 90.185921,65.548099 c -1.000313,0.964043 -1.421461,2.819473 -0.580871,3.888776 0.717146,1.138294 2.58528,1.147332 3.104483,0.04713 0.410286,-0.715303 0.02357,-1.552236 -0.746201,-1.770079 -0.769776,-0.217842 -1.24722,1.102034 -0.477444,1.319866 -2.158633,-0.818729 -0.62459,-2.567076 -0.62459,-2.567076 1.356137,-1.486912 4.162915,0.346658 3.770822,2.833883 -0.06712,0.604562 -0.326759,1.154654 -0.682583,1.677523 -0.219667,0.04173 -0.562794,0.152518 -0.78247,0.194277 -0.836924,0.386711 -1.508644,0.924118 -2.042375,1.708411 -0.53374,0.784303 -0.778804,1.650291 -0.900424,2.447299 -0.0526,0.92044 0.01816,1.771903 0.404904,2.608836 0.386721,0.836933 1.116561,1.563107 1.955317,1.904393 0.453879,0.23238 0.962221,0.272306 1.37433,0.285 0.412119,0.01269 0.947685,-0.04355 1.414256,-0.223331 0.466583,-0.17974 0.960387,-0.455712 1.288979,-0.882359 0.328592,-0.426637 0.560962,-0.880515 0.697109,-1.361625 0.148852,-0.89322 -0.03268,-2.087801 -0.955004,-2.868437 -0.426647,-0.328592 -1.169182,-0.642657 -1.85543,-0.421158 -0.686249,0.221509 -1.192757,0.90959 -1.328905,1.39069 v 0 c -0.136148,0.48111 0.139804,0.974915 0.620914,1.111062 0.48111,0.136158 0.974915,-0.139804 1.111062,-0.620913 0.05442,-0.192443 0.150685,-0.165213 0.05442,-0.192443 0,0 0.09625,0.02721 0.192443,0.05442 0.261434,0.177907 0.441174,0.64449 0.305026,1.12559 -0.136148,0.48111 -0.314064,0.742544 -0.780637,0.922284 -0.466573,0.17974 -1.071136,0.112592 -1.552237,-0.02357 -0.934988,-0.368517 -1.52867,-1.575802 -1.394356,-2.784919 0.134315,-1.209117 0.776972,-2.378298 1.833581,-2.806778 0.960377,-0.455702 2.38916,-0.363146 3.462129,0.252279 1.761041,1.121924 2.893962,3.728936 1.198373,6.782612 -0.642657,1.169191 -1.670201,2.229456 -2.670514,3.193499 -2.946466,2.699689 -7.198271,5.237828 -10.556856,7.924818 -2.412735,1.915389 -5.208516,4.449866 -5.228425,7.458122 -0.01269,0.412114 0.0018,0.728009 0.112592,1.071132 -0.811525,-0.437514 -1.746503,-0.806035 -2.735955,-0.982115 -1.209107,-0.134319 -2.472688,-0.0762 -3.529287,0.352282 -2.895668,1.051229 -5.773153,3.87437 -6.079886,7.52895 -0.05442,0.19244 -0.617131,5.85313 5.531989,9.46398 2.668798,1.58668 7.797579,3.66166 13.309298,-0.39062 1.686561,-1.18555 3.097151,-2.8649 4.191853,-4.52972 1.121923,-1.76105 1.762747,-3.65824 2.40357,-5.55544 1.878879,-6.63926 1.617327,-12.325348 0.255575,-18.530639 1.165516,-0.813362 2.358273,-1.722946 3.482029,-2.755981 1.123767,-1.033035 2.178533,-2.189524 2.971874,-3.523918 2.147641,-3.549322 0.929371,-7.323683 -1.712203,-9.006579 -0.880525,-0.560961 -2.035179,-0.88772 -3.079084,-0.87136 0.205148,-0.357656 0.314064,-0.742534 0.422991,-1.127423 0.884054,-3.491193 -3.200822,-5.582542 -5.174216,-3.750668 z m -7.048688,37.393661 c -0.04173,-0.21967 -0.206971,-0.37035 -0.24873,-0.59002 0.4811,0.13615 1.016673,0.0799 1.456014,-0.004 -0.575499,0.56463 -0.916785,1.40339 -0.942183,2.22762 -0.02904,-0.63179 -0.08538,-1.16735 -0.265101,-1.63393 z m -2.879064,13.11149 c 0,0 -0.09625,-0.0272 0,0 -1.167349,0.0854 -2.349234,-0.14519 -3.407666,-0.44472 0,0 0,0 0,0 -1.993421,-0.66805 -3.507565,-1.92796 -5.036235,-3.50377 -1.281764,-1.71379 -1.973511,-3.67631 -1.772029,-5.48998 0.375723,-3.53112 4.215418,-6.08196 6.936836,-5.41574 3.834323,0.77331 3.926996,4.8527 2.046167,5.25578 -1.002136,0.23603 -1.686551,1.18554 -1.450525,2.18769 0.570127,2.75952 4.618626,1.30704 5.61344,-1.84103 0.190611,-0.67355 0.257769,-1.27811 0.324926,-1.88266 0.112592,1.07113 0.787969,1.98975 1.81917,2.3855 1.127423,0.42298 2.608836,-0.40491 2.784919,-1.39435 0.09439,-0.70078 -0.470239,-1.27628 -0.951349,-1.41243 -0.700775,-0.0944 -1.426949,0.63545 -1.013007,1.37616 -1.579466,0.0727 -1.597661,-1.69925 -0.967709,-2.45632 0.602731,-0.66085 1.219989,-1.00581 2.113208,-0.85696 1.497774,0.21601 2.311141,1.38153 2.754149,2.75403 0.526535,1.81184 0.06364,3.4476 -0.618964,5.12512 -0.944017,1.49961 -2.122237,2.72509 -3.561901,3.77265 -1.782773,1.15832 -3.718065,1.75384 -5.61343,1.84103 z M 92.315977,87.767749 c 1.071253,5.395593 1.236592,11.05445 -0.506139,17.212611 -0.190601,0.67355 -0.450212,1.22364 -0.640813,1.89719 0.03808,-1.23634 -0.266934,-2.36193 -0.818867,-3.34955 -0.924107,-1.50864 -2.643389,-2.4109 -4.181098,-2.11857 0.452045,-0.49564 0.711647,-1.04573 0.806036,-1.746516 0.197816,-3.269691 -4.019562,-3.423912 -4.357192,-1.129134 -0.03991,0.508336 0.359489,0.933151 0.771609,0.94585 0.508331,0.03993 0.933145,-0.359487 0.94585,-0.771602 -0.05442,0.192441 -0.06894,-0.123453 0.37035,-0.206974 1.414256,-0.223335 1.436115,3.004596 -1.559441,2.572576 -1.882662,-0.32493 -2.810445,-3.289594 -0.194394,-6.290645 1.835403,-2.07877 4.38612,-3.747255 6.813382,-5.346749 0,0 0,0 0.123454,-0.06899 -1.040239,1.47238 -1.791812,3.02645 -1.966062,4.743901 -0.07986,1.016672 0.03268,2.087806 0.639117,2.882973 0.441174,0.644487 1.693883,1.726486 3.353213,0.637159 0.795165,-0.606388 1.410589,-1.679352 0.584527,-2.432759 -0.72984,-0.726177 -1.702921,0.141647 -1.755551,1.062096 -1.372497,0.443008 -2.145929,-1.23085 -1.668485,-2.550716 0.136148,-0.481106 0.285,-1.374327 1.187258,-3.09361 0.437518,-0.811531 0.971248,-1.595831 1.504978,-2.380132 0.150685,-0.165212 0.301371,-0.330425 0.548268,-0.468407 0,0 0,0 0,-2e-6 z"
   id="path1642" />

			<path
   class="st1"
   d="m 94.47754,58.850954 c 1.677062,-0.327813 2.810053,1.990879 1.576288,3.305346 -0.756757,0.88731 -2.318692,1.132991 -3.468895,0.129481 -0.969442,-0.871884 -1.658778,-2.812198 -0.605774,-4.25829 0.921378,-1.265331 3.091946,-2.118931 5.968348,-1.130847 1.347823,0.42823 2.448893,1.119353 3.648583,1.826973 1.10107,0.691123 2.20213,1.382246 3.2867,2.171999 2.18564,1.480875 4.27265,2.945253 6.50778,4.130239 2.05437,1.053361 4.84864,1.926318 6.77281,0.727335 2.26955,-1.445377 2.50124,-4.042746 1.02251,-5.506766 -1.97152,-2.154785 -6.24738,0.374447 -4.29236,2.627862 0.69005,0.723761 1.6932,0.181834 1.85782,-0.196187 0.0165,-0.09863 0.033,-0.197259 0.033,-0.197259 -0.0986,-0.0165 -0.92066,0.04878 -0.98594,-0.773255 -0.11441,-1.134421 1.61179,-1.149846 2.26884,-0.228826 1.5935,1.990165 -2.2387,4.897776 -4.25936,2.430603 -1.10071,-1.299399 -1.08314,-3.222857 0.26575,-4.619456 1.59565,-1.659493 4.68652,-1.953595 6.39515,-0.04556 2.07015,2.171283 1.75562,5.870077 -1.40196,7.77525 -2.38468,1.527509 -5.57347,0.588561 -8.10449,-0.645919 -2.43239,-1.217982 -4.5029,-2.780989 -6.68854,-4.261864 -2.087,-1.464378 -4.25614,-3.043883 -6.540765,-3.93298 -4.388486,-1.646569 -6.39622,1.87039 -4.325711,3.433397 1.068071,0.888383 2.482598,-0.294459 1.693918,-1.034718 -0.08213,-0.115128 -0.19726,-0.033 -0.09863,-0.0165 -1.134421,0.114413 -1.478731,-1.46402 -0.525072,-1.710058 z"
   id="path1644" />

			<path
   class="st1"
   d="m 151.3288,59.225487 c -1.66541,-0.382637 -2.87383,1.897651 -1.68384,3.251873 0.72725,0.911651 2.28029,1.208424 3.46279,0.243176 0.99751,-0.839622 1.75011,-2.756284 0.7451,-4.236133 -0.87939,-1.294868 -3.02079,-2.219193 -5.92805,-1.325974 -1.36114,0.383796 -2.48428,1.038437 -3.70654,1.706332 -1.12314,0.654641 -2.24628,1.309282 -3.35617,2.063041 -2.23303,1.408399 -4.36694,2.803544 -6.63973,3.91459 -2.08781,0.98542 -4.9092,1.766267 -6.79302,0.504825 -2.22093,-1.519032 -2.36731,-4.122601 -0.84136,-5.537338 2.04113,-2.088969 6.23174,0.579133 4.20387,2.76722 -0.71342,0.700741 -1.69826,0.126206 -1.8504,-0.25701 -0.0132,-0.09912 -0.0265,-0.198236 -0.0265,-0.198236 0.0991,-0.01325 0.91856,0.07895 1.01076,-0.740504 0.15156,-1.130058 -1.5732,-1.202087 -2.26011,-0.303111 -1.65791,1.936834 2.07687,4.968561 4.17736,2.568984 1.14273,-1.262601 1.18825,-3.185601 -0.11411,-4.625687 -1.54037,-1.71093 -4.61993,-2.106241 -6.39022,-0.25527 -2.14025,2.102223 -1.94719,5.809342 1.14621,7.817045 2.33331,1.604895 5.55117,0.771031 8.12132,-0.379778 2.47102,-1.137555 4.59168,-2.631818 6.82471,-4.040218 2.13391,-1.395145 4.35368,-2.902662 6.66623,-3.716355 4.44013,-1.501759 6.33144,2.079153 4.21079,3.573416 -1.09664,0.852876 -2.47161,-0.37572 -1.65908,-1.089715 0.0859,-0.112372 0.19824,-0.02651 0.0991,-0.01326 1.13006,0.151555 1.52595,-1.414736 0.58087,-1.691918 z"
   id="path1646"
   inkscape:transform-center-x="1.6138818"
   inkscape:transform-center-y="0.64622192" />

		<path
   class="st1"
   d="m 154.21942,66.927077 c 0.96793,0.996554 1.32757,2.86488 0.45213,3.905839 -0.75435,1.113988 -2.62176,1.061325 -3.10435,-0.05542 -0.38644,-0.728463 0.0277,-1.552168 0.80425,-1.744469 0.77655,-0.192301 1.21015,1.142623 0.4336,1.334914 2.18449,-0.746993 0.70903,-2.545048 0.70903,-2.545048 -1.30629,-1.530889 -4.1721,0.208985 -3.86236,2.707803 0.0471,0.606448 0.28845,1.164815 0.62681,1.69915 0.21817,0.04896 0.55745,0.171022 0.77563,0.220013 0.82369,0.41414 1.4773,0.973437 1.98484,1.77493 0.50754,0.801503 0.72387,1.675111 0.81911,2.475701 0.0222,0.921675 -0.0767,1.770337 -0.49085,2.59404 -0.41415,0.823695 -1.16757,1.52538 -2.01714,1.838779 -0.46131,0.217254 -0.97069,0.240379 -1.38299,0.239456 -0.41232,-9.23e-4 -0.94573,-0.07483 -1.40611,-0.269916 -0.46039,-0.195061 -0.94482,-0.487181 -1.25914,-0.924447 -0.31432,-0.437266 -0.53157,-0.898561 -0.65176,-1.383905 -0.11927,-0.897648 0.10162,-2.085583 1.04922,-2.835332 0.43726,-0.314323 1.18977,-0.603693 1.86832,-0.359652 0.67856,0.244052 1.16207,0.948486 1.28226,1.43382 v 0 c 0.12018,0.485344 -0.17193,0.969766 -0.65727,1.08995 -0.48535,0.120184 -0.96977,-0.171925 -1.08995,-0.657279 -0.048,-0.194125 -0.14515,-0.170089 -0.048,-0.194125 0,0 -0.0971,0.02402 -0.19414,0.04804 -0.26716,0.169176 -0.46221,0.629558 -0.34203,1.114902 0.12019,0.485344 0.28937,0.752502 0.74975,0.947562 0.46039,0.195051 1.06684,0.147906 1.55217,0.02771 0.94665,-0.337447 1.57988,-1.524457 1.48557,-2.73735 -0.0943,-1.212893 -0.698,-2.402661 -1.73988,-2.865803 -0.94481,-0.48717 -2.37587,-0.441851 -3.46858,0.137802 -1.79713,1.063152 -3.01553,3.631327 -1.42172,6.739335 0.6037,1.189778 1.59566,2.2834 2.56359,3.279953 2.8557,2.795522 7.02136,5.472697 10.28938,8.269141 2.34816,1.994026 5.05871,4.619453 4.97926,7.626726 -9.2e-4,0.412303 -0.0259,0.727543 -0.14791,1.066823 0.82554,-0.41047 1.77217,-0.74791 2.7669,-0.89122 1.21289,-0.09431 2.47386,0.006 3.51573,0.46865 2.85937,1.14628 5.64205,4.06292 5.82792,7.72563 0.048,0.19413 0.42349,5.87032 -5.84153,9.27613 -2.71974,1.49766 -7.91425,3.40213 -13.28913,-0.82997 -1.64649,-1.2406 -3.00085,-2.96562 -4.03997,-4.66569 -1.06315,-1.79713 -1.64097,-3.71446 -2.21879,-5.63178 -1.65859,-6.697688 -1.20939,-12.372036 0.35655,-18.528969 -1.13801,-0.851416 -2.30008,-1.799892 -3.38911,-2.869474 -1.08903,-1.069584 -2.10503,-2.260275 -2.85387,-3.620141 -2.02924,-3.618314 -0.68699,-7.350382 2.00872,-8.945119 0.89857,-0.531576 2.06338,-0.820023 3.10618,-0.769196 -0.19322,-0.364237 -0.28937,-0.752502 -0.38553,-1.140778 -0.76827,-3.518485 3.38345,-5.473787 5.29527,-3.577739 z m 5.80989,37.606053 c 0.049,-0.21818 0.21909,-0.36332 0.26808,-0.58149 -0.48533,0.12018 -1.01875,0.0462 -1.4551,-0.0517 0.55654,0.58332 0.86994,1.4329 0.8681,2.25752 0.0499,-0.63049 0.12389,-1.1639 0.31892,-1.62429 z m 2.44448,13.19941 c 0,0 0.0971,-0.024 0,0 1.16389,0.12386 2.35275,-0.0675 3.42049,-0.33193 0,0 0,0 0,0 2.0144,-0.60186 3.56933,-1.81108 5.14921,-3.33554 1.33766,-1.67052 2.09384,-3.60912 1.95237,-5.42846 -0.2589,-3.54161 -4.01226,-6.21786 -6.75419,-5.64188 -3.85777,0.64626 -4.08512,4.72036 -2.21863,5.18533 0.99379,0.26901 1.64648,1.2406 1.37748,2.23441 -0.66095,2.73918 -4.65927,1.15379 -5.54957,-2.02541 -0.16827,-0.67948 -0.21542,-1.28593 -0.26258,-1.89237 -0.1479,1.06683 -0.85325,1.96264 -1.89696,2.32412 -1.14077,0.38552 -2.59404,-0.49085 -2.73735,-1.48556 -0.0712,-0.70352 0.51213,-1.26005 0.99748,-1.38024 0.70351,-0.0712 1.40518,0.68223 0.967,1.40886 1.57621,0.12481 1.65291,-1.64556 1.04831,-2.42302 -0.58058,-0.6804 -1.18611,-1.04555 -2.08376,-0.92628 -1.50409,0.16642 -2.3555,1.30445 -2.8436,2.66156 -0.58608,1.79347 -0.17746,3.44362 0.44937,5.14277 0.89398,1.52997 2.03108,2.79369 3.43536,3.88823 1.74355,1.21657 3.65812,1.87568 5.54957,2.02541 z M 151.35671,89.064255 c -1.24886,5.357272 -1.601,11.007585 -0.0626,17.219935 0.16825,0.67948 0.40956,1.23785 0.57781,1.91732 0.003,-1.23693 0.34479,-2.35183 0.92904,-3.32067 0.97343,-1.47731 2.72157,-2.32229 4.24879,-1.97934 -0.43543,-0.5103 -0.67673,-1.06867 -0.74792,-1.77218 -0.0897,-3.27444 4.13045,-3.289295 4.3921,-0.98462 0.0231,0.50938 -0.39011,0.92077 -0.80242,0.91985 -0.50937,0.0231 -0.92076,-0.39011 -0.91985,-0.80242 0.048,0.19414 0.073,-0.12111 -0.36331,-0.21909 -1.40611,-0.269918 -1.53457,2.95553 1.47362,2.62268 1.89237,-0.26258 2.91756,-3.194986 0.40205,-6.280798 -1.76575,-2.138251 -4.25998,-3.890065 -6.63309,-5.568849 0,0 0,0 -0.12111,-0.07303 0.99105,1.505931 1.69089,3.083975 1.80832,4.806243 0.0462,1.018756 -0.10161,2.085589 -0.73398,2.860294 -0.46222,0.629564 -1.74998,1.6696 -3.37243,0.526069 -0.7747,-0.632319 -1.35435,-1.725023 -0.50386,-2.450737 0.75342,-0.701678 1.69731,0.19781 1.71952,1.119495 1.35711,0.488095 2.1854,-1.159307 1.75181,-2.494222 -0.12018,-0.48534 -0.23946,-1.382989 -1.08444,-3.131132 -0.41048,-0.825538 -0.91802,-1.627037 -1.42555,-2.428537 -0.14515,-0.170098 -0.2903,-0.340197 -0.5325,-0.486261 0,0 0,0 0,0 z"
   id="path1648" />
</g>
</g>

	
	
	<g
   id="g1570">
		<path
   class="st1"
   d="M 121.5,0 C 106.9,0 95,11.9 95,26.5 95,41.2 106.9,53 121.5,53 136.1,53 148,41.1 148,26.5 148,11.9 136.1,0 121.5,0 Z m 0,50.6 c -13.3,0 -24.1,-10.8 -24.1,-24.1 0,-13.3 10.8,-24.1 24.1,-24.1 13.3,0 24.1,10.8 24.1,24.1 0,13.3 -10.8,24.1 -24.1,24.1 z"
   id="path1556" />

		<g
   id="g1568"
   transform="matrix(0.96289919,0,0,0.96289919,5.13621,2.3268091)">
			<path
   class="st1"
   d="m 115.5,38.7 h -2.2 l -4.7,-14.4 -5.5,14.4 h -0.4 l 5.8,-15.1 -4.2,-13 h 2.2 l 3.2,9.9 3.8,-9.9 h 0.5 l -4.1,10.6 z"
   id="path1558" />

			<path
   class="st1"
   d="m 126.5,10.7 -5.4,30.2 -5.3,-30.2 h 2.1 l 4.1,23.5 4.1,-23.5 z"
   id="path1560" />

			<path
   class="st1"
   d="m 130,38.7 h -2 v -28 h 2 z"
   id="path1562" />

			<path
   class="st1"
   d="m 134.5,38.7 h -2 v -28 h 2 z"
   id="path1564" />

			<path
   class="st1"
   d="m 139,38.7 h -2 v -28 h 2 z"
   id="path1566" />

		</g>

	</g>

	
<g
   id="g1666"
   transform="translate(132.17541,0.17574963)">
		<path
   class="st1"
   d="M 121.5,0 C 106.9,0 95,11.9 95,26.5 95,41.2 106.9,53 121.5,53 136.1,53 148,41.1 148,26.5 148,11.9 136.1,0 121.5,0 Z m 0,50.6 c -13.3,0 -24.1,-10.8 -24.1,-24.1 0,-13.3 10.8,-24.1 24.1,-24.1 13.3,0 24.1,10.8 24.1,24.1 0,13.3 -10.8,24.1 -24.1,24.1 z"
   id="path1652" />

		<g
   id="g1664"
   transform="matrix(0.96289919,0,0,0.96289919,5.13621,2.3268091)">
			<path
   class="st1"
   d="m 115.5,38.7 h -2.2 l -4.7,-14.4 -5.5,14.4 h -0.4 l 5.8,-15.1 -4.2,-13 h 2.2 l 3.2,9.9 3.8,-9.9 h 0.5 l -4.1,10.6 z"
   id="path1654" />

			<path
   class="st1"
   d="m 126.5,10.7 -5.4,30.2 -5.3,-30.2 h 2.1 l 4.1,23.5 4.1,-23.5 z"
   id="path1656" />

			<path
   class="st1"
   d="m 130,38.7 h -2 v -28 h 2 z"
   id="path1658" />

			<path
   class="st1"
   d="m 134.5,38.7 h -2 v -28 h 2 z"
   id="path1660" />

			<path
   class="st1"
   d="m 139,38.7 h -2 v -28 h 2 z"
   id="path1662" />

		</g>

	</g>
</g>
  </g>
  <style
     type="text/css"
     id="style1492">
	.st0{fill:#DBD2AB;}
	.st1{fill:#100923;}
	.st2{fill:#FFFFFF;}
</style>
</svg>
