<?xml version="1.0" standalone="no"?>
<!DOCTYPE svg PUBLIC "-//W3C//DTD SVG 20010904//EN"
 "http://www.w3.org/TR/2001/REC-SVG-20010904/DTD/svg10.dtd">
<svg version="1.0" xmlns="http://www.w3.org/2000/svg"
 width="800.000000pt" height="800.000000pt" viewBox="0 0 800.000000 800.000000"
 preserveAspectRatio="xMidYMid meet">
<metadata>
Created by potrace 1.16, written by Peter Selinger 2001-2019
</metadata>
<g transform="translate(0.000000,800.000000) scale(0.100000,-0.100000)"
fill="#000000" stroke="none">
<path d="M2402 7373 c-20 -39 -22 -84 -12 -341 10 -268 30 -536 50 -644 5 -32
14 -83 19 -113 11 -62 43 -216 72 -345 66 -294 69 -335 21 -346 -97 -24 -154
-86 -192 -208 -11 -34 -15 -37 -39 -32 -14 3 -57 12 -96 21 -294 65 -545 107
-805 137 -165 18 -574 16 -723 -5 -128 -18 -137 -21 -137 -42 0 -23 33 -25
230 -17 270 10 470 0 735 -38 212 -30 646 -127 720 -160 57 -26 128 -92 160
-148 38 -65 102 -130 137 -137 27 -6 29 -10 23 -38 -3 -18 -10 -43 -14 -57 -5
-14 -17 -54 -26 -90 -9 -36 -21 -76 -25 -90 -5 -14 -32 -108 -60 -210 -29
-102 -54 -187 -55 -189 -2 -2 -43 9 -92 24 -48 14 -113 33 -143 42 -96 27
-224 65 -250 74 -73 26 -173 40 -267 39 -143 -3 -154 -2 -190 5 -37 8 -41 -1
-46 -90 -2 -58 -14 -55 144 -36 l96 12 89 -45 c152 -75 288 -114 495 -141 153
-20 228 -19 281 4 77 33 93 58 183 282 25 63 50 123 54 134 5 11 16 39 26 62
l17 41 82 -60 c119 -88 111 -72 91 -175 -20 -98 -17 -243 11 -596 15 -194 13
-216 -24 -236 -9 -5 -100 -14 -202 -20 -102 -6 -237 -16 -300 -21 -63 -5 -204
-15 -312 -21 l-198 -12 0 -39 c0 -83 -23 -78 366 -78 559 0 730 20 814 97 77
69 96 148 86 361 -4 81 -10 177 -14 215 -4 37 -6 67 -4 67 5 0 214 -171 248
-202 26 -24 32 -39 37 -86 5 -53 181 -527 293 -787 7 -16 22 -57 34 -90 13
-33 26 -64 31 -70 12 -12 11 -482 -1 -669 -13 -194 0 -279 75 -513 l26 -83 55
0 c52 0 54 1 54 26 0 14 -12 69 -26 122 -45 171 -46 180 -22 330 18 117 21
180 22 432 0 279 -2 303 -27 445 -39 211 -79 346 -165 549 -43 102 -45 110
-31 135 32 56 77 37 219 -95 47 -44 178 -155 291 -247 114 -92 211 -173 217
-179 5 -7 22 -42 37 -78 69 -165 84 -184 155 -195 25 -4 57 -14 73 -22 18 -9
91 -110 222 -306 107 -161 263 -384 345 -497 189 -257 272 -376 501 -720 172
-258 186 -275 214 -275 45 0 42 24 -16 127 -29 51 -61 109 -72 128 -47 84 -77
134 -167 280 -188 302 -252 400 -600 910 -173 255 -260 388 -260 397 0 5 33
41 73 81 l73 72 74 -51 c632 -437 1242 -814 1647 -1018 115 -58 143 -63 143
-27 0 20 -32 46 -202 159 -112 74 -225 147 -253 162 -103 56 -143 81 -235 145
-52 37 -143 97 -203 134 -59 38 -131 89 -160 115 -28 26 -86 71 -127 99 -41
28 -106 79 -144 112 -60 51 -278 187 -396 245 -72 36 -121 97 -134 167 -11 60
-96 120 -219 154 -49 13 -67 25 -126 87 -134 139 -511 578 -511 595 0 4 13 20
28 35 31 30 30 30 137 -19 104 -47 266 -89 462 -121 134 -21 624 -24 773 -4
383 50 453 49 621 -15 62 -24 75 -16 84 46 4 28 5 54 2 57 -6 5 -151 42 -293
73 -83 19 -105 19 -275 11 -421 -23 -589 -24 -689 -7 -52 9 -106 20 -120 26
-14 5 -86 27 -160 50 -74 23 -160 50 -190 60 -30 10 -154 50 -275 90 -293 95
-367 134 -499 263 l-59 57 234 0 c490 0 510 30 495 730 -6 298 -3 347 31 477
8 34 13 68 10 76 -6 17 -97 31 -110 18 -6 -6 -14 -34 -18 -63 -53 -327 -70
-518 -67 -764 4 -278 17 -260 -187 -248 -82 5 -291 9 -464 9 l-314 0 -64 95
-63 95 77 6 c43 4 101 12 128 19 83 21 195 81 250 135 103 100 110 193 31 410
-26 72 -51 139 -56 150 -4 11 -41 105 -80 210 -77 203 -78 211 -45 309 8 24
18 65 21 90 l7 46 -60 0 -60 0 -12 -67 c-7 -38 -17 -93 -23 -123 -12 -65 -4
-207 16 -270 12 -40 71 -185 112 -275 24 -55 76 -189 90 -233 23 -75 27 -74
-415 -160 l-244 -48 -34 53 c-19 30 -42 56 -51 59 -45 13 -129 62 -160 93 -60
60 -101 168 -158 426 -9 39 -20 86 -24 105 -47 212 -92 463 -109 610 -28 250
-33 323 -31 464 4 185 3 186 -15 186 -8 0 -18 -8 -23 -17z"/>
</g>
</svg>
