<?xml version="1.0" standalone="no"?>
<!DOCTYPE svg PUBLIC "-//W3C//DTD SVG 20010904//EN"
 "http://www.w3.org/TR/2001/REC-SVG-20010904/DTD/svg10.dtd">
<svg version="1.0" xmlns="http://www.w3.org/2000/svg"
 width="800.000000pt" height="800.000000pt" viewBox="0 0 800.000000 800.000000"
 preserveAspectRatio="xMidYMid meet">
<metadata>
Created by potrace 1.16, written by Peter Selinger 2001-2019
</metadata>
<g transform="translate(0.000000,800.000000) scale(0.100000,-0.100000)"
fill="#000000" stroke="none">
<path d="M1070 6660 c0 -5 -19 -14 -42 -20 -89 -22 -213 -91 -283 -157 -79
-73 -174 -226 -161 -259 4 -12 54 -14 287 -14 306 0 383 -10 494 -64 95 -46
252 -180 336 -289 28 -37 18 -48 -81 -83 -70 -24 -84 -26 -210 -21 -84 3 -152
10 -180 20 -25 8 -79 25 -120 38 -41 13 -86 29 -100 36 -14 7 -32 13 -41 13
-9 0 -30 7 -45 15 -16 8 -36 15 -45 15 -9 0 -33 7 -52 15 -53 22 -77 20 -77
-7 0 -34 25 -99 60 -157 16 -29 30 -54 30 -57 0 -19 114 -142 174 -187 83 -63
104 -73 271 -128 66 -21 134 -44 150 -50 17 -6 48 -15 70 -20 22 -5 49 -14 60
-19 21 -10 113 -35 183 -50 23 -5 50 -14 60 -19 9 -5 37 -12 62 -16 25 -4 53
-11 62 -16 10 -5 37 -13 60 -18 24 -5 79 -19 123 -31 44 -12 105 -28 135 -35
186 -44 250 -67 305 -111 52 -41 77 -107 73 -195 l-3 -64 -53 -27 c-30 -15
-67 -30 -83 -33 -16 -4 -31 -11 -34 -16 -4 -5 -13 -9 -22 -9 -8 0 -29 -7 -46
-15 -18 -8 -57 -22 -87 -30 -30 -9 -80 -23 -110 -31 -30 -9 -86 -22 -125 -29
-38 -8 -92 -19 -120 -26 -71 -16 -492 -17 -570 0 -33 7 -89 19 -125 26 -89 18
-167 42 -285 87 -76 29 -78 30 -268 123 -164 80 -250 135 -302 190 -55 59 -94
110 -87 116 7 7 153 20 617 55 116 8 218 18 228 20 18 6 25 58 8 68 -5 3 -170
13 -368 23 -305 14 -370 15 -434 4 -80 -15 -146 -40 -196 -78 -31 -22 -33 -28
-33 -81 0 -133 90 -281 225 -373 59 -40 98 -60 180 -90 33 -12 69 -26 80 -30
11 -5 34 -13 50 -18 17 -5 68 -23 115 -40 47 -17 95 -31 107 -31 12 0 24 -4
28 -9 3 -5 20 -12 38 -16 17 -4 61 -16 97 -27 136 -41 277 -73 492 -111 36 -7
70 -15 73 -19 4 -4 -8 -26 -26 -50 -68 -86 -74 -104 -74 -213 0 -102 3 -113
56 -232 14 -31 15 -43 6 -45 -6 -1 -145 -2 -307 -2 -305 -1 -331 -4 -490 -51
-25 -7 -61 -16 -80 -20 -19 -4 -66 -18 -105 -32 -38 -13 -84 -29 -102 -34 -18
-5 -45 -16 -60 -24 -15 -8 -33 -15 -40 -15 -6 0 -24 -6 -40 -14 -15 -8 -50
-24 -78 -36 -27 -12 -65 -29 -83 -38 -53 -27 -138 -108 -166 -158 -24 -42 -26
-57 -26 -157 0 -96 3 -117 24 -162 74 -155 237 -228 573 -257 146 -13 355 -2
493 26 72 14 240 66 325 101 49 19 310 150 346 173 59 38 142 88 165 100 17 9
24 21 22 35 -5 34 -57 28 -213 -25 -16 -5 -48 -14 -70 -20 -22 -5 -48 -14 -57
-19 -10 -5 -34 -13 -55 -18 -21 -5 -78 -23 -128 -40 -465 -161 -754 -189
-1041 -103 -90 28 -159 74 -184 123 -25 48 -25 56 0 111 36 83 161 193 305
268 309 164 658 200 1105 115 223 -42 320 -62 360 -74 42 -12 118 -29 180 -41
25 -4 68 -15 95 -23 59 -17 157 -42 322 -80 74 -17 102 -34 140 -84 26 -34 28
-43 28 -127 0 -74 -4 -100 -23 -140 -29 -61 -107 -137 -169 -166 -26 -12 -56
-25 -65 -30 -9 -5 -77 -17 -150 -27 -112 -15 -196 -18 -528 -16 -378 3 -553
-4 -650 -26 -328 -71 -465 -118 -721 -246 -161 -80 -211 -121 -264 -218 -28
-51 -36 -79 -41 -140 l-7 -77 27 0 c15 0 62 17 104 37 76 37 78 37 202 38 119
0 193 -11 305 -47 79 -25 224 -58 257 -58 20 0 39 -4 42 -9 3 -5 -5 -25 -19
-45 -14 -20 -25 -39 -25 -41 0 -2 -19 -32 -42 -66 -70 -102 -146 -158 -273
-202 -54 -18 -92 -21 -360 -26 -267 -5 -300 -8 -303 -22 -8 -43 185 -150 293
-163 33 -4 96 -13 140 -21 462 -81 924 -104 1145 -59 77 16 203 52 230 65 8 4
40 20 70 34 204 101 372 284 493 535 36 77 46 103 97 250 27 81 86 209 100
220 4 3 13 16 19 28 7 13 22 36 34 50 34 41 150 152 159 152 15 0 130 84 193
142 63 58 155 182 155 210 0 7 6 22 14 33 7 11 17 40 21 65 15 93 57 180 86
180 19 0 71 -63 84 -101 21 -59 20 -202 -3 -259 -26 -67 -47 -95 -150 -199
-52 -52 -117 -122 -145 -155 -29 -32 -88 -100 -132 -150 -85 -98 -86 -99 -167
-196 -86 -104 -98 -122 -98 -141 0 -48 71 -9 277 152 61 48 124 98 140 112 59
51 161 135 233 192 173 136 253 241 296 388 13 44 16 81 12 166 -7 133 3 161
61 184 56 23 83 21 140 -8 60 -30 117 -106 137 -182 18 -69 18 -107 -2 -162
-14 -41 -137 -297 -159 -331 -11 -16 -35 -80 -35 -92 0 -22 46 -2 102 44 276
227 371 379 372 593 0 56 -5 121 -13 148 -8 26 -12 49 -10 52 11 10 167 -18
208 -38 111 -53 166 -239 116 -397 -20 -64 -113 -286 -132 -315 -7 -11 -13
-32 -13 -47 0 -22 5 -28 21 -28 25 0 143 91 209 161 86 92 137 231 161 445 5
49 16 109 23 134 13 44 15 45 52 43 22 -2 55 -10 74 -19 154 -73 170 -89 170
-175 0 -32 -7 -78 -16 -101 -9 -24 -31 -81 -49 -128 -81 -211 -81 -210 -31
-210 33 0 40 7 119 113 47 61 133 175 191 252 68 89 106 147 104 160 -2 11
-32 42 -68 68 -36 27 -74 57 -86 67 -12 9 -30 22 -40 28 -16 9 -12 12 26 22
25 6 52 13 61 16 36 10 228 27 299 27 41 -1 123 -4 181 -8 105 -7 108 -7 154
21 35 20 72 31 144 40 100 13 143 9 213 -21 24 -9 68 -15 123 -15 92 0 143 17
195 65 14 13 41 30 61 38 63 26 107 -6 156 -113 45 -96 63 -139 63 -149 0 -6
7 -27 16 -48 70 -160 122 -208 269 -245 137 -34 266 -17 445 59 62 26 154 94
188 138 51 66 70 145 77 314 8 179 44 389 86 499 11 29 12 187 0 210 -4 9 -17
35 -27 57 -25 53 -82 108 -176 174 -79 54 -99 77 -130 145 -25 53 -23 88 12
194 40 125 42 228 4 295 -30 55 -76 93 -167 141 -90 47 -184 62 -279 45 -195
-35 -327 -174 -442 -469 -18 -45 -43 -104 -55 -128 -12 -26 -87 -42 -255 -52
-202 -13 -239 -9 -336 38 -69 33 -82 36 -165 36 -73 0 -98 -4 -132 -22 -81
-42 -181 -27 -363 55 -154 69 -147 60 -186 218 -8 33 -21 85 -29 115 -8 30
-19 75 -26 100 -23 91 -44 135 -64 135 -14 0 -22 -10 -28 -35 -15 -62 -39
-142 -74 -250 -37 -111 -79 -170 -123 -170 -30 0 -33 20 -14 76 44 127 11 271
-105 465 -59 97 -85 129 -105 129 -20 0 -21 -46 -1 -155 8 -44 14 -126 15
-183 0 -94 -2 -107 -29 -161 -30 -58 -136 -200 -176 -234 -21 -18 -79 -16 -99
4 -13 12 12 294 29 335 20 49 27 125 16 174 -7 33 -20 54 -48 77 -34 29 -168
117 -257 168 -112 65 -197 118 -202 126 -3 5 -16 9 -30 9 -20 0 -24 -5 -24
-31 0 -55 77 -184 173 -286 144 -156 168 -232 104 -329 -19 -28 -42 -59 -53
-70 -40 -40 -128 -89 -177 -100 -18 -3 -36 -10 -42 -14 -5 -4 -23 -10 -40 -14
-16 -4 -38 -9 -47 -12 -18 -5 -42 34 -74 121 -29 77 -35 101 -49 211 -9 70
-24 133 -40 169 -58 129 -216 243 -352 253 -84 6 -83 -7 10 -100 80 -80 123
-148 158 -248 30 -85 32 -228 5 -313 -16 -51 -25 -63 -83 -107 -36 -28 -72
-50 -78 -50 -15 0 -55 51 -82 105 -11 22 -24 70 -27 107 -9 83 -26 140 -63
209 -27 50 -116 201 -240 408 -39 64 -119 194 -135 219 -10 15 -26 43 -37 62
-10 20 -45 69 -76 110 -175 229 -407 400 -680 501 -33 12 -69 25 -80 30 -11 4
-31 10 -45 14 -14 3 -47 12 -75 19 -78 22 -182 43 -272 56 -46 7 -83 16 -83
21 0 5 -83 9 -185 9 -112 0 -185 -4 -185 -10z"/>
</g>
</svg>
