<?xml version="1.0" encoding="UTF-8" standalone="no"?>
<svg
   xmlns:dc="http://purl.org/dc/elements/1.1/"
   xmlns:cc="http://creativecommons.org/ns#"
   xmlns:rdf="http://www.w3.org/1999/02/22-rdf-syntax-ns#"
   xmlns:svg="http://www.w3.org/2000/svg"
   xmlns="http://www.w3.org/2000/svg"
   xmlns:sodipodi="http://sodipodi.sourceforge.net/DTD/sodipodi-0.dtd"
   xmlns:inkscape="http://www.inkscape.org/namespaces/inkscape"
   height="78px"
   id="Layer_1"
   style="enable-background:new 0 0 78 78;"
   version="1.1"
   viewBox="0 0 78 78"
   width="78px"
   xml:space="preserve"
   sodipodi:docname="marker.svg"
   inkscape:version="0.92.3 (2405546, 2018-03-11)"><metadata
     id="metadata13"><rdf:RDF><cc:Work
         rdf:about=""><dc:format>image/svg+xml</dc:format><dc:type
           rdf:resource="http://purl.org/dc/dcmitype/StillImage" /></cc:Work></rdf:RDF></metadata><defs
     id="defs11" /><sodipodi:namedview
     pagecolor="#ffffff"
     bordercolor="#666666"
     borderopacity="1"
     objecttolerance="10"
     gridtolerance="10"
     guidetolerance="10"
     inkscape:pageopacity="0"
     inkscape:pageshadow="2"
     inkscape:window-width="2048"
     inkscape:window-height="1088"
     id="namedview9"
     showgrid="false"
     inkscape:zoom="3.025641"
     inkscape:cx="-26.771186"
     inkscape:cy="39"
     inkscape:window-x="0"
     inkscape:window-y="27"
     inkscape:window-maximized="1"
     inkscape:current-layer="Layer_1" /><ellipse
     style="opacity:1;vector-effect:none;fill:#000000;fill-opacity:0.24444444;fill-rule:nonzero;stroke:none;stroke-width:0.805668;stroke-linecap:butt;stroke-linejoin:miter;stroke-miterlimit:4;stroke-dasharray:none;stroke-dashoffset:0;stroke-opacity:0"
     id="path820"
     cx="38.834747"
     cy="30.737288"
     rx="26.275423"
     ry="26.440678" /><g
     id="g6"><path
       d="M69,30.451c0-16.568-13.431-30-30-30c-16.568,0-30,13.432-30,30c0,7.086,2.464,13.596,6.572,18.729   c0.001,0.001,0.002,0.003,0.001,0.004s-0.002,0.002-0.004,0.002c7.746,9.674,18.693,23.347,22.259,27.8   c0.285,0.355,0.716,0.562,1.171,0.563c0.456,0,0.888-0.206,1.172-0.562c3.564-4.452,14.508-18.119,22.254-27.794   c0.001-0.001,0.002-0.003,0.001-0.004s-0.002-0.002-0.004-0.002C66.534,44.052,69,37.542,69,30.451z M57.567,45.66L39,68.851   L20.613,45.887l-0.188-0.234c-0.055-0.075-0.111-0.149-0.169-0.222C16.817,41.134,15,35.954,15,30.451c0-13.234,10.767-24,24-24   s24,10.766,24,24c0,5.506-1.819,10.688-5.262,14.986C57.68,45.51,57.623,45.584,57.567,45.66z"
       style="fill:#333F4F;"
       id="path2" /><circle
       cx="39"
       cy="30.451"
       r="10.5"
       style="fill:#333F4F;"
       id="circle4" /></g></svg>