<?xml version="1.0" encoding="UTF-8" standalone="no"?>
<!-- Created with Inkscape (http://www.inkscape.org/) -->

<svg
   width="52.916672mm"
   height="52.916668mm"
   viewBox="0 0 52.916672 52.916668"
   version="1.1"
   id="svg5"
   xmlns:inkscape="http://www.inkscape.org/namespaces/inkscape"
   xmlns:sodipodi="http://sodipodi.sourceforge.net/DTD/sodipodi-0.dtd"
   xmlns="http://www.w3.org/2000/svg"
   xmlns:svg="http://www.w3.org/2000/svg">
  <sodipodi:namedview
     id="namedview7"
     pagecolor="#ffffff"
     bordercolor="#666666"
     borderopacity="1.0"
     inkscape:showpageshadow="2"
     inkscape:pageopacity="0.0"
     inkscape:pagecheckerboard="0"
     inkscape:deskcolor="#d1d1d1"
     inkscape:document-units="mm"
     showgrid="false"
     inkscape:zoom="0.77058782"
     inkscape:cx="83.702335"
     inkscape:cy="420.45824"
     inkscape:window-width="1920"
     inkscape:window-height="1011"
     inkscape:window-x="0"
     inkscape:window-y="32"
     inkscape:window-maximized="1"
     inkscape:current-layer="g3064" />
  <defs
     id="defs2" />
  <g
     inkscape:label="Layer 1"
     inkscape:groupmode="layer"
     id="layer1"
     transform="translate(-126.04698,-11.919581)">
    <g
       id="g3064"
       transform="translate(0.39927292,-2.5441737)">
      <rect
         style="opacity:0.999;fill:#cccccc;stroke:none;stroke-width:0.465;stroke-linejoin:bevel;stroke-miterlimit:0;stroke-dasharray:1.395, 1.395;stroke-dashoffset:1.302;stop-color:#000000"
         id="rect113"
         width="45.690678"
         height="19.743961"
         x="15.741786"
         y="16.337328" />
      <rect
         style="opacity:0.999;fill:#cccccc;stroke:none;stroke-width:0.256337;stroke-linejoin:bevel;stroke-miterlimit:0;stroke-dasharray:0.769011, 0.769011;stroke-dashoffset:0.717744;stop-color:#000000"
         id="rect113-3"
         width="45.690678"
         height="6"
         x="15.741786"
         y="39.175938" />
      <g
         id="g3051"
         transform="translate(0,1.0583333)">
        <rect
           style="opacity:0.999;fill:#cccccc;stroke:none;stroke-width:0.151532;stroke-linejoin:bevel;stroke-miterlimit:0;stroke-dasharray:0.454596, 0.454596;stroke-dashoffset:0.424289;stop-color:#000000"
           id="rect113-3-6-7"
           width="45.690678"
           height="2.0967031"
           x="15.741786"
           y="45.713245" />
        <rect
           style="opacity:0.999;fill:#cccccc;stroke:none;stroke-width:0.151532;stroke-linejoin:bevel;stroke-miterlimit:0;stroke-dasharray:0.454596, 0.454596;stroke-dashoffset:0.424289;stop-color:#000000"
           id="rect113-3-6-7-5"
           width="45.690678"
           height="2.0967031"
           x="15.741786"
           y="48.56443" />
        <rect
           style="opacity:0.999;fill:#cccccc;stroke:none;stroke-width:0.151532;stroke-linejoin:bevel;stroke-miterlimit:0;stroke-dasharray:0.454596, 0.454596;stroke-dashoffset:0.424289;stop-color:#000000"
           id="rect113-3-6-3"
           width="45.690678"
           height="2.0967031"
           x="15.741786"
           y="51.415619" />
        <rect
           style="opacity:0.999;fill:#cccccc;stroke:none;stroke-width:0.151532;stroke-linejoin:bevel;stroke-miterlimit:0;stroke-dasharray:0.454596, 0.454596;stroke-dashoffset:0.424289;stop-color:#000000"
           id="rect113-3-6-7-56"
           width="45.690678"
           height="2.0967031"
           x="15.741786"
           y="54.266808" />
        <rect
           style="opacity:0.999;fill:#cccccc;stroke:none;stroke-width:0.151532;stroke-linejoin:bevel;stroke-miterlimit:0;stroke-dasharray:0.454596, 0.454596;stroke-dashoffset:0.424289;stop-color:#000000"
           id="rect113-3-6-7-5-2"
           width="45.690678"
           height="2.0967031"
           x="15.741786"
           y="57.117996" />
        <rect
           style="opacity:0.999;fill:#cccccc;stroke:none;stroke-width:0.151532;stroke-linejoin:bevel;stroke-miterlimit:0;stroke-dasharray:0.454596, 0.454596;stroke-dashoffset:0.424289;stop-color:#000000"
           id="rect113-3-6-7-56-9"
           width="45.690678"
           height="2.0967031"
           x="15.741786"
           y="59.969181" />
        <rect
           style="opacity:0.999;fill:#cccccc;stroke:none;stroke-width:0.151532;stroke-linejoin:bevel;stroke-miterlimit:0;stroke-dasharray:0.454596, 0.454596;stroke-dashoffset:0.424289;stop-color:#000000"
           id="rect113-3-6-7-5-2-1"
           width="45.690678"
           height="2.0967031"
           x="15.741786"
           y="62.82037" />
      </g>
      <rect
         style="opacity:0.999;fill:none;stroke:none;stroke-width:0.465;stroke-linejoin:bevel;stroke-miterlimit:0;stroke-dasharray:1.395, 1.395;stroke-dashoffset:1.302;stop-color:#000000"
         id="rect111-2"
         width="52.916668"
         height="52.916668"
         x="68.672462"
         y="14.465471"
         inkscape:export-filename="title-description.svg"
         inkscape:export-xdpi="264.798"
         inkscape:export-ydpi="264.798" />
      <rect
         style="opacity:0.999;fill:#cccccc;stroke:none;stroke-width:0.256338;stroke-linejoin:bevel;stroke-miterlimit:0;stroke-dasharray:0.769014, 0.769014;stroke-dashoffset:0.717746;stop-color:#000000"
         id="rect113-3-0"
         width="45.691002"
         height="6"
         x="72.290154"
         y="16.879173" />
      <g
         id="g3271">
        <rect
           style="opacity:0.999;fill:#cccccc;stroke:none;stroke-width:0.151532;stroke-linejoin:bevel;stroke-miterlimit:0;stroke-dasharray:0.454596, 0.454596;stroke-dashoffset:0.424289;stop-color:#000000"
           id="rect113-3-6-36"
           width="45.690678"
           height="2.0967031"
           x="72.285461"
           y="43.687828" />
        <rect
           style="opacity:0.999;fill:#cccccc;stroke:none;stroke-width:0.151532;stroke-linejoin:bevel;stroke-miterlimit:0;stroke-dasharray:0.454596, 0.454596;stroke-dashoffset:0.424289;stop-color:#000000"
           id="rect113-3-6-7-0"
           width="45.690678"
           height="2.0967031"
           x="72.285461"
           y="46.539017" />
        <rect
           style="opacity:0.999;fill:#cccccc;stroke:none;stroke-width:0.151532;stroke-linejoin:bevel;stroke-miterlimit:0;stroke-dasharray:0.454596, 0.454596;stroke-dashoffset:0.424289;stop-color:#000000"
           id="rect113-3-6-7-5-6"
           width="45.690678"
           height="2.0967031"
           x="72.285461"
           y="49.390202" />
        <rect
           style="opacity:0.999;fill:#cccccc;stroke:none;stroke-width:0.151532;stroke-linejoin:bevel;stroke-miterlimit:0;stroke-dasharray:0.454596, 0.454596;stroke-dashoffset:0.424289;stop-color:#000000"
           id="rect113-3-6-3-2"
           width="45.690678"
           height="2.0967031"
           x="72.285461"
           y="52.24139" />
        <rect
           style="opacity:0.999;fill:#cccccc;stroke:none;stroke-width:0.151532;stroke-linejoin:bevel;stroke-miterlimit:0;stroke-dasharray:0.454596, 0.454596;stroke-dashoffset:0.424289;stop-color:#000000"
           id="rect113-3-6-7-56-6"
           width="45.690678"
           height="2.0967031"
           x="72.285461"
           y="55.092579" />
        <rect
           style="opacity:0.999;fill:#cccccc;stroke:none;stroke-width:0.151532;stroke-linejoin:bevel;stroke-miterlimit:0;stroke-dasharray:0.454596, 0.454596;stroke-dashoffset:0.424289;stop-color:#000000"
           id="rect113-3-6-7-5-2-18"
           width="45.690678"
           height="2.0967031"
           x="72.285461"
           y="57.943768" />
        <rect
           style="opacity:0.999;fill:#cccccc;stroke:none;stroke-width:0.151532;stroke-linejoin:bevel;stroke-miterlimit:0;stroke-dasharray:0.454596, 0.454596;stroke-dashoffset:0.424289;stop-color:#000000"
           id="rect113-3-6-7-56-9-7"
           width="45.690678"
           height="2.0967031"
           x="72.285461"
           y="60.794952" />
        <rect
           style="opacity:0.999;fill:#cccccc;stroke:none;stroke-width:0.151532;stroke-linejoin:bevel;stroke-miterlimit:0;stroke-dasharray:0.454596, 0.454596;stroke-dashoffset:0.424289;stop-color:#000000"
           id="rect113-3-6-7-5-2-1-9"
           width="45.690678"
           height="2.0967031"
           x="72.285461"
           y="63.646141" />
        <rect
           style="opacity:0.999;fill:#cccccc;stroke:none;stroke-width:0.151532;stroke-linejoin:bevel;stroke-miterlimit:0;stroke-dasharray:0.454596, 0.454596;stroke-dashoffset:0.424289;stop-color:#000000"
           id="rect113-3-6-7-0-2"
           width="45.690678"
           height="2.0967031"
           x="72.294846"
           y="26.612297" />
        <rect
           style="opacity:0.999;fill:#cccccc;stroke:none;stroke-width:0.151532;stroke-linejoin:bevel;stroke-miterlimit:0;stroke-dasharray:0.454596, 0.454596;stroke-dashoffset:0.424289;stop-color:#000000"
           id="rect113-3-6-7-5-6-3"
           width="45.690678"
           height="2.0967031"
           x="72.294846"
           y="29.463482" />
        <rect
           style="opacity:0.999;fill:#cccccc;stroke:none;stroke-width:0.151532;stroke-linejoin:bevel;stroke-miterlimit:0;stroke-dasharray:0.454596, 0.454596;stroke-dashoffset:0.424289;stop-color:#000000"
           id="rect113-3-6-3-2-7"
           width="45.690678"
           height="2.0967031"
           x="72.294846"
           y="32.314671" />
        <rect
           style="opacity:0.999;fill:#cccccc;stroke:none;stroke-width:0.151532;stroke-linejoin:bevel;stroke-miterlimit:0;stroke-dasharray:0.454596, 0.454596;stroke-dashoffset:0.424289;stop-color:#000000"
           id="rect113-3-6-7-56-6-5"
           width="45.690678"
           height="2.0967031"
           x="72.294846"
           y="35.165859" />
        <rect
           style="opacity:0.999;fill:#cccccc;stroke:none;stroke-width:0.151532;stroke-linejoin:bevel;stroke-miterlimit:0;stroke-dasharray:0.454596, 0.454596;stroke-dashoffset:0.424289;stop-color:#000000"
           id="rect113-3-6-7-5-2-18-9"
           width="45.690678"
           height="2.0967031"
           x="72.294846"
           y="38.017048" />
        <rect
           style="opacity:0.999;fill:#cccccc;stroke:none;stroke-width:0.151532;stroke-linejoin:bevel;stroke-miterlimit:0;stroke-dasharray:0.454596, 0.454596;stroke-dashoffset:0.424289;stop-color:#000000"
           id="rect113-3-6-7-56-9-7-2"
           width="45.690678"
           height="2.0967031"
           x="72.294846"
           y="40.868233" />
      </g>
      <rect
         style="opacity:0.999;fill:none;stroke:none;stroke-width:0.465;stroke-linejoin:bevel;stroke-miterlimit:0;stroke-dasharray:1.395, 1.395;stroke-dashoffset:1.302;stop-color:#000000"
         id="rect111-2-8"
         width="52.916668"
         height="52.916668"
         x="125.64771"
         y="14.463755" />
      <g
         id="g3453"
         transform="translate(0.28806686,-0.36633563)">
        <rect
           style="opacity:0.999;fill:#cccccc;stroke:none;stroke-width:0.660887;stroke-linejoin:bevel;stroke-miterlimit:0;stroke-dasharray:1.98266, 1.98266;stroke-dashoffset:1.85048;stop-color:#000000"
           id="rect113-6"
           width="45.690678"
           height="39.882534"
           x="128.97264"
           y="17.343147" />
        <rect
           style="opacity:0.999;fill:#cccccc;stroke:none;stroke-width:0.256337;stroke-linejoin:bevel;stroke-miterlimit:0;stroke-dasharray:0.769011, 0.769011;stroke-dashoffset:0.717743;stop-color:#000000"
           id="rect113-3-1"
           width="45.690678"
           height="6"
           x="128.97264"
           y="59.457783" />
      </g>
      <rect
         style="opacity:0.999;fill:#ffffff;stroke:#999999;stroke-width:0.465;stroke-linejoin:bevel;stroke-miterlimit:0;stroke-dasharray:1.395, 1.395;stroke-dashoffset:1.302;stop-color:#000000"
         id="rect111-2-8-0"
         width="52.916668"
         height="52.916668"
         x="12.285423"
         y="72.792206" />
      <rect
         style="opacity:0.999;fill:#cccccc;stroke:none;stroke-width:0.71592;stroke-linejoin:bevel;stroke-miterlimit:0;stroke-dasharray:2.14776, 2.14776;stroke-dashoffset:2.00457;stop-color:#000000"
         id="rect113-6-3"
         width="45.690678"
         height="46.801285"
         x="15.898419"
         y="75.849899" />
    </g>
  </g>
</svg>
