{
  "title": "Welcome to our newsletter! Good things await you",
  "slug": "template-newsletter-welcome-message",
  "type": "template-newsletter-welcome-message",
  "content": "# Welcome\n\nHello {{receiverName}},\n\nWe are glad to have you on board. Through this newsletter, we will keep you informed about the progress of our projects.\n\nWe will focus on providing the most useful information for you. If the information we provide is not useful, you can unsubscribe at any time using the link at the bottom of any of these emails."
}