{
	"fileVersion": 1,
	"versions": {
		"cachetools": "0.3.1",
		"crate": {"path":"submodules/crate"},
		"d2sqlite3": "1.0.0",
		"ddmp": "0.0.1-0.dev.3",
		"describe-d": "0.11.1",
		"diet-ng": "1.8.1",
		"dub": "1.30.0",
		"dxml": "0.4.3",
		"emsi_containers": "0.9.0",
		"eventcore": "0.9.21",
		"fluent-asserts": "1.0.0",
		"fluent-asserts-vibe": "1.0.0-beta.1",
		"geo": {"path":"submodules/geo-d"},
		"gis-collective-api-article-links": {"path":"packages/articleLinks"},
		"gis-collective-api-articles": {"path":"packages/articles"},
		"gis-collective-api-base-maps": {"path":"packages/basemaps"},
		"gis-collective-api-batch-jobs": {"path":"packages/batchJobs"},
		"gis-collective-api-calendars": {"path":"packages/calendars"},
		"gis-collective-api-campaign-answers": {"path":"packages/campaignAnswers"},
		"gis-collective-api-campaigns": {"path":"packages/campaigns"},
		"gis-collective-api-data-bindings": {"path":"packages/dataBindings"},
		"gis-collective-api-events": {"path":"packages/events"},
		"gis-collective-api-features": {"path":"packages/features"},
		"gis-collective-api-files": {"path":"packages/files"},
		"gis-collective-api-geocodings": {"path":"packages/geocodings"},
		"gis-collective-api-icon-sets": {"path":"packages/iconSets"},
		"gis-collective-api-icons": {"path":"packages/icons"},
		"gis-collective-api-issues": {"path":"packages/issues"},
		"gis-collective-api-legend": {"path":"packages/legend"},
		"gis-collective-api-maps": {"path":"packages/maps"},
		"gis-collective-api-metrics": {"path":"packages/metrics"},
		"gis-collective-api-models": {"path":"packages/models"},
		"gis-collective-api-newsletters": {"path":"packages/newsletters"},
		"gis-collective-api-pages": {"path":"packages/pages"},
		"gis-collective-api-pictures": {"path":"packages/pictures"},
		"gis-collective-api-preferences": {"path":"packages/preferences"},
		"gis-collective-api-presentations": {"path":"packages/presentations"},
		"gis-collective-api-search-meta": {"path":"packages/searchMeta"},
		"gis-collective-api-service-files": {"path":"packages/serviceFiles"},
		"gis-collective-api-sounds": {"path":"packages/sounds"},
		"gis-collective-api-spaces": {"path":"packages/spaces"},
		"gis-collective-api-teams": {"path":"packages/teams"},
		"gis-collective-api-tests": {"path":"packages/tests"},
		"gis-collective-api-tiles": {"path":"packages/tiles"},
		"gis-collective-api-users": {"path":"packages/users"},
		"gis-collective-api-stats": {"path":"packages/stats"},
		"gis-collective-models": {"path":"submodules/ogm-models"},
		"handlebars": "0.3.1",
		"hmq": {"path":"submodules/hmq"},
		"intel-intrinsics": "1.11.15",
		"libasync": "0.8.6",
		"libdparse": "0.20.0",
		"memutils": "1.0.4",
		"mir-linux-kernel": "1.0.1",
		"open-api": "0.3.1-beta.4",
		"openssl": "3.3.0",
		"openssl-static": "1.0.2+3.0.8",
		"stdx-allocator": "2.77.5",
		"stemmer": "0.2.0",
		"taggedalgebraic": "0.11.22",
		"trial": "0.8.0-beta.5",
		"vibe-auth": {"path":"submodules/vibe-auth"},
		"vibe-container": "1.3.0",
		"vibe-core": {"path":"submodules/vibe-core"},
		"vibe-d": {"path":"submodules/vibe-d"},
		"vibe-http": "1.0.0",
		"vibe-inet": "1.0.0",
		"vibe-serialization": "1.0.2",
		"vibe-service": {"path":"submodules/hmq/submodules/vibe-service"},
		"vibe-stream": "1.1.0"
	}
}
