{
	"fileVersion": 1,
	"versions": {
		"cachetools": "0.3.1",
		"crate": {"path":"../../submodules/crate"},
		"d2sqlite3": "1.0.0",
		"ddmp": "0.0.1-0.dev.3",
		"describe-d": "0.11.1",
		"diet-ng": "1.8.1",
		"dub": "1.32.1",
		"dxml": "0.4.3",
		"emsi_containers": "0.9.0",
		"eventcore": "0.9.25",
		"fluent-asserts": "1.0.0",
		"fluent-asserts-vibe": "1.0.0-beta.1",
		"geo": {"path":"../../submodules/geo-d"},
		"gis-collective-api-tests": {"path":"../tests"},
		"gis-collective-models": {"path":"../../submodules/ogm-models"},
		"handlebars": "0.3.1",
		"hmq": {"path":"../../submodules/hmq"},
		"intel-intrinsics": "1.11.15",
		"libasync": "0.8.6",
		"libdparse": "0.20.0",
		"memutils": "1.0.9",
		"mir-linux-kernel": "1.0.1",
		"open-api": "0.3.1-beta.4",
		"openssl": "3.3.0",
		"openssl-static": "1.0.2+3.0.8",
		"stdx-allocator": "2.77.5",
		"taggedalgebraic": "0.11.22",
		"trial": "0.8.0-beta.5",
		"vibe-auth": {"path":"../../submodules/vibe-auth"},
		"vibe-container": "1.3.1",
		"vibe-core": {"path":"../../submodules/vibe-core"},
		"vibe-d": {"path":"../../submodules/vibe-d"},
		"vibe-http": "1.1.0",
		"vibe-inet": "1.0.0",
		"vibe-serialization": "1.0.3",
		"vibe-service": {"path":"../../submodules/hmq/submodules/vibe-service"},
		"vibe-stream": "1.1.0"
	}
}
