{
  "name": "gis-collective-api-newsletters",
  "authors": [
    "Szabo Bogdan"
  ],
  "description": "The newsletters api for GISCollective.",
  "copyright": "Copyright © 2023, Szabo Bogdan",
  "license": "AGPL-3.0",
  "dependencies": {
    "crate": {
      "path": "../../submodules/crate"
    },
    "vibe-auth": {
      "path": "../../submodules/vibe-auth"
    },
    "gis-collective-models": {
      "path": "../../submodules/ogm-models"
    },
    "geo": {
      "path": "../../submodules/geo-d"
    },
    "hmq": {
      "path": "../../submodules/hmq"
    },
    "vibe-service": {
      "path": "../../submodules/hmq/submodules/vibe-service"
    },
    "vibe-core": {
      "path": "../../submodules/vibe-core"
    },
    "vibe-d": {
      "path": "../../submodules/vibe-d"
    },
    "describe-d": "~>0.11.1",
    "d2sqlite3": "*",
    "stdx-allocator": "~>2.77.0"
  },
  "configurations": [
    {
      "name": "library",
      "targetType": "library",
      "sourcePaths": [
        "source"
      ]
    },
    {
      "name": "unittest",
      "targetType": "autodetect",
      "excludedSourceFiles": [
        "source/app.d"
      ],
      "sourcePaths": [
        "source",
        "tests"
      ],
      "importPaths": [
        "source",
        "tests"
      ],
      "dependencies": {
        "fluent-asserts": "*",
        "fluent-asserts-vibe": "*",
        "trial": "0.8.0-beta.5",
        "gis-collective-api-tests": {
          "path": "../tests"
        },
      },
      "versions": [
        "JsonLineNumbers",
        "VibeJsonFieldNames"
      ]
    }
  ]
}