{
	"campaigns": {
		"create campaign notification for your teams": {
			"administrator": "yes",
			"owner": "yes",
			"guest": "no",
			"member": "no",
			"leader": "no",
			"no rights": "-"
		},
		"delete campaigns owned by other teams": {
			"administrator": "yes",
			"owner": "no",
			"guest": "no",
			"member": "no",
			"leader": "no",
			"no rights": "no"
		},
		"update campaigns owned by your teams": {
			"administrator": "yes",
			"owner": "yes",
			"guest": "no",
			"member": "no",
			"leader": "no",
			"no rights": "-"
		},
		"update campaigns owned by other teams": {
			"administrator": "yes",
			"owner": "no",
			"guest": "no",
			"member": "no",
			"leader": "no",
			"no rights": "no"
		},
		"patch campaigns owned by your teams": {
			"administrator": "yes",
			"owner": "yes",
			"guest": "no",
			"member": "no",
			"leader": "no",
			"no rights": "-"
		},
		"get a public campaign": {
			"administrator": "yes",
			"owner": "yes",
			"guest": "yes",
			"member": "yes",
			"leader": "yes",
			"no rights": "yes"
		},
		"delete campaigns owned by your teams": {
			"administrator": "yes",
			"owner": "yes",
			"guest": "no",
			"member": "no",
			"leader": "no",
			"no rights": "-"
		},
		"remove campaign notification for your teams": {
			"administrator": "yes",
			"owner": "yes",
			"guest": "no",
			"member": "no",
			"leader": "no",
			"no rights": "-"
		},
		"create campaign notification for other teams": {
			"administrator": "yes",
			"owner": "no",
			"guest": "no",
			"member": "no",
			"leader": "no",
			"no rights": "no"
		},
		"patch campaigns owned by other teams": {
			"administrator": "yes",
			"owner": "no",
			"guest": "no",
			"member": "no",
			"leader": "no",
			"no rights": "no"
		},
		"get a private campaign owned by other team": {
			"administrator": "yes",
			"owner": "no",
			"guest": "no",
			"member": "no",
			"leader": "no",
			"no rights": "no"
		},
		"create campaigns for other teams": {
			"administrator": "yes",
			"owner": "no",
			"guest": "no",
			"member": "no",
			"leader": "no",
			"no rights": "no"
		},
		"get the list of public campaigns": {
			"administrator": "yes",
			"owner": "yes",
			"guest": "yes",
			"member": "yes",
			"leader": "yes",
			"no rights": "yes"
		},
		"get the list of private campaigns owned by other teams": {
			"administrator": "yes",
			"owner": "no",
			"guest": "no",
			"member": "no",
			"leader": "no",
			"no rights": "no"
		},
		"get the list of the team campaigns": {
			"administrator": "yes",
			"owner": "yes",
			"guest": "yes",
			"member": "yes",
			"leader": "yes",
			"no rights": "-"
		},
		"create campaigns for your teams": {
			"administrator": "yes",
			"owner": "yes",
			"guest": "no",
			"member": "no",
			"leader": "no",
			"no rights": "-"
		},
		"get a private campaign owned by own team": {
			"administrator": "yes",
			"owner": "yes",
			"guest": "yes",
			"member": "yes",
			"leader": "yes",
			"no rights": "-"
		},
		"remove campaign notification for other teams": {
			"administrator": "yes",
			"owner": "no",
			"guest": "no",
			"member": "no",
			"leader": "no",
			"no rights": "no"
		}
	},
	"teams": {
		"create a new team": {
			"administrator": "yes",
			"owner": "yes",
			"guest": "yes",
			"member": "yes",
			"leader": "yes",
			"no rights": "-"
		},
		"can see subscription details": {
			"administrator": "yes",
			"owner": "yes",
			"guest": "no",
			"member": "no",
			"leader": "yes",
			"no rights": "no"
		},
		"query by members": {
			"administrator": "yes",
			"owner": "yes",
			"guest": "yes",
			"member": "yes",
			"leader": "yes",
			"no rights": "yes"
		},
		"update own teams": {
			"administrator": "yes",
			"owner": "yes",
			"guest": "no",
			"member": "no",
			"leader": "no",
			"no rights": "-"
		},
		"update other teams": {
			"administrator": "yes",
			"owner": "no",
			"guest": "no",
			"member": "no",
			"leader": "no",
			"no rights": "-"
		},
		"update the invitations": {
			"administrator": "yes",
			"owner": "yes",
			"guest": "no",
			"member": "no",
			"leader": "no",
			"no rights": "-"
		},
		"can invite a member": {
			"administrator": "yes",
			"owner": "yes",
			"guest": "yes",
			"member": "yes",
			"leader": "yes"
		},
		"update the isPublisher value": {
			"administrator": "yes",
			"owner": "no",
			"guest": "no",
			"member": "no",
			"leader": "no",
			"no rights": "-"
		}
	},
	"features": {
		"add new features using the gpx route format": {
			"administrator": "yes",
			"guest": "yes",
			"owner": "yes",
			"member": "yes",
			"leader": "yes",
			"no rights": "yes"
		},
		"get features from own teams": {
			"administrator": "yes",
			"owner": "yes",
			"guest": "yes",
			"member": "yes",
			"leader": "yes",
			"no rights": "no"
		},
		"get features from own private maps": {
			"administrator": "yes",
			"owner": "yes",
			"guest": "yes",
			"member": "yes",
			"leader": "yes",
			"no rights": "no"
		},
		"edit features using the gpx format": {
			"administrator": "yes",
			"owner": "yes",
			"guest": "no",
			"member": "yes",
			"leader": "yes",
			"no rights": "no"
		},
		"edit other features from their own team": {
			"administrator": "yes",
			"owner": "yes",
			"guest": "no",
			"member": "no",
			"leader": "yes",
			"no rights": "no"
		},
		"view unmasked geometry from own team": {
			"administrator": "yes",
			"owner": "yes",
			"guest": "yes",
			"member": "yes",
			"leader": "yes",
			"no rights": "-"
		},
		"add new features using the gpx track format": {
			"administrator": "yes",
			"guest": "yes",
			"owner": "yes",
			"member": "yes",
			"leader": "yes",
			"no rights": "yes"
		},
		"get features from other teams private maps": {
			"administrator": "yes",
			"owner": "no",
			"guest": "no",
			"member": "no",
			"leader": "no",
			"no rights": "no"
		},
		"add new features on maps that the user does not have access": {
			"administrator": "yes",
			"guest": "no",
			"owner": "no",
			"member": "no",
			"leader": "no",
			"no rights": "no"
		},
		"bulk delete features from owned maps": {
			"administrator": "yes",
			"owner": "yes",
			"guest": "no",
			"member": "no",
			"leader": "yes",
			"no rights": "-"
		},
		"edit own features from their own team": {
			"administrator": "yes",
			"owner": "yes",
			"guest": "yes",
			"member": "yes",
			"leader": "yes",
			"no rights": "no"
		},
		"get features from other teams public maps": {
			"administrator": "yes",
			"owner": "yes",
			"guest": "yes",
			"member": "yes",
			"leader": "yes",
			"no rights": "yes"
		},
		"download masked geometries as gpx": {
			"administrator": "yes",
			"owner": "yes",
			"guest": "yes",
			"member": "yes",
			"leader": "yes",
			"no rights": "yes"
		},
		"download list as csv": {
			"administrator": "yes",
			"guest": "yes",
			"owner": "yes",
			"member": "yes",
			"leader": "yes",
			"no rights": "yes"
		},
		"add new features on private maps": {
			"administrator": "yes",
			"guest": "yes",
			"owner": "yes",
			"member": "yes",
			"leader": "yes",
			"no rights": "no"
		},
		"download list as geojson": {
			"administrator": "yes",
			"guest": "yes",
			"owner": "yes",
			"member": "yes",
			"leader": "yes",
			"no rights": "yes"
		},
		"download unmasked geometries as geojson": {
			"administrator": "yes",
			"owner": "yes",
			"guest": "yes",
			"member": "yes",
			"leader": "yes",
			"no rights": "no"
		},
		"filter by author": {
			"administrator": "yes",
			"owner": "yes",
			"guest": "yes",
			"member": "yes",
			"leader": "yes",
			"no rights": "yes"
		},
		"bulk publish features from owned maps": {
			"administrator": "yes",
			"owner": "yes",
			"guest": "no",
			"member": "no",
			"leader": "yes",
			"no rights": "-"
		},
		"bulk unpublish features from owned maps": {
			"administrator": "yes",
			"owner": "yes",
			"guest": "no",
			"member": "no",
			"leader": "yes",
			"no rights": "-"
		},
		"filter by map": {
			"administrator": "yes",
			"owner": "yes",
			"guest": "yes",
			"member": "yes",
			"leader": "yes",
			"no rights": "yes"
		},
		"get features from own public maps": {
			"administrator": "yes",
			"owner": "yes",
			"guest": "yes",
			"member": "yes",
			"leader": "yes",
			"no rights": "no"
		},
		"delete features from owned maps": {
			"administrator": "yes",
			"owner": "yes",
			"guest": "no",
			"member": "no",
			"leader": "yes",
			"no rights": "no"
		},
		"add new features on public maps": {
			"administrator": "yes",
			"guest": "yes",
			"owner": "yes",
			"member": "yes",
			"leader": "yes",
			"no rights": "yes"
		},
		"download masked geometries as csv": {
			"administrator": "yes",
			"owner": "yes",
			"guest": "yes",
			"member": "yes",
			"leader": "yes",
			"no rights": "yes"
		},
		"edit features from other teams": {
			"administrator": "yes",
			"owner": "no",
			"guest": "no",
			"member": "no",
			"leader": "no",
			"no rights": "no"
		},
		"bulk pending features from owned maps": {
			"administrator": "yes",
			"owner": "yes",
			"guest": "no",
			"member": "no",
			"leader": "yes",
			"no rights": "-"
		},
		"view unmasked geometry from other teams": {
			"administrator": "yes",
			"owner": "no",
			"guest": "no",
			"member": "no",
			"leader": "no",
			"no rights": "no"
		},
		"delete features from other maps": {
			"administrator": "yes",
			"owner": "no",
			"guest": "no",
			"member": "no",
			"leader": "no",
			"no rights": "-"
		}
	},
	"metrics": {
		"push metrics": {
			"administrator": "yes",
			"owner": "yes",
			"guest": "yes",
			"member": "yes",
			"leader": "yes",
			"no rights": "yes"
		},
		"getting a metric": {
			"administrator": "no",
			"owner": "no",
			"guest": "no",
			"member": "no",
			"leader": "no",
			"no rights": "no"
		},
		"delete a metric": {
			"administrator": "no",
			"owner": "no",
			"guest": "no",
			"member": "no",
			"leader": "no",
			"no rights": "no"
		},
		"updating a metric": {
			"administrator": "no",
			"owner": "no",
			"guest": "no",
			"member": "no",
			"leader": "no",
			"no rights": "no"
		},
		"getting a list of metrics": {
			"administrator": "no",
			"owner": "no",
			"guest": "no",
			"member": "no",
			"leader": "no",
			"no rights": "no"
		}
	},
	"calendars": {
		"create a calendar when the team has allowEvents=true": {
			"administrator": "yes",
			"owner": "yes",
			"guest": "no",
			"member": "no",
			"leader": "no",
			"no rights": "no"
		},
		"get a private calendar from own team": {
			"administrator": "yes",
			"owner": "yes",
			"guest": "yes",
			"member": "yes",
			"leader": "yes",
			"no rights": "no"
		},
		"get a public calendar": {
			"administrator": "yes",
			"owner": "yes",
			"guest": "yes",
			"member": "yes",
			"leader": "yes",
			"no rights": "yes"
		},
		"create a calendar when the team has allowEvents=false": {
			"administrator": "yes",
			"owner": "no",
			"guest": "no",
			"member": "no",
			"leader": "no",
			"no rights": "no"
		},
		"delete from other teams": {
			"administrator": "yes",
			"owner": "no",
			"guest": "no",
			"member": "no",
			"leader": "no",
			"no rights": "no"
		},
		"update other team calendar": {
			"administrator": "yes",
			"owner": "no",
			"guest": "no",
			"member": "no",
			"leader": "no",
			"no rights": "no"
		},
		"get a private calendar from other teams": {
			"administrator": "yes",
			"owner": "no",
			"guest": "no",
			"member": "no",
			"leader": "no",
			"no rights": "no"
		},
		"delete from own team": {
			"administrator": "yes",
			"owner": "yes",
			"guest": "yes",
			"member": "yes",
			"leader": "yes",
			"no rights": "no"
		},
		"filter calendars by team": {
			"administrator": "yes",
			"owner": "yes",
			"guest": "yes",
			"member": "yes",
			"leader": "yes",
			"no rights": "no"
		},
		"update team calendar": {
			"administrator": "yes",
			"owner": "yes",
			"guest": "no",
			"member": "no",
			"leader": "no",
			"no rights": "no"
		}
	},
	"articles": {
		"delete articles from own team": {
			"administrator": "yes",
			"owner": "yes",
			"guest": "no",
			"member": "no",
			"leader": "no",
			"no rights": "no"
		},
		"bulk publish articles from own team": {
			"administrator": "yes",
			"owner": "yes",
			"guest": "no",
			"member": "no",
			"leader": "no",
			"no rights": "no"
		},
		"delete any team articles": {
			"administrator": "yes",
			"owner": "yes",
			"guest": "no",
			"member": "no",
			"leader": "no",
			"no rights": "-"
		},
		"test newsletter article": {
			"administrator": "yes",
			"owner": "yes",
			"guest": "no",
			"member": "no",
			"leader": "no",
			"no rights": "no"
		},
		"unpublish newsletter article": {
			"administrator": "yes",
			"owner": "yes",
			"guest": "no",
			"member": "no",
			"leader": "no",
			"no rights": "no"
		},
		"bulk publish own articles": {
			"administrator": "yes",
			"owner": "yes",
			"guest": "no",
			"member": "yes",
			"leader": "yes",
			"no rights": "no"
		},
		"bulk unpublish articles from own team": {
			"administrator": "yes",
			"owner": "yes",
			"guest": "no",
			"member": "no",
			"leader": "no",
			"no rights": "no"
		},
		"bulk unpublish own articles": {
			"administrator": "yes",
			"owner": "yes",
			"guest": "no",
			"member": "yes",
			"leader": "yes",
			"no rights": "no"
		},
		"get private articles": {
			"administrator": "yes",
			"owner": "yes",
			"guest": "yes",
			"member": "yes",
			"leader": "yes",
			"no rights": "no"
		},
		"get the private article list": {
			"administrator": "yes",
			"owner": "yes",
			"guest": "yes",
			"member": "yes",
			"leader": "yes",
			"no rights": "no"
		},
		"bulk unpublish articles from other teams": {
			"administrator": "yes",
			"owner": "no",
			"guest": "no",
			"member": "no",
			"leader": "no",
			"no rights": "no"
		},
		"delete own articles": {
			"administrator": "yes",
			"owner": "yes",
			"guest": "no",
			"member": "yes",
			"leader": "yes",
			"no rights": "no"
		},
		"publish newsletter article": {
			"administrator": "yes",
			"owner": "yes",
			"guest": "no",
			"member": "no",
			"leader": "no",
			"no rights": "no"
		},
		"get public article by slug": {
			"administrator": "yes",
			"owner": "yes",
			"guest": "yes",
			"member": "yes",
			"leader": "yes",
			"no rights": "yes"
		},
		"get the public article list": {
			"administrator": "yes",
			"owner": "yes",
			"guest": "yes",
			"member": "yes",
			"leader": "yes",
			"no rights": "yes"
		},
		"create articles for publisher teams": {
			"administrator": "yes",
			"owner": "yes",
			"guest": "no",
			"member": "no",
			"leader": "no",
			"no rights": "-"
		},
		"bulk publish articles from other teams": {
			"administrator": "yes",
			"owner": "no",
			"guest": "no",
			"member": "no",
			"leader": "no",
			"no rights": "no"
		},
		"update own articles": {
			"administrator": "yes",
			"owner": "yes",
			"guest": "yes",
			"member": "yes",
			"leader": "yes",
			"no rights": "-"
		},
		"update team articles": {
			"administrator": "yes",
			"owner": "yes",
			"guest": "no",
			"member": "no",
			"leader": "no",
			"no rights": "-"
		},
		"get public article by id": {
			"administrator": "yes",
			"owner": "yes",
			"guest": "yes",
			"member": "yes",
			"leader": "yes",
			"no rights": "yes"
		}
	},
	"maps": {
		"get the indexable maps using `isIndex` query": {
			"administrator": "yes",
			"owner": "yes",
			"guest": "yes",
			"member": "yes",
			"leader": "yes",
			"no rights": "yes"
		},
		"change the `isIndex` field": {
			"administrator": "yes",
			"owner": "no",
			"guest": "no",
			"member": "no",
			"leader": "no",
			"no rights": "-"
		},
		"change the `created on` field": {
			"administrator": "yes",
			"owner": "yes",
			"guest": "no",
			"member": "no",
			"leader": "no",
			"no rights": "-"
		},
		"download as geopackage for own maps": {
			"administrator": "yes",
			"owner": "yes",
			"guest": "yes",
			"member": "yes",
			"leader": "yes",
			"no rights": "-"
		},
		"get the sprite when the map is public": {
			"administrator": "yes",
			"owner": "yes",
			"guest": "yes",
			"member": "yes",
			"leader": "yes",
			"no rights": "no"
		},
		"download as geopackage for other maps": {
			"administrator": "yes",
			"owner": "no",
			"guest": "no",
			"member": "no",
			"leader": "no",
			"no rights": "no"
		},
		"update maps for other teams": {
			"administrator": "yes",
			"owner": "no",
			"guest": "no",
			"member": "no",
			"leader": "no",
			"no rights": "no"
		},
		"update maps for your teams": {
			"administrator": "yes",
			"owner": "yes",
			"guest": "no",
			"member": "no",
			"leader": "no",
			"no rights": "-"
		},
		"create indexable maps": {
			"administrator": "yes",
			"owner": "no",
			"guest": "no",
			"member": "no",
			"leader": "no",
			"no rights": "no"
		},
		"change the `hideOnMainMap` field": {
			"administrator": "yes",
			"owner": "no",
			"guest": "no",
			"member": "no",
			"leader": "no",
			"no rights": "-"
		},
		"delete maps owned by other teams": {
			"administrator": "yes",
			"owner": "no",
			"guest": "no",
			"member": "no",
			"leader": "no",
			"no rights": "no"
		},
		"create maps for other teams": {
			"administrator": "yes",
			"owner": "no",
			"guest": "no",
			"member": "no",
			"leader": "no",
			"no rights": "no"
		},
		"use iconsets from other teams": {
			"administrator": "no",
			"owner": "no",
			"guest": "no",
			"member": "no",
			"leader": "no",
			"no rights": "-"
		},
		"create maps for your teams": {
			"administrator": "yes",
			"owner": "yes",
			"guest": "no",
			"member": "no",
			"leader": "no",
			"no rights": "-"
		},
		"change the `original author` field": {
			"administrator": "yes",
			"owner": "yes",
			"guest": "no",
			"member": "no",
			"leader": "no",
			"no rights": "-"
		},
		"delete maps owned by your teams": {
			"administrator": "yes",
			"owner": "yes",
			"guest": "no",
			"member": "no",
			"leader": "no",
			"no rights": "-"
		},
		"create maps that are hidden on the main map": {
			"administrator": "yes",
			"owner": "no",
			"guest": "no",
			"member": "no",
			"leader": "no",
			"no rights": "no"
		}
	},
	"pages": {
		"unpublish pages from other teams": {
			"administrator": "yes",
			"owner": "no",
			"guest": "no",
			"member": "no",
			"leader": "no",
			"no rights": "no"
		},
		"delete own pages": {
			"administrator": "yes",
			"owner": "yes",
			"guest": "no",
			"member": "yes",
			"leader": "yes",
			"no rights": "no"
		},
		"get the own page list": {
			"administrator": "yes",
			"owner": "yes",
			"guest": "yes",
			"member": "yes",
			"leader": "yes",
			"no rights": "-"
		},
		"get private pages": {
			"administrator": "yes",
			"owner": "yes",
			"guest": "yes",
			"member": "yes",
			"leader": "yes",
			"no rights": "no"
		},
		"bulk publish pages from own team": {
			"administrator": "yes",
			"owner": "yes",
			"guest": "no",
			"member": "no",
			"leader": "no",
			"no rights": "no"
		},
		"delete any team pages": {
			"administrator": "yes",
			"owner": "yes",
			"guest": "no",
			"member": "no",
			"leader": "no",
			"no rights": "-"
		},
		"delete pages from own team": {
			"administrator": "yes",
			"owner": "yes",
			"guest": "no",
			"member": "no",
			"leader": "no",
			"no rights": "no"
		},
		"update team pages": {
			"administrator": "yes",
			"owner": "yes",
			"guest": "no",
			"member": "no",
			"leader": "no",
			"no rights": "-"
		},
		"get public page by slug": {
			"administrator": "yes",
			"owner": "yes",
			"guest": "yes",
			"member": "yes",
			"leader": "yes",
			"no rights": "yes"
		},
		"get public page by id": {
			"administrator": "yes",
			"owner": "yes",
			"guest": "yes",
			"member": "yes",
			"leader": "yes",
			"no rights": "yes"
		},
		"create pages for non publisher teams": {
			"administrator": "yes",
			"owner": "no",
			"guest": "no",
			"member": "no",
			"leader": "no",
			"no rights": "-"
		},
		"bulk publish pages from other teams": {
			"administrator": "yes",
			"owner": "no",
			"guest": "no",
			"member": "no",
			"leader": "no",
			"no rights": "no"
		},
		"get the public page list": {
			"administrator": "yes",
			"owner": "yes",
			"guest": "yes",
			"member": "yes",
			"leader": "yes",
			"no rights": "yes"
		},
		"bulk publish own pages": {
			"administrator": "yes",
			"owner": "yes",
			"guest": "no",
			"member": "yes",
			"leader": "yes",
			"no rights": "no"
		},
		"bulk unpublish own pages": {
			"administrator": "yes",
			"owner": "yes",
			"guest": "no",
			"member": "yes",
			"leader": "yes",
			"no rights": "no"
		},
		"unpublish own pages": {
			"administrator": "yes",
			"owner": "yes",
			"guest": "no",
			"member": "yes",
			"leader": "yes",
			"no rights": "no"
		},
		"publish own pages": {
			"administrator": "yes",
			"owner": "yes",
			"guest": "no",
			"member": "yes",
			"leader": "yes",
			"no rights": "no"
		},
		"create pages for publisher teams": {
			"administrator": "yes",
			"owner": "yes",
			"guest": "no",
			"member": "no",
			"leader": "no",
			"no rights": "-"
		},
		"bulk unpublish pages from own team": {
			"administrator": "yes",
			"owner": "yes",
			"guest": "no",
			"member": "no",
			"leader": "no",
			"no rights": "no"
		},
		"get the private page list": {
			"administrator": "yes",
			"owner": "yes",
			"guest": "yes",
			"member": "yes",
			"leader": "yes",
			"no rights": "no"
		},
		"bulk unpublish pages from other teams": {
			"administrator": "yes",
			"owner": "no",
			"guest": "no",
			"member": "no",
			"leader": "no",
			"no rights": "no"
		},
		"update own pages": {
			"administrator": "yes",
			"owner": "yes",
			"guest": "yes",
			"member": "yes",
			"leader": "yes",
			"no rights": "-"
		},
		"publish pages from other teams": {
			"administrator": "yes",
			"owner": "no",
			"guest": "no",
			"member": "no",
			"leader": "no",
			"no rights": "no"
		}
	},
	"search metadata": {
		"searching for private records owned by other team": {
			"administrator": "yes",
			"owner": "no",
			"guest": "no",
			"member": "no",
			"leader": "no",
			"no rights": "-"
		},
		"searching for private records owned by own team": {
			"administrator": "yes",
			"owner": "yes",
			"guest": "yes",
			"member": "yes",
			"leader": "yes",
			"no rights": "-"
		},
		"create search metadata": {
			"administrator": "no",
			"owner": "no",
			"guest": "no",
			"member": "no",
			"leader": "no",
			"no rights": "no"
		},
		"delete search metadata": {
			"administrator": "no",
			"owner": "no",
			"guest": "no",
			"member": "no",
			"leader": "no",
			"no rights": "no"
		},
		"searching for public records": {
			"administrator": "yes",
			"owner": "yes",
			"guest": "yes",
			"member": "yes",
			"leader": "yes",
			"no rights": "yes"
		},
		"update search metadata": {
			"administrator": "no",
			"owner": "no",
			"guest": "no",
			"member": "no",
			"leader": "no",
			"no rights": "no"
		}
	},
	"geocoding": {
		"query without a term": {
			"administrator": "no",
			"owner": "no",
			"guest": "no",
			"member": "no",
			"leader": "no",
			"no rights": "no"
		},
		"update": {
			"administrator": "no",
			"owner": "no",
			"guest": "no",
			"member": "no",
			"leader": "no",
			"no rights": "no"
		},
		"delete": {
			"administrator": "no",
			"owner": "no",
			"guest": "no",
			"member": "no",
			"leader": "no",
			"no rights": "no"
		},
		"get item": {
			"administrator": "no",
			"owner": "no",
			"guest": "no",
			"member": "no",
			"leader": "no",
			"no rights": "no"
		},
		"query with a term": {
			"administrator": "yes",
			"owner": "yes",
			"guest": "yes",
			"member": "yes",
			"leader": "yes",
			"no rights": "yes"
		},
		"create": {
			"administrator": "no",
			"owner": "no",
			"guest": "no",
			"member": "no",
			"leader": "no",
			"no rights": "no"
		}
	},
	"data bindings": {
		"get data binding by id": {
			"administrator": "yes",
			"owner": "yes",
			"guest": "yes",
			"member": "yes",
			"leader": "yes",
			"no rights": "yes"
		},
		"get the own data binding list": {
			"administrator": "yes",
			"owner": "yes",
			"guest": "yes",
			"member": "yes",
			"leader": "yes",
			"no rights": "-"
		},
		"update own data bindings": {
			"administrator": "yes",
			"owner": "yes",
			"guest": "yes",
			"member": "yes",
			"leader": "yes",
			"no rights": "-"
		},
		"get the private data binding list": {
			"administrator": "yes",
			"owner": "yes",
			"guest": "yes",
			"member": "yes",
			"leader": "yes",
			"no rights": "no"
		},
		"delete any team data binding": {
			"administrator": "yes",
			"owner": "yes",
			"guest": "no",
			"member": "no",
			"leader": "no",
			"no rights": "-"
		},
		"create for own team": {
			"administrator": "yes",
			"owner": "yes",
			"guest": "no",
			"member": "no",
			"leader": "no",
			"no rights": "-"
		},
		"get the public data binding list": {
			"administrator": "yes",
			"owner": "yes",
			"guest": "yes",
			"member": "yes",
			"leader": "yes",
			"no rights": "yes"
		},
		"update team data bindings": {
			"administrator": "yes",
			"owner": "yes",
			"guest": "no",
			"member": "no",
			"leader": "no",
			"no rights": "-"
		},
		"delete own data binding": {
			"administrator": "yes",
			"owner": "yes",
			"guest": "yes",
			"member": "yes",
			"leader": "yes",
			"no rights": "-"
		}
	},
	"tiles": {
		"get the tile json of a public map": {
			"administrator": "yes",
			"owner": "yes",
			"guest": "yes",
			"member": "yes",
			"leader": "yes",
			"no rights": "yes"
		},
		"get the style json of a private map": {
			"administrator": "yes",
			"owner": "yes",
			"guest": "yes",
			"member": "yes",
			"leader": "yes",
			"no rights": "no"
		},
		"get the tile json of a private map": {
			"administrator": "yes",
			"owner": "yes",
			"guest": "yes",
			"member": "yes",
			"leader": "yes",
			"no rights": "no"
		},
		"get the style json of a public map": {
			"administrator": "yes",
			"owner": "yes",
			"guest": "yes",
			"member": "yes",
			"leader": "yes",
			"no rights": "yes"
		}
	},
	"icon sets": {
		"view public records": {
			"administrator": "yes",
			"owner": "yes",
			"guest": "yes",
			"member": "yes",
			"leader": "yes",
			"no rights": "yes"
		},
		"delete team records": {
			"administrator": "yes",
			"owner": "yes",
			"guest": "no",
			"member": "no",
			"leader": "no",
			"no rights": "-"
		},
		"create for team": {
			"administrator": "yes",
			"owner": "yes",
			"guest": "no",
			"member": "no",
			"leader": "no",
			"no rights": "-"
		},
		"edit team other team records": {
			"administrator": "yes",
			"owner": "no",
			"guest": "no",
			"member": "no",
			"leader": "no",
			"no rights": "-"
		},
		"view team records": {
			"administrator": "yes",
			"owner": "yes",
			"guest": "yes",
			"member": "yes",
			"leader": "yes",
			"no rights": "-"
		},
		"view editable team records": {
			"administrator": "yes",
			"owner": "yes",
			"guest": "no",
			"member": "no",
			"leader": "no",
			"no rights": "no"
		},
		"edit team records": {
			"administrator": "yes",
			"owner": "yes",
			"guest": "no",
			"member": "no",
			"leader": "no",
			"no rights": "-"
		},
		"create for other team": {
			"administrator": "yes",
			"owner": "no",
			"guest": "no",
			"member": "no",
			"leader": "no",
			"no rights": "-"
		},
		"view default records": {
			"administrator": "yes",
			"owner": "yes",
			"guest": "yes",
			"member": "yes",
			"leader": "yes",
			"no rights": "yes"
		},
		"view all": {
			"administrator": "yes",
			"owner": "no",
			"guest": "no",
			"member": "no",
			"leader": "no",
			"no rights": "no"
		},
		"delete other team records": {
			"administrator": "yes",
			"owner": "no",
			"guest": "no",
			"member": "no",
			"leader": "no",
			"no rights": "-"
		}
	},
	"events": {
		"get a private event from other teams": {
			"administrator": "yes",
			"owner": "no",
			"guest": "no",
			"member": "no",
			"leader": "no",
			"no rights": "no"
		},
		"filter events by team": {
			"administrator": "yes",
			"owner": "yes",
			"guest": "yes",
			"member": "yes",
			"leader": "yes",
			"no rights": "no"
		},
		"bulk unpublish events from own team": {
			"administrator": "yes",
			"owner": "yes",
			"guest": "no",
			"member": "no",
			"leader": "no",
			"no rights": "no"
		},
		"filter events by a team calendar": {
			"administrator": "yes",
			"owner": "yes",
			"guest": "yes",
			"member": "yes",
			"leader": "yes",
			"no rights": "yes"
		},
		"create an event when the team has allowEvents=false": {
			"administrator": "yes",
			"owner": "no",
			"guest": "no",
			"member": "no",
			"leader": "no",
			"no rights": "no"
		},
		"delete events from own team": {
			"administrator": "yes",
			"owner": "yes",
			"guest": "no",
			"member": "no",
			"leader": "no",
			"no rights": "no"
		},
		"delete from other teams": {
			"administrator": "yes",
			"owner": "no",
			"guest": "no",
			"member": "no",
			"leader": "no",
			"no rights": "-"
		},
		"bulk publish events from own team": {
			"administrator": "yes",
			"owner": "yes",
			"guest": "no",
			"member": "no",
			"leader": "no",
			"no rights": "no"
		},
		"get a private event from own team": {
			"administrator": "yes",
			"owner": "yes",
			"guest": "yes",
			"member": "yes",
			"leader": "yes",
			"no rights": "no"
		},
		"update team event": {
			"administrator": "yes",
			"owner": "yes",
			"guest": "no",
			"member": "no",
			"leader": "yes",
			"no rights": "-"
		},
		"bulk publish events from other teams": {
			"administrator": "yes",
			"owner": "no",
			"guest": "no",
			"member": "no",
			"leader": "no",
			"no rights": "no"
		},
		"bulk unpublish events from other teams": {
			"administrator": "yes",
			"owner": "no",
			"guest": "no",
			"member": "no",
			"leader": "no",
			"no rights": "no"
		},
		"bulk unpublish own events": {
			"administrator": "yes",
			"owner": "yes",
			"guest": "no",
			"member": "yes",
			"leader": "yes",
			"no rights": "no"
		},
		"create an event when the team has allowEvents=true": {
			"administrator": "yes",
			"owner": "yes",
			"guest": "no",
			"member": "yes",
			"leader": "yes",
			"no rights": "no"
		},
		"update other team event": {
			"administrator": "yes",
			"owner": "no",
			"guest": "no",
			"member": "no",
			"leader": "no",
			"no rights": "-"
		},
		"delete from own team": {
			"administrator": "yes",
			"owner": "yes",
			"guest": "no",
			"member": "no",
			"leader": "yes",
			"no rights": "-"
		},
		"get a public event": {
			"administrator": "yes",
			"owner": "yes",
			"guest": "yes",
			"member": "yes",
			"leader": "yes",
			"no rights": "yes"
		},
		"delete events from other team": {
			"administrator": "yes",
			"owner": "no",
			"guest": "no",
			"member": "no",
			"leader": "no",
			"no rights": "no"
		},
		"bulk publish own events": {
			"administrator": "yes",
			"owner": "yes",
			"guest": "no",
			"member": "yes",
			"leader": "yes",
			"no rights": "no"
		},
		"update own team event": {
			"administrator": "yes",
			"owner": "yes",
			"guest": "yes",
			"member": "yes",
			"leader": "yes",
			"no rights": "-"
		},
		"filter events by other team calendar": {
			"administrator": "yes",
			"owner": "yes",
			"guest": "yes",
			"member": "yes",
			"leader": "yes",
			"no rights": "yes"
		},
		"delete own events": {
			"administrator": "yes",
			"owner": "yes",
			"guest": "no",
			"member": "yes",
			"leader": "yes",
			"no rights": "no"
		}
	},
	"icons": {
		"view private other team records": {
			"administrator": "yes",
			"owner": "no",
			"guest": "no",
			"member": "no",
			"leader": "no",
			"no rights": "-"
		},
		"edit other team records": {
			"administrator": "yes",
			"owner": "no",
			"guest": "no",
			"member": "no",
			"leader": "no",
			"no rights": "-"
		},
		"view public records": {
			"administrator": "yes",
			"owner": "yes",
			"guest": "yes",
			"member": "yes",
			"leader": "yes",
			"no rights": "yes"
		},
		"delete team records": {
			"administrator": "yes",
			"owner": "yes",
			"guest": "no",
			"member": "no",
			"leader": "no",
			"no rights": "-"
		},
		"create for team": {
			"administrator": "yes",
			"owner": "yes",
			"guest": "no",
			"member": "no",
			"leader": "no",
			"no rights": "-"
		},
		"view editable team records": {
			"administrator": "yes",
			"owner": "no",
			"guest": "no",
			"member": "no",
			"leader": "no",
			"no rights": "-"
		},
		"edit team records": {
			"administrator": "yes",
			"owner": "yes",
			"guest": "no",
			"member": "no",
			"leader": "no",
			"no rights": "-"
		},
		"view public records by id": {
			"administrator": "yes",
			"owner": "yes",
			"guest": "yes",
			"member": "yes",
			"leader": "yes",
			"no rights": "yes"
		},
		"create for other team": {
			"administrator": "yes",
			"owner": "no",
			"guest": "no",
			"member": "no",
			"leader": "no",
			"no rights": "-"
		},
		"view private own team records": {
			"administrator": "yes",
			"owner": "yes",
			"guest": "yes",
			"member": "yes",
			"leader": "yes",
			"no rights": "-"
		},
		"delete other team records": {
			"administrator": "yes",
			"owner": "no",
			"guest": "no",
			"member": "no",
			"leader": "no",
			"no rights": "-"
		}
	},
	"newsletters": {
		"export emails from own newsletter": {
			"administrator": "yes",
			"owner": "yes",
			"guest": "no",
			"member": "no",
			"leader": "yes",
			"no rights": "no"
		},
		"update team newsletter": {
			"administrator": "yes",
			"owner": "yes",
			"guest": "no",
			"member": "no",
			"leader": "no",
			"no rights": "no"
		},
		"update other team newsletter": {
			"administrator": "yes",
			"owner": "no",
			"guest": "no",
			"member": "no",
			"leader": "no",
			"no rights": "no"
		},
		"delete from other teams": {
			"administrator": "yes",
			"owner": "no",
			"guest": "no",
			"member": "no",
			"leader": "no",
			"no rights": "no"
		},
		"can create a newsletter when the team has allowNewsletters=false": {
			"administrator": "yes",
			"owner": "no",
			"guest": "no",
			"member": "no",
			"leader": "no",
			"no rights": "no"
		},
		"filter newsletters by team": {
			"administrator": "yes",
			"owner": "yes",
			"guest": "yes",
			"member": "yes",
			"leader": "yes",
			"no rights": "no"
		},
		"import emails to other teams newsletter": {
			"administrator": "yes",
			"owner": "no",
			"guest": "no",
			"member": "no",
			"leader": "no",
			"no rights": "no"
		},
		"get a private newsletter from other teams": {
			"administrator": "yes",
			"owner": "no",
			"guest": "no",
			"member": "no",
			"leader": "no",
			"no rights": "no"
		},
		"delete from own team": {
			"administrator": "yes",
			"owner": "yes",
			"guest": "yes",
			"member": "yes",
			"leader": "yes",
			"no rights": "no"
		},
		"import emails to own newsletter": {
			"administrator": "yes",
			"owner": "yes",
			"guest": "no",
			"member": "no",
			"leader": "yes",
			"no rights": "no"
		},
		"export emails from other teams newsletter": {
			"administrator": "yes",
			"owner": "no",
			"guest": "no",
			"member": "no",
			"leader": "no",
			"no rights": "no"
		},
		"get a private newsletter from own team": {
			"administrator": "yes",
			"owner": "yes",
			"guest": "yes",
			"member": "yes",
			"leader": "yes",
			"no rights": "no"
		},
		"can create a newsletter when the team has allowNewsletters=true": {
			"administrator": "yes",
			"owner": "yes",
			"guest": "no",
			"member": "no",
			"leader": "no",
			"no rights": "no"
		},
		"get a public newsletter": {
			"administrator": "yes",
			"owner": "yes",
			"guest": "yes",
			"member": "yes",
			"leader": "yes",
			"no rights": "yes"
		}
	},
	"map files": {
		"add new files to joined maps": {
			"administrator": "yes",
			"owner": "yes",
			"guest": "no",
			"member": "yes",
			"leader": "yes",
			"no rights": "-"
		},
		"update options for files of joined maps": {
			"administrator": "yes",
			"owner": "yes",
			"guest": "no",
			"member": "yes",
			"leader": "yes",
			"no rights": "-"
		},
		"trigger import tasks for other maps": {
			"administrator": "yes",
			"owner": "no",
			"guest": "no",
			"member": "no",
			"leader": "no",
			"no rights": "no"
		},
		"trigger cancel import tasks for joined maps": {
			"administrator": "yes",
			"owner": "yes",
			"guest": "no",
			"member": "yes",
			"leader": "yes",
			"no rights": "-"
		},
		"trigger import tasks for joined maps": {
			"administrator": "yes",
			"owner": "yes",
			"guest": "no",
			"member": "yes",
			"leader": "yes",
			"no rights": "-"
		},
		"update options for files of other maps": {
			"administrator": "yes",
			"owner": "no",
			"guest": "no",
			"member": "no",
			"leader": "no",
			"no rights": "no"
		},
		"add new files to other maps": {
			"administrator": "yes",
			"owner": "no",
			"guest": "no",
			"member": "no",
			"leader": "no",
			"no rights": "no"
		},
		"trigger cancel import tasks for other maps": {
			"administrator": "yes",
			"owner": "no",
			"guest": "no",
			"member": "no",
			"leader": "no",
			"no rights": "no"
		}
	},
	"spaces": {
		"delete any team spaces": {
			"administrator": "yes",
			"owner": "yes",
			"guest": "no",
			"member": "no",
			"leader": "no",
			"no rights": "-"
		},
		"delete own spaces": {
			"administrator": "yes",
			"owner": "yes",
			"guest": "yes",
			"member": "yes",
			"leader": "yes",
			"no rights": "-"
		},
		"get the public space list": {
			"administrator": "yes",
			"owner": "yes",
			"guest": "yes",
			"member": "yes",
			"leader": "yes",
			"no rights": "yes"
		},
		"get private spaces": {
			"administrator": "yes",
			"owner": "yes",
			"guest": "yes",
			"member": "yes",
			"leader": "yes",
			"no rights": "no"
		},
		"create for own team": {
			"administrator": "yes",
			"owner": "yes",
			"guest": "no",
			"member": "no",
			"leader": "no",
			"no rights": "-"
		},
		"update team spaces": {
			"administrator": "yes",
			"owner": "yes",
			"guest": "no",
			"member": "no",
			"leader": "no",
			"no rights": "-"
		},
		"get public space by id": {
			"administrator": "yes",
			"owner": "yes",
			"guest": "yes",
			"member": "yes",
			"leader": "yes",
			"no rights": "yes"
		},
		"get the private space list": {
			"administrator": "yes",
			"owner": "yes",
			"guest": "yes",
			"member": "yes",
			"leader": "yes",
			"no rights": "no"
		},
		"set a as template": {
			"administrator": "yes",
			"owner": "no",
			"guest": "no",
			"member": "no",
			"leader": "no"
		},
		"get the own space list": {
			"administrator": "yes",
			"owner": "yes",
			"guest": "yes",
			"member": "yes",
			"leader": "yes",
			"no rights": "-"
		},
		"update own spaces": {
			"administrator": "yes",
			"owner": "yes",
			"guest": "yes",
			"member": "yes",
			"leader": "yes",
			"no rights": "-"
		}
	},
	"article links": {
		"delete an article link": {
			"administrator": "no",
			"owner": "no",
			"guest": "no",
			"member": "no",
			"leader": "no",
			"no rights": "no"
		},
		"update an article link": {
			"administrator": "no",
			"owner": "no",
			"guest": "no",
			"member": "no",
			"leader": "no",
			"no rights": "no"
		},
		"get the article links list": {
			"administrator": "no",
			"owner": "no",
			"guest": "no",
			"member": "no",
			"leader": "no",
			"no rights": "no"
		},
		"create an article link": {
			"administrator": "no",
			"owner": "no",
			"guest": "no",
			"member": "no",
			"leader": "no",
			"no rights": "no"
		},
		"get an article link": {
			"administrator": "yes",
			"owner": "yes",
			"guest": "yes",
			"member": "yes",
			"leader": "yes",
			"no rights": "yes"
		}
	},
	"map tiles": {
		"get map tiles with unmasked data with a map selector for other teams": {
			"administrator": "yes",
			"owner": "no",
			"guest": "no",
			"member": "no",
			"leader": "no",
			"no rights": "no"
		},
		"get map tiles with private features owned by the team": {
			"administrator": "yes",
			"owner": "yes",
			"guest": "yes",
			"member": "yes",
			"leader": "yes",
			"no rights": "-"
		},
		"get map tiles for a private map owned by other team": {
			"administrator": "yes",
			"owner": "no",
			"guest": "no",
			"member": "no",
			"leader": "no",
			"no rights": "-"
		},
		"get map tiles with private features owned by other teams": {
			"administrator": "yes",
			"owner": "no",
			"guest": "no",
			"member": "no",
			"leader": "no",
			"no rights": "-"
		},
		"filter public map tiles by icons": {
			"administrator": "yes",
			"owner": "yes",
			"guest": "yes",
			"member": "yes",
			"leader": "yes",
			"no rights": "yes"
		},
		"get map tiles with masked data without a map selector": {
			"administrator": "yes",
			"owner": "yes",
			"guest": "yes",
			"member": "yes",
			"leader": "yes",
			"no rights": "yes"
		},
		"get map tiles with pending data": {
			"administrator": "yes",
			"owner": "yes",
			"guest": "yes",
			"member": "yes",
			"leader": "yes",
			"no rights": "yes"
		},
		"get map tiles for a private map owned by the team": {
			"administrator": "yes",
			"owner": "yes",
			"guest": "yes",
			"member": "yes",
			"leader": "yes",
			"no rights": "-"
		},
		"get map tiles with public data": {
			"administrator": "yes",
			"owner": "yes",
			"guest": "yes",
			"member": "yes",
			"leader": "yes",
			"no rights": "yes"
		},
		"get map tiles with unmasked data with a map selector for own team": {
			"administrator": "yes",
			"owner": "yes",
			"guest": "yes",
			"member": "yes",
			"leader": "yes",
			"no rights": "-"
		}
	},
	"presentations": {
		"get public presentation by id": {
			"administrator": "yes",
			"owner": "yes",
			"guest": "yes",
			"member": "yes",
			"leader": "yes",
			"no rights": "yes"
		},
		"delete own presentations": {
			"administrator": "yes",
			"owner": "yes",
			"guest": "yes",
			"member": "yes",
			"leader": "yes",
			"no rights": "-"
		},
		"get the public presentation list": {
			"administrator": "yes",
			"owner": "yes",
			"guest": "yes",
			"member": "yes",
			"leader": "yes",
			"no rights": "yes"
		},
		"delete any team presentations": {
			"administrator": "yes",
			"owner": "yes",
			"guest": "no",
			"member": "no",
			"leader": "no",
			"no rights": "-"
		},
		"get the own presentation list": {
			"administrator": "yes",
			"owner": "yes",
			"guest": "yes",
			"member": "yes",
			"leader": "yes",
			"no rights": "-"
		},
		"get the private presentation list": {
			"administrator": "yes",
			"owner": "yes",
			"guest": "yes",
			"member": "yes",
			"leader": "yes",
			"no rights": "no"
		},
		"update own presentations": {
			"administrator": "yes",
			"owner": "yes",
			"guest": "yes",
			"member": "yes",
			"leader": "yes",
			"no rights": "-"
		},
		"create presentations for non publisher teams": {
			"administrator": "yes",
			"owner": "no",
			"guest": "no",
			"member": "no",
			"leader": "no",
			"no rights": "-"
		},
		"get private presentations": {
			"administrator": "yes",
			"owner": "yes",
			"guest": "yes",
			"member": "yes",
			"leader": "yes",
			"no rights": "no"
		},
		"get public presentation by slug": {
			"administrator": "yes",
			"owner": "yes",
			"guest": "yes",
			"member": "yes",
			"leader": "yes",
			"no rights": "yes"
		},
		"update team presentations": {
			"administrator": "yes",
			"owner": "yes",
			"guest": "no",
			"member": "no",
			"leader": "no",
			"no rights": "-"
		},
		"create presentations for publisher teams": {
			"administrator": "yes",
			"owner": "yes",
			"guest": "no",
			"member": "no",
			"leader": "no",
			"no rights": "-"
		}
	},
	"base maps": {
		"search base maps by name": {
			"administrator": "yes",
			"owner": "yes",
			"guest": "yes",
			"member": "yes",
			"leader": "yes",
			"no rights": "yes"
		},
		"set base maps as default": {
			"administrator": "yes",
			"owner": "no",
			"guest": "no",
			"member": "no",
			"leader": "no",
			"no rights": "no"
		},
		"get the list of editable base maps owned by other teams": {
			"administrator": "yes",
			"owner": "no",
			"guest": "no",
			"member": "no",
			"leader": "no",
			"no rights": "-"
		},
		"update base maps for your teams": {
			"administrator": "yes",
			"owner": "yes",
			"guest": "no",
			"member": "no",
			"leader": "no",
			"no rights": "-"
		},
		"create base maps for other teams": {
			"administrator": "yes",
			"owner": "no",
			"guest": "no",
			"member": "no",
			"leader": "no",
			"no rights": "-"
		},
		"get the list of default private base maps owned by your teams": {
			"administrator": "yes",
			"owner": "yes",
			"guest": "yes",
			"member": "yes",
			"leader": "yes",
			"no rights": "-"
		},
		"create default base maps": {
			"administrator": "yes",
			"owner": "no",
			"guest": "no",
			"member": "no",
			"leader": "no",
			"no rights": "-"
		},
		"get the list of default private base maps owned by other teams": {
			"administrator": "yes",
			"owner": "no",
			"guest": "no",
			"member": "no",
			"leader": "no",
			"no rights": "-"
		},
		"update base maps for other teams": {
			"administrator": "yes",
			"owner": "no",
			"guest": "no",
			"member": "no",
			"leader": "no",
			"no rights": "no"
		},
		"delete base maps owned by your teams": {
			"administrator": "yes",
			"owner": "yes",
			"guest": "no",
			"member": "no",
			"leader": "no",
			"no rights": "-"
		},
		"get the list of editable base maps owned by your teams": {
			"administrator": "yes",
			"owner": "yes",
			"guest": "no",
			"member": "no",
			"leader": "no",
			"no rights": "-"
		},
		"get the list of default base maps": {
			"administrator": "yes",
			"owner": "yes",
			"guest": "yes",
			"member": "yes",
			"leader": "yes",
			"no rights": "yes"
		},
		"create base maps for your teams": {
			"administrator": "yes",
			"owner": "yes",
			"guest": "no",
			"member": "no",
			"leader": "no",
			"no rights": "-"
		},
		"delete base maps owned by other teams": {
			"administrator": "yes",
			"owner": "no",
			"guest": "no",
			"member": "no",
			"leader": "no",
			"no rights": "no"
		}
	},
	"sounds": {
		"add mp3 sounds to other private teams": {
			"administrator": "yes",
			"owner": "yes",
			"guest": "yes",
			"member": "yes",
			"leader": "yes",
			"no rights": "-"
		},
		"add mp3 sounds to a public team": {
			"administrator": "yes",
			"owner": "yes",
			"guest": "yes",
			"member": "yes",
			"leader": "yes",
			"no rights": "yes"
		},
		"listen public sounds": {
			"administrator": "yes",
			"owner": "yes",
			"guest": "yes",
			"member": "yes",
			"leader": "yes",
			"no rights": "yes"
		},
		"listen team sounds": {
			"administrator": "yes",
			"owner": "yes",
			"guest": "yes",
			"member": "yes",
			"leader": "yes",
			"no rights": "-"
		},
		"update team sounds": {
			"administrator": "yes",
			"owner": "yes",
			"guest": "no",
			"member": "no",
			"leader": "no",
			"no rights": "-"
		},
		"delete team sounds": {
			"administrator": "yes",
			"owner": "yes",
			"guest": "no",
			"member": "no",
			"leader": "no",
			"no rights": "-"
		},
		"add mp3 sounds to owned private teams": {
			"administrator": "yes",
			"owner": "yes",
			"guest": "yes",
			"member": "yes",
			"leader": "yes",
			"no rights": "-"
		}
	},
	"survey answers": {
		"manually trigger a mapSync when the team owns the campaign": {
			"administrator": "yes",
			"owner": "yes",
			"guest": "no",
			"member": "yes",
			"leader": "yes",
			"no rights": "no"
		},
		"add an answer to a private campaign for your teams": {
			"administrator": "yes",
			"owner": "yes",
			"guest": "yes",
			"member": "yes",
			"leader": "yes",
			"no rights": "-"
		},
		"get other users campaign answers": {
			"administrator": "yes",
			"owner": "no",
			"guest": "no",
			"member": "no",
			"leader": "no",
			"no rights": "-"
		},
		"get own campaign answers": {
			"administrator": "yes",
			"owner": "yes",
			"guest": "yes",
			"member": "yes",
			"leader": "yes",
			"no rights": "-"
		},
		"restores answers": {
			"administrator": "yes",
			"owner": "yes",
			"guest": "no",
			"member": "yes",
			"leader": "yes",
			"no rights": "no"
		},
		"get by id when the team owns the campaign": {
			"administrator": "yes",
			"owner": "yes",
			"guest": "yes",
			"member": "yes",
			"leader": "yes",
			"no rights": "no"
		},
		"reject answers": {
			"administrator": "yes",
			"owner": "yes",
			"guest": "no",
			"member": "yes",
			"leader": "yes",
			"no rights": "no"
		},
		"manually trigger a mapSync when the user is the original author": {
			"administrator": "yes",
			"owner": "no",
			"guest": "no",
			"member": "no",
			"leader": "no",
			"no rights": "no"
		},
		"delete from other teams": {
			"administrator": "yes",
			"owner": "no",
			"guest": "no",
			"member": "no",
			"leader": "no",
			"no rights": "no"
		},
		"add an answer to a public campaign": {
			"administrator": "yes",
			"owner": "yes",
			"guest": "yes",
			"member": "yes",
			"leader": "yes",
			"no rights": "yes"
		},
		"update answers": {
			"administrator": "yes",
			"owner": "yes",
			"guest": "no",
			"member": "yes",
			"leader": "yes",
			"no rights": "no"
		},
		"get any by id": {
			"administrator": "yes",
			"owner": "no",
			"guest": "no",
			"member": "no",
			"leader": "no",
			"no rights": "no"
		},
		"patch campaign answers": {
			"administrator": "yes",
			"owner": "yes",
			"guest": "no",
			"member": "yes",
			"leader": "yes",
			"no rights": "no"
		},
		"delete from own team": {
			"administrator": "yes",
			"owner": "yes",
			"guest": "no",
			"member": "yes",
			"leader": "yes",
			"no rights": "no"
		},
		"get by id when the user is the original author": {
			"administrator": "yes",
			"owner": "yes",
			"guest": "yes",
			"member": "yes",
			"leader": "yes",
			"no rights": "no"
		},
		"get campaign answers": {
			"administrator": "no",
			"owner": "no",
			"guest": "no",
			"member": "no",
			"leader": "no",
			"no rights": "no"
		},
		"get own campaign answers grouped by campaign": {
			"administrator": "yes",
			"owner": "yes",
			"guest": "yes",
			"member": "yes",
			"leader": "yes",
			"no rights": "-"
		},
		"approve answers": {
			"administrator": "yes",
			"owner": "yes",
			"guest": "no",
			"member": "yes",
			"leader": "yes",
			"no rights": "no"
		}
	}
}