<?xml version="1.0" encoding="UTF-8" standalone="no"?>
<!-- Created with Inkscape (http://www.inkscape.org/) -->
<svg xmlns:dc="http://purl.org/dc/elements/1.1/"
  xmlns:cc="http://creativecommons.org/ns#"
  xmlns:rdf="http://www.w3.org/1999/02/22-rdf-syntax-ns#"
  xmlns:svg="http://www.w3.org/2000/svg"
  xmlns="http://www.w3.org/2000/svg"
  xmlns:sodipodi="http://sodipodi.sourceforge.net/DTD/sodipodi-0.dtd"
  xmlns:inkscape="http://www.inkscape.org/namespaces/inkscape" version="1.1" id="svg2" xml:space="preserve" width="300" height="300" viewBox="0 0 300 300" sodipodi:docname="GisCollective_logo.svg" inkscape:version="0.92.4 (unknown)" data-ember-extension="1">
  <metadata id="metadata8">
    <rdf:RDF>
      <cc:Work rdf:about="">
        <dc:format>image/svg+xml</dc:format>
        <dc:type rdf:resource="http://purl.org/dc/dcmitype/StillImage"/>
        <dc:title/>
      </cc:Work>
    </rdf:RDF>
  </metadata>
  <defs id="defs6">
    <linearGradient x1="0" y1="0" x2="1" y2="0" gradientUnits="userSpaceOnUse" gradientTransform="matrix(0,439.10406,439.10406,0,1190.9189,741.74579)" spreadMethod="pad" id="linearGradient32">
      <stop style="stop-opacity:1;stop-color:#40ffe8" offset="0" id="stop24"/>
      <stop style="stop-opacity:1;stop-color:#40ffe8" offset="0.285225" id="stop26"/>
      <stop style="stop-opacity:1;stop-color:#59dcff" offset="0.855044" id="stop28"/>
      <stop style="stop-opacity:1;stop-color:#59dcff" offset="1" id="stop30"/>
    </linearGradient>
    <linearGradient x1="0" y1="0" x2="1" y2="0" gradientUnits="userSpaceOnUse" gradientTransform="matrix(0,439.12186,439.12186,0,1149.8776,741.72797)" spreadMethod="pad" id="linearGradient56">
      <stop style="stop-opacity:1;stop-color:#40ddee" offset="0" id="stop48"/>
      <stop style="stop-opacity:1;stop-color:#40ddee" offset="0.352303" id="stop50"/>
      <stop style="stop-opacity:1;stop-color:#59dcff" offset="0.855044" id="stop52"/>
      <stop style="stop-opacity:1;stop-color:#59dcff" offset="1" id="stop54"/>
    </linearGradient>
    <linearGradient x1="0" y1="0" x2="1" y2="0" gradientUnits="userSpaceOnUse" gradientTransform="matrix(0,439.10406,439.10406,0,1108.8368,741.74579)" spreadMethod="pad" id="linearGradient80">
      <stop style="stop-opacity:1;stop-color:#3fbaf3" offset="0" id="stop72"/>
      <stop style="stop-opacity:1;stop-color:#3fbaf3" offset="0.285225" id="stop74"/>
      <stop style="stop-opacity:1;stop-color:#59dcff" offset="0.855044" id="stop76"/>
      <stop style="stop-opacity:1;stop-color:#59dcff" offset="1" id="stop78"/>
    </linearGradient>
    <linearGradient x1="0" y1="0" x2="1" y2="0" gradientUnits="userSpaceOnUse" gradientTransform="matrix(0,439.09399,439.09399,0,1067.7988,741.75586)" spreadMethod="pad" id="linearGradient104">
      <stop style="stop-opacity:1;stop-color:#3f98f9" offset="0" id="stop96"/>
      <stop style="stop-opacity:1;stop-color:#3f98f9" offset="0.320737" id="stop98"/>
      <stop style="stop-opacity:1;stop-color:#59dcff" offset="0.780332" id="stop100"/>
      <stop style="stop-opacity:1;stop-color:#59dcff" offset="1" id="stop102"/>
    </linearGradient>
    <linearGradient x1="0" y1="0" x2="1" y2="0" gradientUnits="userSpaceOnUse" gradientTransform="matrix(0,439.10406,439.10406,0,1026.7485,741.74579)" spreadMethod="pad" id="linearGradient128">
      <stop style="stop-opacity:1;stop-color:#3e75ff" offset="0" id="stop120"/>
      <stop style="stop-opacity:1;stop-color:#3f77ff" offset="0.289405" id="stop122"/>
      <stop style="stop-opacity:1;stop-color:#59dcff" offset="0.81187" id="stop124"/>
      <stop style="stop-opacity:1;stop-color:#59dcff" offset="1" id="stop126"/>
    </linearGradient>
  </defs>
  <sodipodi:namedview pagecolor="#ffffff" bordercolor="#666666" borderopacity="1" objecttolerance="10" gridtolerance="10" guidetolerance="10" inkscape:pageopacity="0" inkscape:pageshadow="2" inkscape:window-width="2048" inkscape:window-height="1088" id="namedview4" showgrid="false" inkscape:zoom="1.4582829" inkscape:cx="182.52923" inkscape:cy="218.75452" inkscape:window-x="0" inkscape:window-y="27" inkscape:window-maximized="1" inkscape:current-layer="g10"/>
  <g id="g10" inkscape:groupmode="layer" inkscape:label="GisCollective_2.2" transform="matrix(1.3333333,0,0,-1.3333333,0,300.00002)">
    <g id="g12" transform="matrix(0.5034062,0,0,0.5034062,-445.05326,-371.23085)">
      <g id="g14">
        <g id="g20">
          <g id="g22">
            <path d="m 1108.842,1180.849 c -11.785,0 -21.374,-9.591 -21.374,-21.38 v 0 c 0,-11.789 9.589,-21.381 21.374,-21.381 v 0 c 38.149,-0.03 74.003,-14.883 100.955,-41.823 v 0 c 26.945,-26.958 41.799,-62.805 41.823,-100.936 v 0 c 0,-6.749 -0.471,-13.516 -1.397,-20.116 v 0 c -4.375,-30.816 -18.349,-58.786 -40.413,-80.887 v 0 L 1093.726,778.243 c -4.043,-4.039 -6.27,-9.409 -6.27,-15.122 v 0 c 0,-5.711 2.227,-11.079 6.27,-15.117 v 0 c 4.024,-4.036 9.389,-6.258 15.105,-6.258 v 0 c 5.707,0 11.08,2.223 15.129,6.258 v 0 l 116.071,116.089 c 28.738,28.721 46.899,65.081 52.517,105.149 v 0 c 1.218,8.55 1.834,17.326 1.834,26.087 v 0 c 0.024,49.533 -19.27,96.117 -54.328,131.169 v 0 c -35.042,35.049 -81.607,54.351 -131.115,54.351 v 0 z" style="fill:url(#linearGradient32);stroke:none" id="path34" inkscape:connector-curvature="0"/>
          </g>
        </g>
      </g>
    </g>
    <g id="g36" transform="matrix(0.5034062,0,0,0.5034062,-445.05326,-371.23085)">
      <g id="g38">
        <g id="g44">
          <g id="g46">
            <path d="m 1108.842,1180.849 c -11.793,0 -21.386,-9.591 -21.386,-21.38 v 0 c 0,-11.789 9.593,-21.381 21.386,-21.381 v 0 c 5.757,-0.061 11.286,-2.36 17.405,-7.235 v 0 c 7.585,-6.116 15.223,-16.426 21.509,-29.036 v 0 c 13.926,-27.628 21.866,-66.463 21.782,-106.543 v 0 c 0,-7.105 -0.251,-14.351 -0.746,-21.536 v 0 c -2.237,-32.25 -9.713,-62.427 -21.049,-84.972 v 0 l -58.04,-116.076 c -5.26,-10.547 -0.969,-23.419 9.564,-28.692 v 0 c 5.103,-2.557 10.9,-2.969 16.328,-1.158 v 0 c 5.424,1.806 9.811,5.612 12.352,10.716 v 0 l 0.138,0.252 57.927,115.843 c 13.899,27.93 22.691,62.88 25.424,101.075 v 0 c 0.572,8.073 0.863,16.334 0.863,24.554 v 0 c -0.071,47.721 -9.165,91.178 -26.3,125.673 v 0 c -9.213,18.379 -20.252,32.88 -32.81,43.101 v 0 c -13.248,10.831 -28.941,16.795 -44.19,16.795 v 0 z" style="fill:url(#linearGradient56);stroke:none" id="path58" inkscape:connector-curvature="0"/>
          </g>
        </g>
      </g>
    </g>
    <g id="g60" transform="matrix(0.5034062,0,0,0.5034062,-445.05326,-371.23085)">
      <g id="g62">
        <g id="g68">
          <g id="g70">
            <path d="M 1087.456,1159.469 V 763.126 c 0,-11.789 9.588,-21.38 21.375,-21.38 v 0 c 11.793,0 21.387,9.591 21.387,21.38 v 0 396.343 c 0,11.789 -9.594,21.38 -21.387,21.38 v 0 c -11.787,0 -21.375,-9.591 -21.375,-21.38" style="fill:url(#linearGradient80);stroke:none" id="path82" inkscape:connector-curvature="0"/>
          </g>
        </g>
      </g>
    </g>
    <g id="g84" transform="matrix(0.5034062,0,0,0.5034062,-445.05326,-371.23085)">
      <g id="g86">
        <g id="g92">
          <g id="g94">
            <path d="m 1108.687,1180.849 c -15.266,0 -30.964,-5.962 -44.201,-16.788 v 0 c -12.741,-10.37 -23.478,-24.476 -32.825,-43.122 v 0 c -17.125,-34.479 -26.215,-77.921 -26.287,-125.629 v 0 c 0,-8.226 0.29,-16.495 0.864,-24.579 v 0 c 2.721,-38.197 11.517,-73.154 25.436,-101.093 v 0 l 58.029,-116.075 c 5.28,-10.528 18.153,-14.817 28.693,-9.565 v 0 c 5.109,2.557 8.915,6.947 10.714,12.364 v 0 c 1.812,5.414 1.402,11.208 -1.151,16.316 v 0 l -0.048,0.109 -57.994,115.986 c -11.325,22.524 -18.796,52.7 -21.036,84.97 v 0 c -0.503,7.072 -0.758,14.328 -0.758,21.567 v 0 c -0.072,40.068 7.872,78.892 21.795,106.515 v 0 c 6.28,12.621 13.919,22.93 21.506,29.027 v 0 c 6.121,4.876 11.647,7.175 17.389,7.236 v 0 c 11.799,0 21.393,9.592 21.393,21.381 v 0 c 0,11.789 -9.59,21.38 -21.375,21.38 v 0 z" style="fill:url(#linearGradient104);stroke:none" id="path106" inkscape:connector-curvature="0"/>
          </g>
        </g>
      </g>
    </g>
    <g id="g108" transform="matrix(0.5034062,0,0,0.5034062,-445.05326,-371.23085)">
      <g id="g110">
        <g id="g116">
          <g id="g118">
            <path d="m 1108.734,1180.849 c -49.516,0 -96.076,-19.3 -131.103,-54.345 v 0 c -35.074,-35.05 -54.376,-81.645 -54.352,-131.206 v 0 c -0.024,-49.556 19.275,-96.151 54.34,-131.205 v 0 l 116.107,-116.09 c 4.024,-4.035 9.389,-6.257 15.105,-6.257 v 0 c 5.707,0 11.08,2.223 15.129,6.258 v 0 c 4.034,4.041 6.258,9.411 6.258,15.117 v 0 c 0,5.713 -2.227,11.084 -6.272,15.122 v 0 l -116.082,116.083 c -26.946,26.976 -41.799,62.836 -41.823,100.972 v 0 c 0.024,38.14 14.877,73.996 41.823,100.967 v 0 c 26.952,26.94 62.809,41.793 100.967,41.823 v 0 c 11.785,0 21.375,9.592 21.375,21.381 v 0 c 0,11.789 -9.59,21.38 -21.375,21.38 v 0 z" style="fill:url(#linearGradient128);stroke:none" id="path130" inkscape:connector-curvature="0"/>
          </g>
        </g>
      </g>
    </g>
  </g>
</svg>