{
  "name": "Privacy Policy",
  "slug": "help--privacy",
  "layout": "Plain article",
  "containers": [],
  "cols": [
    {
      "container": 0,
      "row": 0,
      "col": 0,
      "type": "article",
      "data": {
        "id": "help--privacy",
        "model": "article"
      }
    }
  ]
}