{
  "title": "New contribution to {{campaignName}}",
  "slug": "notification-add-answer-team",
  "content": "Hello {{receiverName}},\n\nSomeone just submitted a new answer to {{campaignName}}. You can review it now from your survey dashboard on {{serviceName}}.\n\n"
}