{
  "type": "MultiPolygon",
  "coordinates": [
    [
      [
        [-87.9166436319497, 43.35861511032297],
        [-87.90947507598142, 43.3587392065647],
        [-87.90542367404949, 43.36373550230542],
        [-87.89675493155653, 43.36415347440932],
        [-87.89678188101504, 43.36291261131018],
        [-87.89926123119956, 43.36284730202294],
        [-87.89923428174104, 43.36070511842952],
        [-87.90349229618836, 43.36067246260652],
        [-87.90348331303551, 43.35753742176187],
        [-87.89102368004305, 43.36261218800677],
        [-87.88390003983899, 43.36269055944674],
        [-87.886864480277, 43.35548649490087],
        [-87.88213035872903, 43.36686369239088],
        [-87.88293884248485, 43.36855506827114],
        [-87.88299274140189, 43.37609711631886],
        [-87.86111876423054, 43.40919267368223],
        [-87.88098051516519, 43.40290133989822],
        [-87.88094458255382, 43.39942255222267],
        [-87.88092661624813, 43.39453363684783],
        [-87.88272324681662, 43.39078019652494],
        [-87.88395393875604, 43.39052560693693],
        [-87.88976603864511, 43.37771641211147],
        [-87.9016597330085, 43.36543349606336],
        [-87.91547582208018, 43.36481961149775],
        [-87.91682329500655, 43.36289954945835],
        [-87.9166436319497, 43.35861511032297]
      ],
      [
        [-87.88596616499274, 43.37874803768664],
        [-87.88128594236184, 43.37959683037784],
        [-87.88291189302632, 43.37755970795691],
        [-87.88637040687065, 43.37605793927199],
        [-87.8871609243208, 43.37713529883798],
        [-87.88596616499274, 43.37874803768664]
      ],
      [
        [-87.88637939002349, 43.39690308034091],
        [-87.88590328292285, 43.39690960760549],
        [-87.88589429977002, 43.39668115292695],
        [-87.88643328894055, 43.39668115292695],
        [-87.88637939002349, 43.39690308034091]
      ],
      [
        [-87.87927371612513, 43.37977311660043],
        [-87.87486298807949, 43.37959683037784],
        [-87.87680334909345, 43.37831057835192],
        [-87.88121407713909, 43.37951848078106],
        [-87.87927371612513, 43.37977311660043]
      ]
    ],
    [
      [
        [-87.88153747064142, 43.4098974712044],
        [-87.88074695319129, 43.40955812527303],
        [-87.8807289868856, 43.41096117786097],
        [-87.88163628532268, 43.41093507485373],
        [-87.88153747064142, 43.4098974712044]
      ]
    ],
    [
      [
        [-87.87418026846346, 43.42038362837729],
        [-87.87105413127428, 43.42033143047421],
        [-87.87098226605156, 43.42538136915533],
        [-87.87303042489962, 43.42533569976287],
        [-87.87523129734602, 43.42191039713362],
        [-87.87418026846346, 43.42038362837729]
      ]
    ],
    [
      [
        [-87.86575407109724, 43.41935923630498],
        [-87.86552949227618, 43.423378407706],
        [-87.86106486531348, 43.42438968317036],
        [-87.86716442609351, 43.42377639554983],
        [-87.8677752804868, 43.41933966176541],
        [-87.86575407109724, 43.41935923630498]
      ]
    ]
  ]
}
