{
	"reporters": [
		"spec",
		"result"
	],
	"executor": "default",
	"plugins": [],
	"artifactsLocation": ".trial",
	"warningTestDuration": 20,
	"maxThreads": 0,
	"dangerTestDuration": 100,
	"testDiscovery": [
		"trial.discovery.unit.UnitTestDiscovery", "trial.discovery.spec.SpecTestDiscovery"
	]
}