{
  "type": "mongo",
  "url": "$mongoUrl",
  "configuration": {
    "username": "",
    "digest": "",
    "maxConnections": 100,
    "hosts": [
      {
        "name": "$mongoHost",
        "port": 27017
      }
    ],
    "database": "$mongoDBName",
    "defQueryFlags": 0,
    "authMechanism": 0,
    "replicaSet": "",
    "safe": true,
    "w": 0,
    "wTimeoutMS": 0,
    "fsync": false,
    "journal": false,
    "connectTimeoutMS": 1000,
    "socketTimeoutMS": 0,
    "ssl": false,
    "sslverifycertificate": false,
    "sslCAFile": "",
    "sslPEMKeyFile": ""
  }
}
