{
  "general": {
    "serviceName": "$serviceName",
    "serviceUrl": "$serviceUrl",
    "apiUrl": "$apiUrl",

    "db": "/home/node/app/packages/clean-features/config/db",
    "pidFolder": "./",
    "logLevel": "#logLevel",

    "stats": {
      "interval": 15,
      "pushGatewayUrl": "$pushGatewayUrl",
      "namespace": "$namespace"
    }
  },

  "http": {
    "hostName": "$HOSTNAME",
    "port": 4000,
    "keepAliveTimeout": 0,
    "maxRequestHeaderSize": 819,
    "maxRequestSize": 4000,
    "serverString": "clean-features",
    "webSocketPingInterval": 0
  },

  "httpMq": {
    "url": "$httpMqUrl"
  }
}
