{
	"fileVersion": 1,
	"versions": {
		"botan": "1.12.10",
		"botan-math": "1.0.3",
		"crate": {
			"path": "../../submodules/crate"
		},
		"d2sqlite3": "0.18.2",
		"ddmp": "0.0.1-0.dev.3",
		"diet-ng": "1.5.0",
		"dub": "1.12.1",
		"eventcore": "0.8.43",
		"fluent-asserts": "1.0.0",
		"geo": {
			"path": "../../submodules/geo-d"
		},
		"hmq": {
			"path": "../../"
		},
		"libasync": "0.8.4",
		"libdparse": "0.8.8",
		"libevent": "2.0.2+2.0.16",
		"memutils": "0.4.13",
		"mir-linux-kernel": "1.0.1",
		"ogm-models": {
			"path": "../../submodules/ogm-models"
		},
		"open-api": "0.3.1-beta.4",
		"openssl": "1.1.6+1.0.1g",
		"stdx-allocator": "3.0.2",
		"taggedalgebraic": "0.11.4",
		"trial": "0.7.2",
		"vibe-auth": "0.6.0",
		"vibe-core": "1.6.2",
		"vibe-d": "0.8.5"
	}
}