1 0.38571428571428573 0.43506493506493504 0.08571428571428572 0.5324675324675324
9 0.4828571428571429 0.5 0.10857142857142857 0.5324675324675324
2 0.5971428571428572 0.512987012987013 0.10857142857142857 0.5324675324675324
