2 0.3695652173913043 0.46296296296296297 0.15942028985507245 0.8518518518518519
6 0.5434782608695652 0.5 0.21739130434782608 0.8518518518518519
8 0.6884057971014492 0.5 0.15942028985507245 0.8518518518518519
