1 0.5838323353293413 0.5700934579439252 0.041916167664670656 0.3364485981308411
2 0.6227544910179641 0.5233644859813084 0.059880239520958084 0.3364485981308411
8 0.6661676646706587 0.5327102803738317 0.05688622754491018 0.3364485981308411
2 0.7170658682634731 0.5046728971962616 0.06287425149700598 0.3364485981308411
