2 0.3579136690647482 0.4369369369369369 0.17625899280575538 0.6216216216216216
4 0.512589928057554 0.4369369369369369 0.12589928057553956 0.6216216216216216
7 0.6564748201438849 0.45495495495495497 0.15467625899280577 0.6216216216216216
