1 0.3283582089552239 0.4935897435897436 0.09950248756218906 0.5769230769230769
2 0.4129353233830846 0.5448717948717948 0.09950248756218906 0.5769230769230769
4 0.5398009950248757 0.5064102564102564 0.1044776119402985 0.5769230769230769
2 0.6567164179104478 0.5833333333333334 0.12935323383084577 0.5769230769230769
