1 0.35964912280701755 0.47619047619047616 0.12280701754385964 0.8571428571428571
4 0.49122807017543857 0.47619047619047616 0.14035087719298245 0.8571428571428571
8 0.6403508771929824 0.47619047619047616 0.15789473684210525 0.8571428571428571
