1 0.34444444444444444 0.5 0.1111111111111111 0.6666666666666666
6 0.45555555555555555 0.4444444444444444 0.1111111111111111 0.6666666666666666
3 0.6333333333333333 0.4444444444444444 0.15555555555555556 0.6666666666666666
