1 0.4540540540540541 0.5833333333333334 0.08648648648648649 0.44871794871794873
4 0.527027027027027 0.5192307692307693 0.08108108108108109 0.44871794871794873
4 0.6216216216216216 0.3269230769230769 0.0972972972972973 0.44871794871794873
