5 0.3914027149321267 0.5238095238095238 0.10407239819004525 0.5238095238095238
2 0.49547511312217196 0.4880952380952381 0.10407239819004525 0.5238095238095238
9 0.6199095022624435 0.4880952380952381 0.09049773755656108 0.5238095238095238
