1 0.358695652173913 0.45588235294117646 0.06521739130434782 0.5588235294117647
0 0.42934782608695654 0.39705882352941174 0.09782608695652174 0.5588235294117647
3 0.5706521739130435 0.39705882352941174 0.11956521739130435 0.5588235294117647
