5 0.3448275862068966 0.5161290322580645 0.20689655172413793 0.7741935483870968
1 0.5172413793103449 0.5161290322580645 0.11494252873563218 0.7741935483870968
0 0.6666666666666666 0.5161290322580645 0.1839080459770115 0.7741935483870968
