2 0.35570469798657717 0.46774193548387094 0.1342281879194631 0.4838709677419355
5 0.48322147651006714 0.4838709677419355 0.10738255033557047 0.4838709677419355
6 0.6174496644295302 0.5 0.08053691275167785 0.4838709677419355
