5 0.3684210526315789 0.48484848484848486 0.18421052631578946 0.7878787878787878
6 0.506578947368421 0.45454545454545453 0.14473684210526316 0.7878787878787878
1 0.6447368421052632 0.48484848484848486 0.10526315789473684 0.7878787878787878
