1 0.3333333333333333 0.532258064516129 0.09876543209876543 0.7419354838709677
9 0.4691358024691358 0.5 0.14814814814814814 0.7419354838709677
6 0.6296296296296297 0.5 0.14814814814814814 0.7419354838709677
