1 0.48660714285714285 0.20967741935483872 0.1875 0.22580645161290322
2 0.48214285714285715 0.5483870967741935 0.17857142857142858 0.22580645161290322
8 0.48660714285714285 0.8387096774193549 0.16964285714285715 0.22580645161290322
