2 0.34408602150537637 0.45588235294117646 0.12903225806451613 0.8529411764705882
6 0.5053763440860215 0.5147058823529411 0.15053763440860216 0.8529411764705882
5 0.6720430107526881 0.5441176470588235 0.1827956989247312 0.8529411764705882
