2 0.5763052208835341 0.421875 0.06827309236947791 0.28125
3 0.6164658634538153 0.4010416666666667 0.05220883534136546 0.28125
7 0.6566265060240963 0.4010416666666667 0.05220883534136546 0.28125
1 0.6847389558232931 0.4427083333333333 0.060240963855421686 0.28125
