8 0.10891089108910891 0.47058823529411764 0.1188118811881188 0.5588235294117647
3 0.23267326732673269 0.5 0.12871287128712872 0.5588235294117647
7 0.3465346534653465 0.5294117647058824 0.13861386138613863 0.5588235294117647
