1 0.25 0.5238095238095238 0.12857142857142856 0.9523809523809523
2 0.42142857142857143 0.5238095238095238 0.12857142857142856 0.9523809523809523
7 0.5571428571428572 0.5238095238095238 0.11428571428571428 0.9523809523809523
8 0.7071428571428572 0.5238095238095238 0.12857142857142856 0.9523809523809523
