1 0.35148514851485146 0.6413043478260869 0.0891089108910891 0.45652173913043476
5 0.4405940594059406 0.5760869565217391 0.06930693069306931 0.45652173913043476
7 0.5247524752475248 0.5108695652173914 0.09900990099009901 0.45652173913043476
9 0.6138613861386139 0.40217391304347827 0.07920792079207921 0.45652173913043476
