2 0.27884615384615385 0.53125 0.1346153846153846 0.6875
9 0.4326923076923077 0.53125 0.1346153846153846 0.6875
0 0.5576923076923077 0.46875 0.11538461538461539 0.6875
0 0.7019230769230769 0.46875 0.1346153846153846 0.6875
