2 0.3611111111111111 0.39285714285714285 0.1111111111111111 0.7142857142857143
0 0.4861111111111111 0.4642857142857143 0.1388888888888889 0.7142857142857143
9 0.625 0.4642857142857143 0.1111111111111111 0.7142857142857143
