1 0.4330708661417323 0.49056603773584906 0.06299212598425197 0.5283018867924528
0 0.5196850393700787 0.41509433962264153 0.09448818897637795 0.5283018867924528
7 0.6062992125984252 0.4528301886792453 0.09448818897637795 0.5283018867924528
