8 0.44761904761904764 0.5102040816326531 0.09523809523809523 0.5714285714285714
4 0.5190476190476191 0.5102040816326531 0.08571428571428572 0.5714285714285714
3 0.5904761904761905 0.4897959183673469 0.09523809523809523 0.5714285714285714
