1 0.4276729559748428 0.4857142857142857 0.06289308176100629 0.42857142857142855
3 0.4811320754716981 0.5142857142857142 0.06918238993710692 0.42857142857142855
5 0.550314465408805 0.5428571428571428 0.05660377358490566 0.42857142857142855
