2 0.38235294117647056 0.6529411764705882 0.13725490196078433 0.4588235294117647
8 0.5196078431372549 0.5117647058823529 0.13725490196078433 0.4588235294117647
1 0.6446078431372549 0.3941176470588235 0.11274509803921569 0.4588235294117647
