3 0.4206896551724138 0.46296296296296297 0.09655172413793103 0.4444444444444444
4 0.506896551724138 0.48148148148148145 0.07586206896551724 0.4444444444444444
7 0.6 0.4444444444444444 0.1103448275862069 0.4444444444444444
