1 0.33433734939759036 0.45652173913043476 0.13855421686746988 0.6811594202898551
3 0.48493975903614456 0.4420289855072464 0.18674698795180722 0.6811594202898551
3 0.6385542168674698 0.4855072463768116 0.1566265060240964 0.6811594202898551
