4 0.4441489361702128 0.4936708860759494 0.09042553191489362 0.45569620253164556
1 0.4973404255319149 0.5316455696202531 0.05851063829787234 0.45569620253164556
7 0.5611702127659575 0.5822784810126582 0.11170212765957446 0.45569620253164556
