2 0.3132530120481928 0.46296296296296297 0.12048192771084337 0.6296296296296297
0 0.4397590361445783 0.5 0.1566265060240964 0.6296296296296297
7 0.5602409638554217 0.5 0.13253012048192772 0.6296296296296297
8 0.6867469879518072 0.42592592592592593 0.12048192771084337 0.6296296296296297
