2 0.29591836734693877 0.4642857142857143 0.1836734693877551 0.8571428571428571
2 0.4387755102040816 0.5 0.16326530612244897 0.8571428571428571
3 0.5867346938775511 0.5 0.15306122448979592 0.8571428571428571
5 0.7295918367346939 0.4642857142857143 0.17346938775510204 0.8571428571428571
