1 0.46551724137931033 0.5060240963855421 0.12643678160919541 0.5542168674698795
4 0.5488505747126436 0.4819277108433735 0.13218390804597702 0.5542168674698795
8 0.6781609195402298 0.5542168674698795 0.14942528735632185 0.5542168674698795
