3 0.39893617021276595 0.45588235294117646 0.11702127659574468 0.6764705882352942
1 0.5212765957446809 0.45588235294117646 0.06382978723404255 0.6764705882352942
5 0.6276595744680851 0.4264705882352941 0.1276595744680851 0.6764705882352942
