2 0.39903846153846156 0.6145833333333334 0.10576923076923077 0.6041666666666666
5 0.4807692307692308 0.53125 0.09615384615384616 0.6041666666666666
6 0.5817307692307693 0.5520833333333334 0.125 0.6041666666666666
