1 0.41899441340782123 0.35714285714285715 0.0335195530726257 0.30952380952380953
0 0.48044692737430167 0.4523809523809524 0.055865921787709494 0.30952380952380953
0 0.5363128491620112 0.5714285714285714 0.0446927374301676 0.30952380952380953
1 0.6033519553072626 0.6547619047619048 0.055865921787709494 0.30952380952380953
