5 0.42213114754098363 0.5 0.09016393442622951 0.4166666666666667
4 0.5081967213114754 0.5208333333333334 0.08196721311475409 0.4166666666666667
7 0.5860655737704918 0.5208333333333334 0.07377049180327869 0.4166666666666667
