1 0.3712121212121212 0.5185185185185185 0.10606060606060606 0.7407407407407407
9 0.48484848484848486 0.48148148148148145 0.18181818181818182 0.7407407407407407
5 0.5984848484848485 0.48148148148148145 0.16666666666666666 0.7407407407407407
