1 0.33910891089108913 0.5073529411764706 0.11386138613861387 0.5735294117647058
2 0.4900990099009901 0.5220588235294118 0.12871287128712872 0.5735294117647058
8 0.6460396039603961 0.5073529411764706 0.12376237623762376 0.5735294117647058
