2 0.4279661016949153 0.46808510638297873 0.09322033898305085 0.46808510638297873
1 0.5127118644067796 0.5319148936170213 0.07627118644067797 0.46808510638297873
2 0.597457627118644 0.5531914893617021 0.1271186440677966 0.46808510638297873
