1 0.37832699619771865 0.5833333333333334 0.11026615969581749 0.5526315789473685
6 0.4828897338403042 0.6359649122807017 0.13688212927756654 0.5526315789473685
5 0.6102661596958175 0.618421052631579 0.17110266159695817 0.5526315789473685
