2 0.3795180722891566 0.48484848484848486 0.13253012048192772 0.5454545454545454
2 0.4879518072289157 0.45454545454545453 0.13253012048192772 0.5454545454545454
9 0.608433734939759 0.48484848484848486 0.13253012048192772 0.5454545454545454
