1 0.3508771929824561 0.45555555555555555 0.12280701754385964 0.8666666666666667
9 0.4956140350877193 0.5222222222222223 0.13157894736842105 0.8666666666666667
2 0.6491228070175439 0.5222222222222223 0.14035087719298245 0.8666666666666667
