2 0.42272727272727273 0.3080357142857143 0.05454545454545454 0.22321428571428573
7 0.4681818181818182 0.35267857142857145 0.06363636363636363 0.22321428571428573
0 0.5159090909090909 0.36160714285714285 0.07727272727272727 0.22321428571428573
