1 0.2608695652173913 0.5 0.13043478260869565 0.8461538461538461
4 0.43478260869565216 0.5769230769230769 0.17391304347826086 0.8461538461538461
6 0.5760869565217391 0.6538461538461539 0.15217391304347827 0.8461538461538461
7 0.7391304347826086 0.5 0.13043478260869565 0.8461538461538461
