1 0.4212121212121212 0.5454545454545454 0.05454545454545454 0.38961038961038963
2 0.48484848484848486 0.5064935064935064 0.08484848484848485 0.38961038961038963
0 0.5666666666666667 0.5454545454545454 0.09090909090909091 0.38961038961038963
