1 0.2348993288590604 0.44871794871794873 0.10738255033557047 0.7435897435897436
4 0.37583892617449666 0.3974358974358974 0.1476510067114094 0.7435897435897436
5 0.5604026845637584 0.44871794871794873 0.14093959731543623 0.7435897435897436
0 0.7449664429530202 0.47435897435897434 0.1476510067114094 0.7435897435897436
