1 0.30851063829787234 0.45555555555555555 0.06382978723404255 0.37777777777777777
1 0.40425531914893614 0.5 0.07092198581560284 0.37777777777777777
3 0.5035460992907801 0.5 0.0851063829787234 0.37777777777777777
2 0.599290780141844 0.5 0.09219858156028368 0.37777777777777777
5 0.6914893617021277 0.5 0.09219858156028368 0.37777777777777777
