1 0.47002398081534774 0.24013157894736842 0.03836930455635491 0.24342105263157895
7 0.5059952038369304 0.24013157894736842 0.04316546762589928 0.24342105263157895
8 0.5335731414868106 0.3190789473684211 0.05515587529976019 0.24342105263157895
