7 0.5833333333333334 0.5367647058823529 0.07264957264957266 0.45588235294117646
5 0.6495726495726496 0.5220588235294118 0.07692307692307693 0.45588235294117646
2 0.7158119658119658 0.4485294117647059 0.0641025641025641 0.45588235294117646
