1 0.32857142857142857 0.47619047619047616 0.08571428571428572 0.8095238095238095
0 0.4666666666666667 0.5 0.1523809523809524 0.8095238095238095
2 0.6428571428571429 0.5238095238095238 0.14285714285714285 0.8095238095238095
