2 0.31679389312977096 0.5 0.1297709923664122 0.9024390243902439
2 0.46564885496183206 0.5 0.13740458015267176 0.9024390243902439
3 0.5916030534351145 0.47560975609756095 0.1297709923664122 0.9024390243902439
4 0.7137404580152672 0.5 0.1450381679389313 0.9024390243902439
