3 0.30303030303030304 0.4358108108108108 0.10774410774410774 0.5472972972972973
3 0.3939393939393939 0.46959459459459457 0.10774410774410774 0.5472972972972973
3 0.4797979797979798 0.42905405405405406 0.0707070707070707 0.5472972972972973
2 0.5757575757575758 0.44932432432432434 0.12794612794612795 0.5472972972972973
