2 0.4121212121212121 0.5317460317460317 0.13333333333333333 0.5873015873015873
6 0.5454545454545454 0.5158730158730159 0.12121212121212122 0.5873015873015873
6 0.6696969696969697 0.5317460317460317 0.11515151515151516 0.5873015873015873
