1 0.38953488372093026 0.5 0.08139534883720931 0.5882352941176471
2 0.46511627906976744 0.4411764705882353 0.06976744186046512 0.5882352941176471
1 0.5581395348837209 0.47058823529411764 0.06976744186046512 0.5882352941176471
