1 0.3971774193548387 0.6194690265486725 0.09274193548387097 0.4247787610619469
0 0.47580645161290325 0.504424778761062 0.11290322580645161 0.4247787610619469
3 0.5846774193548387 0.415929203539823 0.11290322580645161 0.4247787610619469
