2 0.37606837606837606 0.3979591836734694 0.13675213675213677 0.5918367346938775
3 0.48717948717948717 0.45918367346938777 0.10256410256410256 0.5918367346938775
3 0.6196581196581197 0.5408163265306123 0.1282051282051282 0.5918367346938775
