1 0.42035398230088494 0.5370370370370371 0.07964601769911504 0.4444444444444444
0 0.48672566371681414 0.5 0.10619469026548672 0.4444444444444444
5 0.5663716814159292 0.48148148148148145 0.08849557522123894 0.4444444444444444
