2 0.33620689655172414 0.5294117647058824 0.1206896551724138 0.8235294117647058
2 0.45689655172413796 0.5294117647058824 0.1206896551724138 0.8235294117647058
1 0.5862068965517241 0.47058823529411764 0.10344827586206896 0.8235294117647058
8 0.7068965517241379 0.47058823529411764 0.13793103448275862 0.8235294117647058
