1 0.3980891719745223 0.5073529411764706 0.08280254777070063 0.6323529411764706
1 0.48089171974522293 0.47794117647058826 0.044585987261146494 0.6323529411764706
6 0.5923566878980892 0.49264705882352944 0.12738853503184713 0.6323529411764706
