1 0.39473684210526316 0.5185185185185185 0.11278195488721804 0.4444444444444444
7 0.4924812030075188 0.5 0.08270676691729323 0.4444444444444444
9 0.5714285714285714 0.48148148148148145 0.09022556390977443 0.4444444444444444
