2 0.44805194805194803 0.62 0.1038961038961039 0.38666666666666666
1 0.5162337662337663 0.62 0.08441558441558442 0.38666666666666666
2 0.5811688311688312 0.6333333333333333 0.08441558441558442 0.38666666666666666
