2 0.42857142857142855 0.5967741935483871 0.06349206349206349 0.2903225806451613
3 0.49206349206349204 0.6129032258064516 0.06349206349206349 0.2903225806451613
0 0.5515873015873016 0.6612903225806451 0.07142857142857142 0.2903225806451613
