[
  {
    "_id": "b8e435e5-3a6c-4eeb-aa6b-d6e4b127171a",
    "colId": "history",
    "containerId": "",
    "name": "localhost:8000",
    "url": "localhost:8000",
    "method": "GET",
    "sortNum": 0,
    "created": "2023-02-01T13:48:53.374Z",
    "modified": "2023-02-01T13:48:53.374Z",
    "headers": [],
    "params": [],
    "tests": []
  }
]