[
    {
        "_id": "783efd8c-464a-4a50-86b3-1337412fccdc",
        "colId": "history",
        "containerId": "",
        "name": "http://localhost:8000/api/login",
        "url": "http://localhost:8000/api/reservation",
        "method": "POST",
        "sortNum": 0,
        "created": "2023-08-07T08:40:44.998Z",
        "modified": "2023-08-12T13:42:40.265Z",
        "headers": [],
        "params": [],
        "body": {
            "type": "json",
            "raw": "{\n  \"date\": \"1992/12/02\",\n  \"animal\": 2,\n  \"circuit\": 2,\n  \"user\": 1\n}",
            "form": []
        },
        "tests": []
    },
    {
        "_id": "052265eb-365d-4d5f-87b4-3e9e8cc3c992",
        "colId": "history",
        "containerId": "",
        "name": "https://localhost:8000/api/animal",
        "url": "http://localhost:8000/api/animal/1",
        "method": "PUT",
        "sortNum": 0,
        "created": "2023-08-07T09:04:58.761Z",
        "modified": "2023-08-07T13:03:20.288Z",
        "headers": [],
        "params": [],
        "body": {
            "type": "json",
            "raw": "{\n  \"id\": 1,\n  \"name\": \"Alpaga\",\n  \"img\": \"https://www.pexels.com/fr-fr/photo/lama-brun-3396661/\",\n  \"description\": \"L'alpaga est un herbivore de la famille des chameaux (camélidés) originaire d'Amérique du Sud. Il serait une version domestiquée de la vigogne, qui vit sur les hauts plateaux des Andes. Sa laine fournie et dexcellente qualité a fait sa renommée dans lindustrie textile\"\n}",
            "form": []
        },
        "tests": []
    },
    {
        "_id": "50c0e54c-b4f8-4b36-969d-25188e586e79",
        "colId": "history",
        "containerId": "",
        "name": "http://localhost:8000/api/circuit",
        "url": "http://localhost:8000/api/user",
        "method": "GET",
        "sortNum": 0,
        "created": "2023-08-07T11:26:03.631Z",
        "modified": "2023-08-14T14:46:22.623Z",
        "headers": [],
        "params": [],
        "auth": {
            "type": "bearer",
            "bearer": "MIIBIjANBgkqhkiG9w0BAQEFAAOCAQ8AMIIBCgKCAQEAscwWdeJzo31ZKzE6ekIR MgcTOYPUe9Z02T7WlTlVldmymIS/pVJsOSf9yGid/w/lwnykiofbq9lwyHwet7ml R6MnAGQeqpVcb0G395hIsMY0sl/uSRdOs1KKztpvmmO5IyeaZ2JqoVkmHpQtnoPZ JxWDTRGlW/+6DcIzuWD6OjfpCApYqts53z7tJaGcEbuA4373YwRpH7Ee/mDoCFrP JPltBj8zncdHB92C7f6Mfp00ltEfcnnEbW4N4xdD98vsIz2R3W3MpgTWsbtUlFBJ LVu9DBSNEDWJwV7BW33POUp2xahHd5kLssFTXoX3NbXOop6lasXgUgZchJL+5sPq EwIDAQAB"
        },
        "tests": []
    },
    {
        "_id": "92027141-3e17-4af6-8d3a-0fbf1be135f8",
        "colId": "history",
        "containerId": "",
        "name": "http://localhost:8000/api/circuit/1",
        "url": "http://localhost:8000/api/user/1",
        "method": "GET",
        "sortNum": 0,
        "created": "2023-08-07T11:26:09.195Z",
        "modified": "2023-08-14T13:33:30.667Z",
        "headers": [],
        "params": [],
        "tests": []
    },
    {
        "_id": "9feafed4-5faa-4860-9c17-876025ee80cf",
        "colId": "history",
        "containerId": "",
        "name": "http://localhost:8000/api/circuit/1",
        "url": "http://localhost:8000/api/circuit/1",
        "method": "DELETE",
        "sortNum": 0,
        "created": "2023-08-07T11:26:13.527Z",
        "modified": "2023-08-07T11:26:13.527Z",
        "headers": [],
        "params": [],
        "tests": []
    },
    {
        "_id": "e7a4950f-4988-4953-ad10-649d873bd170",
        "colId": "history",
        "containerId": "",
        "name": "https://localhost:8000/api/reservation/1",
        "url": "https://localhost:8000/api/reservation/1",
        "method": "GET",
        "sortNum": 0,
        "created": "2023-08-07T12:05:11.103Z",
        "modified": "2023-08-07T12:05:11.103Z",
        "headers": [],
        "params": [],
        "tests": []
    },
    {
        "_id": "7cb74aec-fb7c-4c7b-8a78-3718237f09ad",
        "colId": "history",
        "containerId": "",
        "name": "http://localhost:8000/api/reservation",
        "url": "http://localhost:8000/api/user",
        "method": "GET",
        "sortNum": 0,
        "created": "2023-08-07T12:05:51.610Z",
        "modified": "2023-08-14T14:20:06.627Z",
        "headers": [],
        "params": [],
        "tests": []
    },
    {
        "_id": "b3fde5ea-662d-4c53-bb39-91dcdfdbea6f",
        "colId": "history",
        "containerId": "",
        "name": "http://localhost:8000/api/user",
        "url": "http://localhost:8000/api/user",
        "method": "GET",
        "sortNum": 0,
        "created": "2023-08-07T13:14:51.104Z",
        "modified": "2023-08-14T13:34:13.657Z",
        "headers": [],
        "params": [],
        "tests": []
    },
    {
        "_id": "30d9715f-034d-42cb-9f8f-4bf5bfecf4b1",
        "colId": "history",
        "containerId": "",
        "name": "http://localhost:8000/api/user/2",
        "url": "http://localhost:8000/api/user",
        "method": "GET",
        "sortNum": 0,
        "created": "2023-08-07T13:14:57.110Z",
        "modified": "2023-08-14T14:40:58.206Z",
        "headers": [],
        "params": [],
        "tests": []
    },
    {
        "_id": "a140e85b-9403-4990-b0e5-37fa9f55b9b3",
        "colId": "history",
        "containerId": "",
        "name": "http://localhost:8000/api/user/2",
        "url": "http://localhost:8000/api/user",
        "method": "GET",
        "sortNum": 0,
        "created": "2023-08-07T13:15:18.793Z",
        "modified": "2023-08-14T13:58:21.210Z",
        "headers": [],
        "params": [],
        "body": {
            "type": "json",
            "raw": "{\n  \"id\": 2,\n  \"name\": \"Alpadou\",\n  \"lastname\": \"Dou\",\n  \"phone\": \"0633464450\",\n  \"mail\": \"alpadou@mail.com\",\n  \"password\": \"$2y$13$n7zHwhN7VQboYBOgAUukNuH4Myu1kgxHDq0Pq2JRQADnVUSn43W4O\",\n  \"role\": \"ROLE_ADMIN\",\n  \"userIdentifier\": \"alpadou@mail.com\",\n  \"roles\": [\n    \"ROLE_ADMIN\"\n  ]\n}",
            "form": []
        },
        "tests": []
    },
    {
        "_id": "22f20bc7-f4be-48ce-ab2f-e34cc6ffe44c",
        "colId": "history",
        "containerId": "",
        "name": "http://localhost:8000/api/user",
        "url": "http://localhost:8000/api/user",
        "method": "GET",
        "sortNum": 0,
        "created": "2023-08-07T13:18:43.821Z",
        "modified": "2023-08-14T15:09:41.636Z",
        "headers": [],
        "params": [],
        "body": {
            "type": "json",
            "raw": "{\n  \"name\": \"test\",\n  \"email\": \"test@test.com\",\n  \"password\": \"12345\"\n}",
            "form": []
        },
        "tests": []
    },
    {
        "_id": "0b87139c-942b-48ac-8807-3a612fe41d49",
        "colId": "history",
        "containerId": "",
        "name": "http://localhost:8000/api/user/3",
        "url": "http://localhost:8000/api/user/3",
        "method": "PUT",
        "sortNum": 0,
        "created": "2023-08-07T14:02:06.430Z",
        "modified": "2023-08-07T14:02:48.994Z",
        "headers": [],
        "params": [],
        "body": {
            "type": "json",
            "raw": "{\n  \"id\": 3,\n  \"name\": \"test\",\n  \"lastname\": \"deux\",\n  \"phone\": null,\n  \"email\": \"test@test.com\",\n  \"password\": \"$2y$13$T/eQCVvKuBhYlW0HX93NJudLXbpCs3zRa78Ir6S0YyKMJFsx8V.XK\",\n  \"role\": \"ROLE_USER\",\n  \"userIdentifier\": \"test@test.com\",\n  \"roles\": [\n    \"ROLE_USER\"\n  ]\n}",
            "form": []
        },
        "tests": []
    },
    {
        "_id": "a6e0c295-18d3-4de3-bc38-ddc2b3715ed6",
        "colId": "history",
        "containerId": "",
        "name": "http://localhost:8000/api/user/3",
        "url": "http://localhost:8000/api/user",
        "method": "GET",
        "sortNum": 0,
        "created": "2023-08-07T14:02:22.267Z",
        "modified": "2023-08-11T09:49:30.548Z",
        "headers": [],
        "params": [],
        "body": {
            "type": "json",
            "raw": "{\n  \"id\": 3,\n  \"name\": \"test\",\n  \"lastname\": \"deux\",\n  \"phone\": null,\n  \"email\": \"test@test.com\",\n  \"password\": \"$2y$13$T/eQCVvKuBhYlW0HX93NJudLXbpCs3zRa78Ir6S0YyKMJFsx8V.XK\",\n  \"role\": \"ROLE_USER\",\n  \"userIdentifier\": \"test@test.com\",\n  \"roles\": [\n    \"ROLE_USER\"\n  ]\n}",
            "form": []
        },
        "tests": []
    },
    {
        "_id": "60081540-3d95-4958-a6e5-b0c727a1e136",
        "colId": "history",
        "containerId": "",
        "name": "http://localhost:8000/api/user/3",
        "url": "http://localhost:8000/api/user/3",
        "method": "DELETE",
        "sortNum": 0,
        "created": "2023-08-07T14:02:54.765Z",
        "modified": "2023-08-07T14:02:54.765Z",
        "headers": [],
        "params": [],
        "body": {
            "type": "json",
            "raw": "{\n  \"id\": 3,\n  \"name\": \"test\",\n  \"lastname\": \"deux\",\n  \"phone\": null,\n  \"email\": \"test@test.com\",\n  \"password\": \"$2y$13$T/eQCVvKuBhYlW0HX93NJudLXbpCs3zRa78Ir6S0YyKMJFsx8V.XK\",\n  \"role\": \"ROLE_USER\",\n  \"userIdentifier\": \"test@test.com\",\n  \"roles\": [\n    \"ROLE_USER\"\n  ]\n}",
            "form": []
        },
        "tests": []
    }
]