<?xml version="1.0"?>
 <VTKFile type="Collection" version="0.1">
  <Collection>
   <DataSet timestep="0" group="" part="0" file="roots000.00.vtp"/>
   <DataSet timestep="1" group="" part="0" file="roots001.00.vtp"/>
   <DataSet timestep="2" group="" part="0" file="roots002.00.vtp"/>
   <DataSet timestep="3" group="" part="0" file="roots003.00.vtp"/>
   <DataSet timestep="4" group="" part="0" file="roots004.00.vtp"/>
   <DataSet timestep="5" group="" part="0" file="roots005.00.vtp"/>
   <DataSet timestep="6" group="" part="0" file="roots006.00.vtp"/>
   <DataSet timestep="7" group="" part="0" file="roots007.00.vtp"/>
   <DataSet timestep="8" group="" part="0" file="roots008.00.vtp"/>
   <DataSet timestep="9" group="" part="0" file="roots009.00.vtp"/>
   <DataSet timestep="10" group="" part="0" file="roots010.00.vtp"/>
   <DataSet timestep="11" group="" part="0" file="roots011.00.vtp"/>
   <DataSet timestep="12" group="" part="0" file="roots012.00.vtp"/>
   <DataSet timestep="13" group="" part="0" file="roots013.00.vtp"/>
   <DataSet timestep="14" group="" part="0" file="roots014.00.vtp"/>
   <DataSet timestep="15" group="" part="0" file="roots015.00.vtp"/>
   <DataSet timestep="16" group="" part="0" file="roots016.00.vtp"/>
   <DataSet timestep="17" group="" part="0" file="roots017.00.vtp"/>
   <DataSet timestep="18" group="" part="0" file="roots018.00.vtp"/>
   <DataSet timestep="19" group="" part="0" file="roots019.00.vtp"/>
   <DataSet timestep="20" group="" part="0" file="roots020.00.vtp"/>
   <DataSet timestep="21" group="" part="0" file="roots021.00.vtp"/>
   <DataSet timestep="22" group="" part="0" file="roots022.00.vtp"/>
   <DataSet timestep="23" group="" part="0" file="roots023.00.vtp"/>
   <DataSet timestep="24" group="" part="0" file="roots024.00.vtp"/>
   </Collection>
  </VTKFile>
