{
  "project_info": {
    "project_number": "59311831129",
    "firebase_url": "https://giga-app-49f5c.firebaseio.com",
    "project_id": "giga-app-49f5c",
    "storage_bucket": "giga-app-49f5c.appspot.com"
  },
  "client": [
    {
      "client_info": {
        "mobilesdk_app_id": "1:59311831129:android:5d8e5efc62aa8389ead948",
        "android_client_info": {
          "package_name": "com.example.gigaapp"
        }
      },
      "oauth_client": [
        {
          "client_id": "59311831129-a91aj599rjkjchbeht2am1jpkt2ttimq.apps.googleusercontent.com",
          "client_type": 1,
          "android_info": {
            "package_name": "com.example.gigaapp",
            "certificate_hash": "0d5129fee4bb145a49130e76792119fa5027c978"
          }
        },
        {
          "client_id": "59311831129-g96avtndg4d8lgfq2qqs6ehdtg8oimbn.apps.googleusercontent.com",
          "client_type": 3
        }
      ],
      "api_key": [
        {
          "current_key": "AIzaSyB4xb9DROG5VvTkcN6Jw82tRLnZkUePFhQ"
        }
      ],
      "services": {
        "appinvite_service": {
          "other_platform_oauth_client": [
            {
              "client_id": "59311831129-g96avtndg4d8lgfq2qqs6ehdtg8oimbn.apps.googleusercontent.com",
              "client_type": 3
            }
          ]
        }
      }
    }
  ],
  "configuration_version": "1"
}