\begin{thebibliography}{1}

\bibitem{Baez:9705009}
J.~C.~Baez,
{\em An introduction to $n$-categories,}
7th Conference on Category Theory and Computer Science, pp. 1-33, eds. E. Moggi
  and G. Rosolini, Lecture Notes in Computer Science vol. 1290, Springer,
  Berlin, 1997
[{\tt \href{http://www.arxiv.org/abs/q-alg/9705009}{q-alg/9705009}}].

\end{thebibliography}
