users = {
	"email": "markaaronesaturno@gmail.com",
	"mobileNumber" :09950128343,
	"userId": 3-15-105,
	"status": "Marupok",
	"password": "*****,"
	name: [
	{
			"firstName": "Mark Aarone",
			"lastName: "Saturno",
			"isActive" : "true" ,
		}



	]
}



courses = {
	"courseId": "Engineering101",
	"description: Hard Course",
	"price": 500,000,
	"isAdmin": "true"
	"enrollees" :"50"
	"enrollments": [
		{
			"enrolleOn": "Mech Engineering"
			"createdOn": "3-17-2021"

		}

	]

}
	 
