This file contains any messages produced by compilers while
running configure, to aid debugging if configure makes a mistake.

It was created by gifsicle configure 1.92, which was
generated by GNU Autoconf 2.69.  Invocation command line was

  $ ./configure --srcdir=. --cache-file=./config.cache --disable-dependency-tracking --enable-silent-rules --prefix=/dev/env/DJDIR

## --------- ##
## Platform. ##
## --------- ##

hostname = R500
uname -m = i686
uname -r = 5
uname -s = MS-DOS
uname -v = 50

/usr/bin/uname -p = unknown
/bin/uname -X     = unknown

/bin/arch              = unknown
/usr/bin/arch -k       = unknown
/usr/convex/getsysinfo = unknown
/usr/bin/hostinfo      = unknown
/bin/machine           = unknown
/usr/bin/oslevel       = unknown
/bin/universe          = unknown

PATH: /dev/c/djgpp/bin


## ----------- ##
## Core tests. ##
## ----------- ##

configure:2314: loading site script c:/djgpp/share/config.site
| #! /bin/sh
| 
| # Sanity check
| if test "x${DJDIR}" = "x"; then
|   echo "Your DJGPP installation is not set up correctly (DJDIR is not set)."
|   exit 1
| fi
| 
| # The root of the DJGPP tree serves as the default prefix.
| #
| # IMHO, this is not needed, as this file is supposed to be loaded
| # exactly because the user gave --prefix /dev/env/DJDIR -- tvh
| if test "x$ac_default_prefix" = "x/usr/local"; then
|   ac_default_prefix="/dev/env/DJDIR"
| fi
| 
| # The root of the DJGPP tree serves as the default prefix
| # for all paths that are hardcoded in the binaries.
| # When installing the installation prefix must be supplied.
| test "x$prefix" = xNONE && prefix='/dev/env/DJDIR'
| 
| # This is here for backward compatibility with 2.13 configures; the conditional
| # ensures it's disabled in the DJGPP package of autoconf 2.50 and above.
| # FIXME: This conditional may change as autoconf evolves - autoconf should
| #        really have some version variables.
| if test -z "$as_ln_s"; then
| 
|   echo "Warning: This configure script was generated using an old version of autoconf"
|   echo "Warning: Newer versions have much better DJGPP compatibility"
| 
| else # autoconf 2.50 or higher
| 
|   # Feel free to add others (.com, .btm, .sh, .pl, ...) to this list if you
|   # need configure scripts to find such files.  Try to limit it to things
|   # you need to avoid false positives.
|   ac_executable_extensions=".exe .bat"
| 
| fi
| 
| # Uncomment these to avoid typical portability problems
| # FIXME: Can these be enabled by default?
| #ac_cv_func_fork=no
| #ac_cv_func_mkfifo=no
| #ac_cv_func_mknod=no
| #ac_cv_func_mmap=no
| #ac_cv_func_pipe=no
| #ac_cv_func_vfork=no
| 
| # By using this, results of configure's program checks will be more portable
| # FIXME: In order to save environment space, it might be useful to strip
| #        existing $DJDIR/bin entries from the path first.
| 
| PATH="/dev/env/DJDIR/bin`if [ -z $PATH_SEPARATOR ] ; then echo ";" ; else echo $PATH_SEPARATOR; fi`$PATH"
| 
| # This is REQUIRED: using simply "/bin/(ba)sh" will NOT work (programs need
| # need this to be a full path with executable suffix for enhanced shell
| # support)
| export SHELL=/dev/env/DJDIR/bin/bash.exe
| 
| # This is required for config.status script to be run, since
| # ./configure runs it by invoking ${CONFIG_SHELL-/bin/sh}
| export CONFIG_SHELL=$SHELL
| 
| # $INSTALL must be an absolute path name, otherwise config.status
| # will try to prepend ./ and ../ to it when it goes into subdirs.
| 
| export INSTALL=${INSTALL='/dev/env/DJDIR/bin/ginstall -c'}
| 
| export PATH_SEPARATOR=:
| 
| # In 2.5x, replaced by ac_executable_extensions
| export TEST_FINDS_EXE=y
| 
| # Help out libtool
| ac_exeext=".exe"
| export lt_cv_sys_max_cmd_len=12288
| export lt_cv_prog_cc_pic_works=no
| 
| # Force the test for 'ln -s' to report no.
| export LN_S="cp -p"
| ac_cv_prog_LN_S="cp -p"
| 
| 
configure:2337: creating cache ./config.cache
configure:2458: checking for a BSD-compatible install
configure:2526: result: /dev/env/DJDIR/bin/ginstall -c
configure:2537: checking whether build environment is sane
configure:2592: result: yes
configure:2743: checking for a thread-safe mkdir -p
configure:2782: result: /dev/env/DJDIR/bin/mkdir -p
configure:2789: checking for gawk
configure:2805: found /dev/env/DJDIR/bin/gawk
configure:2816: result: gawk
configure:2827: checking whether make sets $(MAKE)
configure:2849: result: yes
configure:2878: checking whether make supports nested variables
configure:2895: result: yes
configure:3023: checking whether make sets $(MAKE)
configure:3045: result: yes
configure:3102: checking for gcc
configure:3118: found /dev/env/DJDIR/bin/gcc
configure:3129: result: gcc
configure:3358: checking for C compiler version
configure:3367: gcc --version >&5
gcc.exe (GCC) 8.2.0
Copyright (C) 2018 Free Software Foundation, Inc.
This is free software; see the source for copying conditions.  There is NO
warranty; not even for MERCHANTABILITY or FITNESS FOR A PARTICULAR PURPOSE.

configure:3378: $? = 0
configure:3367: gcc -v >&5
Using built-in specs.
COLLECT_GCC=c:/djgpp/bin/gcc.exe
COLLECT_LTO_WRAPPER=c:/djgpp/bin/../libexec/gcc/djgpp/8/lto-wrapper.exe
Target: djgpp
Configured with: /gcc-8.20/configure djgpp --prefix=/dev/env/DJDIR --disable-werror --enable-languages=c,c++,fortran,objc,obj-c++,ada --with-gcc-major-version-only --enable-libquadmath-support --enable-lto --disable-libstdcxx-pch --enable-libstdcxx-filesystem-ts
Thread model: single
gcc version 8.2.0 (GCC) 
configure:3378: $? = 0
configure:3367: gcc -V >&5
gcc.exe: error: unrecognized command line option '-V'
gcc.exe: fatal error: no input files
compilation terminated.
configure:3378: $? = 1
configure:3367: gcc -qversion >&5
gcc.exe: error: unrecognized command line option '-qversion'; did you mean '--version'?
gcc.exe: fatal error: no input files
compilation terminated.
configure:3378: $? = 1
configure:3398: checking whether the C compiler works
configure:3420: gcc    conftest.c  >&5
configure:3424: $? = 0
configure:3472: result: yes
configure:3475: checking for C compiler default output file name
configure:3477: result: a.out
configure:3483: checking for suffix of executables
configure:3490: gcc -o conftest    conftest.c  >&5
configure:3494: $? = 0
configure:3516: result: .exe
configure:3538: checking whether we are cross compiling
configure:3546: gcc -o conftest.exe    conftest.c  >&5
configure:3550: $? = 0
configure:3557: ./conftest.exe
configure:3561: $? = 0
configure:3576: result: no
configure:3581: checking for suffix of object files
configure:3603: gcc -c   conftest.c >&5
configure:3607: $? = 0
configure:3628: result: o
configure:3632: checking whether we are using the GNU C compiler
configure:3651: gcc -c   conftest.c >&5
configure:3651: $? = 0
configure:3660: result: yes
configure:3669: checking whether gcc accepts -g
configure:3689: gcc -c -g  conftest.c >&5
configure:3689: $? = 0
configure:3730: result: yes
configure:3747: checking for gcc option to accept ISO C89
configure:3810: gcc  -c -g -O2  conftest.c >&5
configure:3810: $? = 0
configure:3823: result: none needed
configure:3848: checking whether gcc understands -c and -o together
configure:3870: gcc -c conftest.c -o conftest2.o
configure:3873: $? = 0
configure:3870: gcc -c conftest.c -o conftest2.o
configure:3873: $? = 0
configure:3885: result: yes
configure:3905: checking whether make supports the include directive
configure:3920: make -f confmf.GNU && cat confinc.out
this is the am__doit target
configure:3923: $? = 0
configure:3942: result: yes (GNU style)
configure:3967: checking dependency style of gcc
configure:4078: result: none
configure:4098: checking how to run the C preprocessor
configure:4129: gcc -E  conftest.c
configure:4129: $? = 0
configure:4143: gcc -E  conftest.c
conftest.c:11:10: fatal error: ac_nonexistent.h: No such file or directory (ENOENT)
 #include <ac_nonexistent.h>
          ^~~~~~~~~~~~~~~~~~
compilation terminated.
configure:4143: $? = 1
configure: failed program was:
| /* confdefs.h */
| #define PACKAGE_NAME "gifsicle"
| #define PACKAGE_TARNAME "gifsicle"
| #define PACKAGE_VERSION "1.92"
| #define PACKAGE_STRING "gifsicle 1.92"
| #define PACKAGE_BUGREPORT ""
| #define PACKAGE_URL ""
| #define PACKAGE "gifsicle"
| #define VERSION "1.92"
| /* end confdefs.h.  */
| #include <ac_nonexistent.h>
configure:4168: result: gcc -E
configure:4188: gcc -E  conftest.c
configure:4188: $? = 0
configure:4202: gcc -E  conftest.c
conftest.c:11:10: fatal error: ac_nonexistent.h: No such file or directory (ENOENT)
 #include <ac_nonexistent.h>
          ^~~~~~~~~~~~~~~~~~
compilation terminated.
configure:4202: $? = 1
configure: failed program was:
| /* confdefs.h */
| #define PACKAGE_NAME "gifsicle"
| #define PACKAGE_TARNAME "gifsicle"
| #define PACKAGE_VERSION "1.92"
| #define PACKAGE_STRING "gifsicle 1.92"
| #define PACKAGE_BUGREPORT ""
| #define PACKAGE_URL ""
| #define PACKAGE "gifsicle"
| #define VERSION "1.92"
| /* end confdefs.h.  */
| #include <ac_nonexistent.h>
configure:4231: checking for an ANSI C-conforming const
configure:4297: gcc -c -g -O2  conftest.c >&5
configure:4297: $? = 0
configure:4304: result: yes
configure:4312: checking for inline
configure:4328: gcc -c -g -O2  conftest.c >&5
configure:4328: $? = 0
configure:4336: result: inline
configure:4409: checking for X
configure:4517: gcc -E  conftest.c
conftest.c:11:10: fatal error: X11/Xlib.h: No such file or directory (ENOENT)
 #include <X11/Xlib.h>
          ^~~~~~~~~~~~
compilation terminated.
configure:4517: $? = 1
configure: failed program was:
| /* confdefs.h */
| #define PACKAGE_NAME "gifsicle"
| #define PACKAGE_TARNAME "gifsicle"
| #define PACKAGE_VERSION "1.92"
| #define PACKAGE_STRING "gifsicle 1.92"
| #define PACKAGE_BUGREPORT ""
| #define PACKAGE_URL ""
| #define PACKAGE "gifsicle"
| #define VERSION "1.92"
| /* end confdefs.h.  */
| #include <X11/Xlib.h>
configure:4548: gcc -W -Wall -o conftest.exe -g -O2   conftest.c -lX11  >&5
conftest.c:11:10: fatal error: X11/Xlib.h: No such file or directory (ENOENT)
 #include <X11/Xlib.h>
          ^~~~~~~~~~~~
compilation terminated.
configure:4548: $? = 1
configure: failed program was:
| /* confdefs.h */
| #define PACKAGE_NAME "gifsicle"
| #define PACKAGE_TARNAME "gifsicle"
| #define PACKAGE_VERSION "1.92"
| #define PACKAGE_STRING "gifsicle 1.92"
| #define PACKAGE_BUGREPORT ""
| #define PACKAGE_URL ""
| #define PACKAGE "gifsicle"
| #define VERSION "1.92"
| /* end confdefs.h.  */
| #include <X11/Xlib.h>
| int
| main ()
| {
| XrmInitialize ()
|   ;
|   return 0;
| }
configure:4587: result: no
configure:5100: WARNING: Not compiling gifview since X is not available.
configure:5462: checking for random
configure:5462: gcc -W -Wall -o conftest.exe -g -O2   conftest.c  >&5
configure:5462: $? = 0
configure:5462: result: yes
configure:5475: checking for strerror
configure:5475: gcc -W -Wall -o conftest.exe -g -O2   conftest.c  >&5
configure:5475: $? = 0
configure:5475: result: yes
configure:5492: checking for strtoul
configure:5492: gcc -W -Wall -o conftest.exe -g -O2   conftest.c  >&5
configure:5492: $? = 0
configure:5492: result: yes
configure:5492: checking for mkstemp
configure:5492: gcc -W -Wall -o conftest.exe -g -O2   conftest.c  >&5
configure:5492: $? = 0
configure:5492: result: yes
configure:5501: checking for library containing pow
configure:5532: gcc -W -Wall -o conftest.exe -g -O2   conftest.c  >&5
conftest.c:24:6: warning: conflicting types for built-in function 'pow' [-Wbuiltin-declaration-mismatch]
 char pow ();
      ^~~
configure:5532: $? = 0
configure:5549: result: none required
configure:5563: checking sys/select.h usability
configure:5563: gcc -W -Wall -c -g -O2  conftest.c >&5
conftest.c:51:10: fatal error: sys/select.h: No such file or directory (ENOENT)
 #include <sys/select.h>
          ^~~~~~~~~~~~~~
compilation terminated.
configure:5563: $? = 1
configure: failed program was:
| /* confdefs.h */
| #define PACKAGE_NAME "gifsicle"
| #define PACKAGE_TARNAME "gifsicle"
| #define PACKAGE_VERSION "1.92"
| #define PACKAGE_STRING "gifsicle 1.92"
| #define PACKAGE_BUGREPORT ""
| #define PACKAGE_URL ""
| #define PACKAGE "gifsicle"
| #define VERSION "1.92"
| #define X_DISPLAY_MISSING 1
| #define X_DISPLAY_MISSING 1
| #define RANDOM random
| #define HAVE_STRERROR 1
| #define HAVE_STRTOUL 1
| #define HAVE_MKSTEMP 1
| #define HAVE_POW 1
| /* end confdefs.h.  */
| #include <stdio.h>
| #ifdef HAVE_SYS_TYPES_H
| # include <sys/types.h>
| #endif
| #ifdef HAVE_SYS_STAT_H
| # include <sys/stat.h>
| #endif
| #ifdef STDC_HEADERS
| # include <stdlib.h>
| # include <stddef.h>
| #else
| # ifdef HAVE_STDLIB_H
| #  include <stdlib.h>
| # endif
| #endif
| #ifdef HAVE_STRING_H
| # if !defined STDC_HEADERS && defined HAVE_MEMORY_H
| #  include <memory.h>
| # endif
| # include <string.h>
| #endif
| #ifdef HAVE_STRINGS_H
| # include <strings.h>
| #endif
| #ifdef HAVE_INTTYPES_H
| # include <inttypes.h>
| #endif
| #ifdef HAVE_STDINT_H
| # include <stdint.h>
| #endif
| #ifdef HAVE_UNISTD_H
| # include <unistd.h>
| #endif
| #include <sys/select.h>
configure:5563: result: no
configure:5563: checking sys/select.h presence
configure:5563: gcc -E  conftest.c
conftest.c:18:10: fatal error: sys/select.h: No such file or directory (ENOENT)
 #include <sys/select.h>
          ^~~~~~~~~~~~~~
compilation terminated.
configure:5563: $? = 1
configure: failed program was:
| /* confdefs.h */
| #define PACKAGE_NAME "gifsicle"
| #define PACKAGE_TARNAME "gifsicle"
| #define PACKAGE_VERSION "1.92"
| #define PACKAGE_STRING "gifsicle 1.92"
| #define PACKAGE_BUGREPORT ""
| #define PACKAGE_URL ""
| #define PACKAGE "gifsicle"
| #define VERSION "1.92"
| #define X_DISPLAY_MISSING 1
| #define X_DISPLAY_MISSING 1
| #define RANDOM random
| #define HAVE_STRERROR 1
| #define HAVE_STRTOUL 1
| #define HAVE_MKSTEMP 1
| #define HAVE_POW 1
| /* end confdefs.h.  */
| #include <sys/select.h>
configure:5563: result: no
configure:5563: checking for sys/select.h
configure:5563: result: no
configure:5563: checking sys/stat.h usability
configure:5563: gcc -W -Wall -c -g -O2  conftest.c >&5
configure:5563: $? = 0
configure:5563: result: yes
configure:5563: checking sys/stat.h presence
configure:5563: gcc -E  conftest.c
configure:5563: $? = 0
configure:5563: result: yes
configure:5563: checking for sys/stat.h
configure:5563: result: yes
configure:5563: checking inttypes.h usability
configure:5563: gcc -W -Wall -c -g -O2  conftest.c >&5
configure:5563: $? = 0
configure:5563: result: yes
configure:5563: checking inttypes.h presence
configure:5563: gcc -E  conftest.c
configure:5563: $? = 0
configure:5563: result: yes
configure:5563: checking for inttypes.h
configure:5563: result: yes
configure:5563: checking unistd.h usability
configure:5563: gcc -W -Wall -c -g -O2  conftest.c >&5
configure:5563: $? = 0
configure:5563: result: yes
configure:5563: checking unistd.h presence
configure:5563: gcc -E  conftest.c
configure:5563: $? = 0
configure:5563: result: yes
configure:5563: checking for unistd.h
configure:5563: result: yes
configure:5578: checking for inttypes.h
configure:5578: result: yes
configure:5592: checking sys/types.h usability
configure:5592: gcc -W -Wall -c -g -O2  conftest.c >&5
configure:5592: $? = 0
configure:5592: result: yes
configure:5592: checking sys/types.h presence
configure:5592: gcc -E  conftest.c
configure:5592: $? = 0
configure:5592: result: yes
configure:5592: checking for sys/types.h
configure:5592: result: yes
configure:5659: checking for uintptr_t
configure:5659: gcc -W -Wall -c -g -O2  conftest.c >&5
configure:5659: $? = 0
configure:5659: gcc -W -Wall -c -g -O2  conftest.c >&5
conftest.c: In function 'main':
conftest.c:34:24: error: expected expression before ')' token
 if (sizeof ((uintptr_t)))
                        ^
configure:5659: $? = 1
configure: failed program was:
| /* confdefs.h */
| #define PACKAGE_NAME "gifsicle"
| #define PACKAGE_TARNAME "gifsicle"
| #define PACKAGE_VERSION "1.92"
| #define PACKAGE_STRING "gifsicle 1.92"
| #define PACKAGE_BUGREPORT ""
| #define PACKAGE_URL ""
| #define PACKAGE "gifsicle"
| #define VERSION "1.92"
| #define X_DISPLAY_MISSING 1
| #define X_DISPLAY_MISSING 1
| #define RANDOM random
| #define HAVE_STRERROR 1
| #define HAVE_STRTOUL 1
| #define HAVE_MKSTEMP 1
| #define HAVE_POW 1
| #define HAVE_SYS_STAT_H 1
| #define HAVE_INTTYPES_H 1
| #define HAVE_UNISTD_H 1
| #define HAVE_INTTYPES_H 1
| #define HAVE_SYS_TYPES_H 1
| /* end confdefs.h.  */
| #if HAVE_INTTYPES_H
| # include <inttypes.h>
| #endif
| #if HAVE_SYS_TYPES_H
| # include <sys/types.h>
| #endif
| 
| 
| int
| main ()
| {
| if (sizeof ((uintptr_t)))
| 	    return 0;
|   ;
|   return 0;
| }
configure:5659: result: yes
configure:5675: checking for int64_t
configure:5675: gcc -W -Wall -c -g -O2  conftest.c >&5
configure:5675: $? = 0
configure:5675: gcc -W -Wall -c -g -O2  conftest.c >&5
conftest.c: In function 'main':
conftest.c:35:22: error: expected expression before ')' token
 if (sizeof ((int64_t)))
                      ^
configure:5675: $? = 1
configure: failed program was:
| /* confdefs.h */
| #define PACKAGE_NAME "gifsicle"
| #define PACKAGE_TARNAME "gifsicle"
| #define PACKAGE_VERSION "1.92"
| #define PACKAGE_STRING "gifsicle 1.92"
| #define PACKAGE_BUGREPORT ""
| #define PACKAGE_URL ""
| #define PACKAGE "gifsicle"
| #define VERSION "1.92"
| #define X_DISPLAY_MISSING 1
| #define X_DISPLAY_MISSING 1
| #define RANDOM random
| #define HAVE_STRERROR 1
| #define HAVE_STRTOUL 1
| #define HAVE_MKSTEMP 1
| #define HAVE_POW 1
| #define HAVE_SYS_STAT_H 1
| #define HAVE_INTTYPES_H 1
| #define HAVE_UNISTD_H 1
| #define HAVE_INTTYPES_H 1
| #define HAVE_SYS_TYPES_H 1
| #define HAVE_UINTPTR_T 1
| /* end confdefs.h.  */
| #if HAVE_INTTYPES_H
| # include <inttypes.h>
| #endif
| #if HAVE_SYS_TYPES_H
| # include <sys/types.h>
| #endif
| 
| 
| int
| main ()
| {
| if (sizeof ((int64_t)))
| 	    return 0;
|   ;
|   return 0;
| }
configure:5675: result: yes
configure:5691: checking for uint64_t
configure:5691: gcc -W -Wall -c -g -O2  conftest.c >&5
configure:5691: $? = 0
configure:5691: gcc -W -Wall -c -g -O2  conftest.c >&5
conftest.c: In function 'main':
conftest.c:36:23: error: expected expression before ')' token
 if (sizeof ((uint64_t)))
                       ^
configure:5691: $? = 1
configure: failed program was:
| /* confdefs.h */
| #define PACKAGE_NAME "gifsicle"
| #define PACKAGE_TARNAME "gifsicle"
| #define PACKAGE_VERSION "1.92"
| #define PACKAGE_STRING "gifsicle 1.92"
| #define PACKAGE_BUGREPORT ""
| #define PACKAGE_URL ""
| #define PACKAGE "gifsicle"
| #define VERSION "1.92"
| #define X_DISPLAY_MISSING 1
| #define X_DISPLAY_MISSING 1
| #define RANDOM random
| #define HAVE_STRERROR 1
| #define HAVE_STRTOUL 1
| #define HAVE_MKSTEMP 1
| #define HAVE_POW 1
| #define HAVE_SYS_STAT_H 1
| #define HAVE_INTTYPES_H 1
| #define HAVE_UNISTD_H 1
| #define HAVE_INTTYPES_H 1
| #define HAVE_SYS_TYPES_H 1
| #define HAVE_UINTPTR_T 1
| #define HAVE_INT64_T 1
| /* end confdefs.h.  */
| #if HAVE_INTTYPES_H
| # include <inttypes.h>
| #endif
| #if HAVE_SYS_TYPES_H
| # include <sys/types.h>
| #endif
| 
| 
| int
| main ()
| {
| if (sizeof ((uint64_t)))
| 	    return 0;
|   ;
|   return 0;
| }
configure:5691: result: yes
configure:5713: checking size of float
configure:5718: gcc -W -Wall -o conftest.exe -g -O2   conftest.c  >&5
configure:5718: $? = 0
configure:5718: ./conftest.exe
configure:5718: $? = 0
configure:5732: result: 4
configure:5746: checking size of unsigned int
configure:5751: gcc -W -Wall -o conftest.exe -g -O2   conftest.c  >&5
configure:5751: $? = 0
configure:5751: ./conftest.exe
configure:5751: $? = 0
configure:5765: result: 4
configure:5779: checking size of unsigned long
configure:5784: gcc -W -Wall -o conftest.exe -g -O2   conftest.c  >&5
configure:5784: $? = 0
configure:5784: ./conftest.exe
configure:5784: $? = 0
configure:5798: result: 4
configure:5812: checking size of void *
configure:5817: gcc -W -Wall -o conftest.exe -g -O2   conftest.c  >&5
configure:5817: $? = 0
configure:5817: ./conftest.exe
configure:5817: $? = 0
configure:5831: result: 4
configure:5844: checking for usable vector_size vector types
configure:5861: gcc -W -Wall -c -g -O2  conftest.c >&5
conftest.c: In function 'main':
conftest.c:68:41: warning: implicit declaration of function 'rand'; did you mean 'read'? [-Wimplicit-function-declaration]
     a[0] = a[1] = a[2] = a[3] = (float) rand();
                                         ^~~~
                                         read
configure:5861: $? = 0
configure:5870: result: yes
configure:5873: checking for usable ext_vector_type vector types
configure:5890: gcc -W -Wall -c -g -O2  conftest.c >&5
conftest.c:64:5: warning: 'ext_vector_type' attribute directive ignored [-Wattributes]
     typedef float float4 __attribute__((ext_vector_type (4)));
     ^~~~~~~
conftest.c: In function 'main':
conftest.c:69:6: error: subscripted value is neither array nor pointer nor vector
     a[0] = a[1] = a[2] = a[3] = (float) rand();
      ^
conftest.c:69:13: error: subscripted value is neither array nor pointer nor vector
     a[0] = a[1] = a[2] = a[3] = (float) rand();
             ^
conftest.c:69:20: error: subscripted value is neither array nor pointer nor vector
     a[0] = a[1] = a[2] = a[3] = (float) rand();
                    ^
conftest.c:69:27: error: subscripted value is neither array nor pointer nor vector
     a[0] = a[1] = a[2] = a[3] = (float) rand();
                           ^
conftest.c:69:41: warning: implicit declaration of function 'rand'; did you mean 'read'? [-Wimplicit-function-declaration]
     a[0] = a[1] = a[2] = a[3] = (float) rand();
                                         ^~~~
                                         read
conftest.c:71:21: error: subscripted value is neither array nor pointer nor vector
     printf("%f\n", a[0]);
                     ^
configure:5890: $? = 1
configure: failed program was:
| /* confdefs.h */
| #define PACKAGE_NAME "gifsicle"
| #define PACKAGE_TARNAME "gifsicle"
| #define PACKAGE_VERSION "1.92"
| #define PACKAGE_STRING "gifsicle 1.92"
| #define PACKAGE_BUGREPORT ""
| #define PACKAGE_URL ""
| #define PACKAGE "gifsicle"
| #define VERSION "1.92"
| #define X_DISPLAY_MISSING 1
| #define X_DISPLAY_MISSING 1
| #define RANDOM random
| #define HAVE_STRERROR 1
| #define HAVE_STRTOUL 1
| #define HAVE_MKSTEMP 1
| #define HAVE_POW 1
| #define HAVE_SYS_STAT_H 1
| #define HAVE_INTTYPES_H 1
| #define HAVE_UNISTD_H 1
| #define HAVE_INTTYPES_H 1
| #define HAVE_SYS_TYPES_H 1
| #define HAVE_UINTPTR_T 1
| #define HAVE_INT64_T 1
| #define HAVE_UINT64_T 1
| #define SIZEOF_FLOAT 4
| #define SIZEOF_UNSIGNED_INT 4
| #define SIZEOF_UNSIGNED_LONG 4
| #define SIZEOF_VOID_P 4
| #define HAVE_VECTOR_SIZE_VECTOR_TYPES 1
| /* end confdefs.h.  */
| #include <stdio.h>
| #ifdef HAVE_SYS_TYPES_H
| # include <sys/types.h>
| #endif
| #ifdef HAVE_SYS_STAT_H
| # include <sys/stat.h>
| #endif
| #ifdef STDC_HEADERS
| # include <stdlib.h>
| # include <stddef.h>
| #else
| # ifdef HAVE_STDLIB_H
| #  include <stdlib.h>
| # endif
| #endif
| #ifdef HAVE_STRING_H
| # if !defined STDC_HEADERS && defined HAVE_MEMORY_H
| #  include <memory.h>
| # endif
| # include <string.h>
| #endif
| #ifdef HAVE_STRINGS_H
| # include <strings.h>
| #endif
| #ifdef HAVE_INTTYPES_H
| # include <inttypes.h>
| #endif
| #ifdef HAVE_STDINT_H
| # include <stdint.h>
| #endif
| #ifdef HAVE_UNISTD_H
| # include <unistd.h>
| #endif
|     typedef float float4 __attribute__((ext_vector_type (4)));
| int
| main ()
| {
| float4 a;
|     a[0] = a[1] = a[2] = a[3] = (float) rand();
|     a *= (float) 3;
|     printf("%f\n", a[0]);
|   ;
|   return 0;
| }
configure:5899: result: no
configure:5902: checking for __builtin_shufflevector
configure:5919: gcc -W -Wall -c -g -O2  conftest.c >&5
conftest.c:64:5: warning: 'ext_vector_type' attribute directive ignored [-Wattributes]
     typedef float float4 __attribute__((ext_vector_type (4)));
     ^~~~~~~
conftest.c: In function 'main':
conftest.c:69:6: error: subscripted value is neither array nor pointer nor vector
     a[0] = a[1] = a[2] = a[3] = (float) rand();
      ^
conftest.c:69:13: error: subscripted value is neither array nor pointer nor vector
     a[0] = a[1] = a[2] = a[3] = (float) rand();
             ^
conftest.c:69:20: error: subscripted value is neither array nor pointer nor vector
     a[0] = a[1] = a[2] = a[3] = (float) rand();
                    ^
conftest.c:69:27: error: subscripted value is neither array nor pointer nor vector
     a[0] = a[1] = a[2] = a[3] = (float) rand();
                           ^
conftest.c:69:41: warning: implicit declaration of function 'rand'; did you mean 'read'? [-Wimplicit-function-declaration]
     a[0] = a[1] = a[2] = a[3] = (float) rand();
                                         ^~~~
                                         read
conftest.c:70:9: warning: implicit declaration of function '__builtin_shufflevector'; did you mean '__builtin_eh_filter'? [-Wimplicit-function-declaration]
     a = __builtin_shufflevector(a, a, 3, 2, 1, 0);
         ^~~~~~~~~~~~~~~~~~~~~~~
         __builtin_eh_filter
conftest.c:71:21: error: subscripted value is neither array nor pointer nor vector
     printf("%f\n", a[0]);
                     ^
configure:5919: $? = 1
configure: failed program was:
| /* confdefs.h */
| #define PACKAGE_NAME "gifsicle"
| #define PACKAGE_TARNAME "gifsicle"
| #define PACKAGE_VERSION "1.92"
| #define PACKAGE_STRING "gifsicle 1.92"
| #define PACKAGE_BUGREPORT ""
| #define PACKAGE_URL ""
| #define PACKAGE "gifsicle"
| #define VERSION "1.92"
| #define X_DISPLAY_MISSING 1
| #define X_DISPLAY_MISSING 1
| #define RANDOM random
| #define HAVE_STRERROR 1
| #define HAVE_STRTOUL 1
| #define HAVE_MKSTEMP 1
| #define HAVE_POW 1
| #define HAVE_SYS_STAT_H 1
| #define HAVE_INTTYPES_H 1
| #define HAVE_UNISTD_H 1
| #define HAVE_INTTYPES_H 1
| #define HAVE_SYS_TYPES_H 1
| #define HAVE_UINTPTR_T 1
| #define HAVE_INT64_T 1
| #define HAVE_UINT64_T 1
| #define SIZEOF_FLOAT 4
| #define SIZEOF_UNSIGNED_INT 4
| #define SIZEOF_UNSIGNED_LONG 4
| #define SIZEOF_VOID_P 4
| #define HAVE_VECTOR_SIZE_VECTOR_TYPES 1
| /* end confdefs.h.  */
| #include <stdio.h>
| #ifdef HAVE_SYS_TYPES_H
| # include <sys/types.h>
| #endif
| #ifdef HAVE_SYS_STAT_H
| # include <sys/stat.h>
| #endif
| #ifdef STDC_HEADERS
| # include <stdlib.h>
| # include <stddef.h>
| #else
| # ifdef HAVE_STDLIB_H
| #  include <stdlib.h>
| # endif
| #endif
| #ifdef HAVE_STRING_H
| # if !defined STDC_HEADERS && defined HAVE_MEMORY_H
| #  include <memory.h>
| # endif
| # include <string.h>
| #endif
| #ifdef HAVE_STRINGS_H
| # include <strings.h>
| #endif
| #ifdef HAVE_INTTYPES_H
| # include <inttypes.h>
| #endif
| #ifdef HAVE_STDINT_H
| # include <stdint.h>
| #endif
| #ifdef HAVE_UNISTD_H
| # include <unistd.h>
| #endif
|     typedef float float4 __attribute__((ext_vector_type (4)));
| int
| main ()
| {
| float4 a;
|     a[0] = a[1] = a[2] = a[3] = (float) rand();
|     a = __builtin_shufflevector(a, a, 3, 2, 1, 0);
|     printf("%f\n", a[0]);
|   ;
|   return 0;
| }
configure:5928: result: no
configure:5962: checking for library containing pthread_create
configure:5993: gcc -W -Wall -o conftest.exe -g -O2   conftest.c  >&5
ld: c:/djgpp/tmp/ccLhuXEh.o: in function `main':
d:/Projects/gifsicle/gifsicle-1.92/conftest.c:43: undefined reference to `pthread_create'
collect2.exe: error: ld returned 1 exit status
configure:5993: $? = 1
configure: failed program was:
| /* confdefs.h */
| #define PACKAGE_NAME "gifsicle"
| #define PACKAGE_TARNAME "gifsicle"
| #define PACKAGE_VERSION "1.92"
| #define PACKAGE_STRING "gifsicle 1.92"
| #define PACKAGE_BUGREPORT ""
| #define PACKAGE_URL ""
| #define PACKAGE "gifsicle"
| #define VERSION "1.92"
| #define X_DISPLAY_MISSING 1
| #define X_DISPLAY_MISSING 1
| #define RANDOM random
| #define HAVE_STRERROR 1
| #define HAVE_STRTOUL 1
| #define HAVE_MKSTEMP 1
| #define HAVE_POW 1
| #define HAVE_SYS_STAT_H 1
| #define HAVE_INTTYPES_H 1
| #define HAVE_UNISTD_H 1
| #define HAVE_INTTYPES_H 1
| #define HAVE_SYS_TYPES_H 1
| #define HAVE_UINTPTR_T 1
| #define HAVE_INT64_T 1
| #define HAVE_UINT64_T 1
| #define SIZEOF_FLOAT 4
| #define SIZEOF_UNSIGNED_INT 4
| #define SIZEOF_UNSIGNED_LONG 4
| #define SIZEOF_VOID_P 4
| #define HAVE_VECTOR_SIZE_VECTOR_TYPES 1
| #define HAVE_SIMD 1
| /* end confdefs.h.  */
| 
| /* Override any GCC internal prototype to avoid an error.
|    Use char because int might match the return type of a GCC
|    builtin and then its argument prototype would still apply.  */
| #ifdef __cplusplus
| extern "C"
| #endif
| char pthread_create ();
| int
| main ()
| {
| return pthread_create ();
|   ;
|   return 0;
| }
configure:5993: gcc -W -Wall -o conftest.exe -g -O2   conftest.c -lpthread   >&5
ld: cannot find -lpthread
collect2.exe: error: ld returned 1 exit status
configure:5993: $? = 1
configure: failed program was:
| /* confdefs.h */
| #define PACKAGE_NAME "gifsicle"
| #define PACKAGE_TARNAME "gifsicle"
| #define PACKAGE_VERSION "1.92"
| #define PACKAGE_STRING "gifsicle 1.92"
| #define PACKAGE_BUGREPORT ""
| #define PACKAGE_URL ""
| #define PACKAGE "gifsicle"
| #define VERSION "1.92"
| #define X_DISPLAY_MISSING 1
| #define X_DISPLAY_MISSING 1
| #define RANDOM random
| #define HAVE_STRERROR 1
| #define HAVE_STRTOUL 1
| #define HAVE_MKSTEMP 1
| #define HAVE_POW 1
| #define HAVE_SYS_STAT_H 1
| #define HAVE_INTTYPES_H 1
| #define HAVE_UNISTD_H 1
| #define HAVE_INTTYPES_H 1
| #define HAVE_SYS_TYPES_H 1
| #define HAVE_UINTPTR_T 1
| #define HAVE_INT64_T 1
| #define HAVE_UINT64_T 1
| #define SIZEOF_FLOAT 4
| #define SIZEOF_UNSIGNED_INT 4
| #define SIZEOF_UNSIGNED_LONG 4
| #define SIZEOF_VOID_P 4
| #define HAVE_VECTOR_SIZE_VECTOR_TYPES 1
| #define HAVE_SIMD 1
| /* end confdefs.h.  */
| 
| /* Override any GCC internal prototype to avoid an error.
|    Use char because int might match the return type of a GCC
|    builtin and then its argument prototype would still apply.  */
| #ifdef __cplusplus
| extern "C"
| #endif
| char pthread_create ();
| int
| main ()
| {
| return pthread_create ();
|   ;
|   return 0;
| }
configure:6010: result: no
configure:6020: checking for __sync_add_and_fetch
configure:6034: gcc -W -Wall -c -g -O2  conftest.c >&5
configure:6034: $? = 0
configure:6043: result: yes
configure:6150: updating cache ./config.cache
configure:6194: checking that generated files are newer than configure
configure:6200: result: done
configure:6223: creating ./config.status

## ---------------------- ##
## Running config.status. ##
## ---------------------- ##

This file was extended by gifsicle config.status 1.92, which was
generated by GNU Autoconf 2.69.  Invocation command line was

  CONFIG_FILES    = 
  CONFIG_HEADERS  = 
  CONFIG_LINKS    = 
  CONFIG_COMMANDS = 
  $ ./config.status 

on R500

config.status:875: creating Makefile
config.status:875: creating src/Makefile
config.status:875: creating config.h
config.status:1104: executing depfiles commands

## ---------------- ##
## Cache variables. ##
## ---------------- ##

ac_cv___builtin_shufflevector=no
ac_cv_c_compiler_gnu=yes
ac_cv_c_const=yes
ac_cv_c_inline=inline
ac_cv_env_CC_set=
ac_cv_env_CC_value=
ac_cv_env_CFLAGS_set=
ac_cv_env_CFLAGS_value=
ac_cv_env_CPPFLAGS_set=
ac_cv_env_CPPFLAGS_value=
ac_cv_env_CPP_set=
ac_cv_env_CPP_value=
ac_cv_env_LDFLAGS_set=
ac_cv_env_LDFLAGS_value=
ac_cv_env_LIBS_set=
ac_cv_env_LIBS_value=
ac_cv_env_XMKMF_set=
ac_cv_env_XMKMF_value=
ac_cv_env_build_alias_set=
ac_cv_env_build_alias_value=
ac_cv_env_host_alias_set=
ac_cv_env_host_alias_value=
ac_cv_env_target_alias_set=
ac_cv_env_target_alias_value=
ac_cv_exeext=.exe
ac_cv_ext_vector_type_vector_types=no
ac_cv_func_mkstemp=yes
ac_cv_func_random=yes
ac_cv_func_strerror=yes
ac_cv_func_strtoul=yes
ac_cv_have_x=have_x=no
ac_cv_header_inttypes_h=yes
ac_cv_header_sys_select_h=no
ac_cv_header_sys_stat_h=yes
ac_cv_header_sys_types_h=yes
ac_cv_header_unistd_h=yes
ac_cv_objext=o
ac_cv_path_mkdir=/dev/env/DJDIR/bin/mkdir
ac_cv_prog_AWK=gawk
ac_cv_prog_CPP='gcc -E'
ac_cv_prog_LN_S='cp -p'
ac_cv_prog_ac_ct_CC=gcc
ac_cv_prog_cc_c89=
ac_cv_prog_cc_g=yes
ac_cv_prog_make_make_set=yes
ac_cv_search_pow='none required'
ac_cv_search_pthread_create=no
ac_cv_sizeof_float=4
ac_cv_sizeof_unsigned_int=4
ac_cv_sizeof_unsigned_long=4
ac_cv_sizeof_void_p=4
ac_cv_type_int64_t=yes
ac_cv_type_uint64_t=yes
ac_cv_type_uintptr_t=yes
ac_cv_vector_size_vector_types=yes
am_cv_CC_dependencies_compiler_type=none
am_cv_make_support_nested_variables=yes
am_cv_prog_cc_c_o=yes
lt_cv_prog_cc_pic_works=no
lt_cv_sys_max_cmd_len=12288

## ----------------- ##
## Output variables. ##
## ----------------- ##

ACLOCAL='${SHELL} /dev/d/Projects/gifsicle/gifsicle-1.92/missing aclocal-1.16'
AMDEPBACKSLASH=''
AMDEP_FALSE=''
AMDEP_TRUE='#'
AMTAR='$${TAR-tar}'
AM_BACKSLASH='\'
AM_DEFAULT_V='$(AM_DEFAULT_VERBOSITY)'
AM_DEFAULT_VERBOSITY='0'
AM_V='$(V)'
AUTOCONF='${SHELL} /dev/d/Projects/gifsicle/gifsicle-1.92/missing autoconf'
AUTOHEADER='${SHELL} /dev/d/Projects/gifsicle/gifsicle-1.92/missing autoheader'
AUTOMAKE='${SHELL} /dev/d/Projects/gifsicle/gifsicle-1.92/missing automake-1.16'
AWK='gawk'
CC='gcc -W -Wall'
CCDEPMODE='depmode=none'
CFLAGS='-g -O2'
CPP='gcc -E'
CPPFLAGS=''
CYGPATH_W='echo'
DEFS='-DHAVE_CONFIG_H'
DEPDIR='.deps'
ECHO_C=''
ECHO_N='-n'
ECHO_T=''
EGREP=''
EXEEXT='.exe'
GIFWRITE_O='gifwrite.o'
GREP=''
INSTALL_DATA='${INSTALL} -m 644'
INSTALL_PROGRAM='${INSTALL}'
INSTALL_SCRIPT='${INSTALL}'
INSTALL_STRIP_PROGRAM='$(install_sh) -c -s'
LDFLAGS=''
LIBOBJS=''
LIBS=''
LTLIBOBJS=''
MAKEINFO='${SHELL} /dev/d/Projects/gifsicle/gifsicle-1.92/missing makeinfo'
MKDIR_P='/dev/env/DJDIR/bin/mkdir -p'
OBJEXT='o'
OTHERMANS=' gifdiff.1'
OTHERPROGRAMS=' gifdiff$(EXEEXT)'
PACKAGE='gifsicle'
PACKAGE_BUGREPORT=''
PACKAGE_NAME='gifsicle'
PACKAGE_STRING='gifsicle 1.92'
PACKAGE_TARNAME='gifsicle'
PACKAGE_URL=''
PACKAGE_VERSION='1.92'
PATH_SEPARATOR=':'
SET_MAKE=''
SHELL='/dev/env/DJDIR/bin/bash.exe'
STRIP=''
VERSION='1.92'
WERROR=''
XMKMF=''
X_CFLAGS=''
X_EXTRA_LIBS=''
X_LIBS=''
X_PRE_LIBS=''
ac_ct_CC='gcc'
am__EXEEXT_FALSE='#'
am__EXEEXT_TRUE=''
am__fastdepCC_FALSE=''
am__fastdepCC_TRUE='#'
am__include='include'
am__isrc=''
am__leading_dot='.'
am__nodep=''
am__quote=''
am__tar='$${TAR-tar} chof - "$$tardir"'
am__untar='$${TAR-tar} xf -'
bindir='${exec_prefix}/bin'
build_alias=''
datadir='${datarootdir}'
datarootdir='${prefix}/share'
docdir='${datarootdir}/doc/${PACKAGE_TARNAME}'
dvidir='${docdir}'
exec_prefix='${prefix}'
host_alias=''
htmldir='${docdir}'
includedir='${prefix}/include'
infodir='${datarootdir}/info'
install_sh='${SHELL} /dev/d/Projects/gifsicle/gifsicle-1.92/install-sh'
libdir='${exec_prefix}/lib'
libexecdir='${exec_prefix}/libexec'
localedir='${datarootdir}/locale'
localstatedir='${prefix}/var'
mandir='${datarootdir}/man'
mkdir_p='$(MKDIR_P)'
oldincludedir='/usr/include'
pdfdir='${docdir}'
prefix='/dev/env/DJDIR'
program_transform_name='s,x,x,'
psdir='${docdir}'
sbindir='${exec_prefix}/sbin'
sharedstatedir='${prefix}/com'
sysconfdir='${prefix}/etc'
target_alias=''

## ----------- ##
## confdefs.h. ##
## ----------- ##

/* confdefs.h */
#define PACKAGE_NAME "gifsicle"
#define PACKAGE_TARNAME "gifsicle"
#define PACKAGE_VERSION "1.92"
#define PACKAGE_STRING "gifsicle 1.92"
#define PACKAGE_BUGREPORT ""
#define PACKAGE_URL ""
#define PACKAGE "gifsicle"
#define VERSION "1.92"
#define X_DISPLAY_MISSING 1
#define X_DISPLAY_MISSING 1
#define RANDOM random
#define HAVE_STRERROR 1
#define HAVE_STRTOUL 1
#define HAVE_MKSTEMP 1
#define HAVE_POW 1
#define HAVE_SYS_STAT_H 1
#define HAVE_INTTYPES_H 1
#define HAVE_UNISTD_H 1
#define HAVE_INTTYPES_H 1
#define HAVE_SYS_TYPES_H 1
#define HAVE_UINTPTR_T 1
#define HAVE_INT64_T 1
#define HAVE_UINT64_T 1
#define SIZEOF_FLOAT 4
#define SIZEOF_UNSIGNED_INT 4
#define SIZEOF_UNSIGNED_LONG 4
#define SIZEOF_VOID_P 4
#define HAVE_VECTOR_SIZE_VECTOR_TYPES 1
#define HAVE_SIMD 1
#define HAVE___SYNC_ADD_AND_FETCH 1
#define PATHNAME_SEPARATOR '/'

configure: exit 0
