./travis/test/immwarn.asm:13: warning: word value exceeds bounds [-w+number-overflow]
./travis/test/immwarn.asm:21: warning: word value exceeds bounds [-w+number-overflow]
./travis/test/immwarn.asm:26: warning: signed byte value exceeds bounds [-w+number-overflow]
./travis/test/immwarn.asm:32: warning: word value exceeds bounds [-w+number-overflow]
./travis/test/immwarn.asm:37: warning: signed byte value exceeds bounds [-w+number-overflow]
./travis/test/immwarn.asm:49: warning: signed byte value exceeds bounds [-w+number-overflow]
./travis/test/immwarn.asm:75: warning: signed dword immediate exceeds bounds [-w+number-overflow]
./travis/test/immwarn.asm:75: warning: dword data exceeds bounds [-w+number-overflow]
./travis/test/immwarn.asm:79: warning: signed dword value exceeds bounds [-w+number-overflow]
./travis/test/immwarn.asm:89: warning: signed byte value exceeds bounds [-w+number-overflow]
