./travis/test/br3041451.asm:17: warning: negative `%rep' count: -2 [-w+pp-rep-negative]
./travis/test/br3041451.asm:28: warning: negative `%rep' count: -1 [-w+pp-rep-negative]
./travis/test/br3041451.asm:39: warning: negative `%rep' count: -2 [-w+pp-rep-negative]
./travis/test/br3041451.asm:50: warning: negative `%rep' count: -1 [-w+pp-rep-negative]
