./travis/test/rdpid.asm:10: error: invalid combination of opcode and operands
./travis/test/rdpid.asm:15: error: invalid combination of opcode and operands
./travis/test/rdpid.asm:21: error: invalid combination of opcode and operands
