tar.c	   (define.h zippipe.h lzwhead.h lzwbits.h compress.h)
tape.c     (define.h zippipe.h lzwhead.h compress.h)
disk.c	   (define.h)
store.c    (define.h)
savefile.c (define.h compress.h)
extract.c  (define.h zippipe.h lzwbits.h)
restore.c  (define.h lzwbits.h)
lzpack.c
compress.c (lzwbits.h)
unlzw.c    (lzwbits.h)
roll.c
percent.c
fmatch.c   (modern.h)
readopt.c  (modern.h define.h lzwbits.h)
tailor.c

diszip.c   (modern.h zippipe.h stdinc.h zipdefs.h crc32.h)
zippipe.c  (modern.h zippipe.h zalloc.h zipguts.h crc32.h ziposcod.h)
deflate.c  (modern.h zippipe.h zalloc.h zipdefs.h zipguts.h)
trees.c    (modern.h zippipe.h zalloc.h zipdefs.h zipguts.h)
bits.c     (modern.h zippipe.h stdinc.h zipdefs.h zipguts.h)
ziperror.c
crc32.c    (modern.h crc32.h)
match.obj

streamer.c
qicface.c
aspi.c

pctimer.obj
pclevel.obj
ctquirks.obj
cthandle.obj
aspient.obj
longdos.obj
