USERNAME => Joel2608 || AGE => 12 ans
USERNAME => joel2608 || AGE => 34 ans
USERNAME => joeo || AGE => 44 ans
USERNAME => 48 || AGE => 8999 ans
USERNAME => JJHGJ || AGE => 0 ans
USERNAME => JOU || AGE => 32 ans
USERNAME => joel || AGE => 32 ans
USERNAME => dsq || AGE => 656 ans
USERNAME => Joel26 || AGE => 32 ans
USERNAME => joe || AGE => 32 ans
USERNAME => jo || AGE => 32 ans
USERNAME => joe || AGE => 32 ans
USERNAME => sds || AGE => 5 ans
USERNAME => jo || AGE => 65 ans
USERNAME => ds || AGE => 54 ans
USERNAME => joe || AGE => 32 ans
USERNAME => jo || AGE => 32 ans
USERNAME => jo || AGE => 56 ans
USERNAME => ko || AGE => 54 ans
USERNAME => jo || AGE => 5 ans
USERNAME => joe || AGE => 5 ans
USERNAME => jo || AGE => 0 ans
USERNAME => jo || AGE => 6 ans
USERNAME => jod || AGE => 32 ans
USERNAME => joe || AGE => 32 ans
USERNAME => dsq || AGE => 55 ans
USERNAME => ds || AGE => 6 ans
USERNAME => 5d || AGE => 0 ans
USERNAME => ds || AGE => 2 ans
