{
  "1": {
    "color": "lightBlue",
    "name": "foid inhabituel"
  },
  "2": {
    "color": "blueGray",
    "name": "épisode neigeux"
  },
  "3": {
    "color": "orange",
    "name": "douceur inhabituelle"
  },
  "4": {
    "color": "cyan",
    "name": "épisode pluvieux"
  },
  "5": {
    "color": "blue",
    "name": "inondation"
  },
  "6": {
    "color": "blueGray",
    "name": "tempête/coup de vent"
  },
  "7": {
    "color": "blueGray",
    "name": "cyclone"
  },
  "8": {
    "color": "red",
    "name": "chaleur / canicule"
  },
  "9": {
    "color": "coolGray",
    "name": "orages"
  },
  "10": {
    "color": "orange",
    "name": "sécheresse"
  },
  "11": {
    "color": "coolGray",
    "name": "pluies verglaçantes"
  },
  "12": {
    "color": "cyan",
    "name": "gelées tardives"
  },
  "13": {
    "color": "cyan",
    "name": "gelées précoces"
  },
  "14": {
    "color": "coolGray",
    "name": "froid"
  },
  "15": {
    "color": "blue",
    "name": "grêle"
  },
  "16": {
    "color": "blueGray",
    "name": "épisode neigeux tardif"
  },
  "17": {
    "color": "blueGray",
    "name": "épisode neigeux précoce"
  },
  "18": {
    "color": "blueGray",
    "name": "tornade"
  },
  "19": {
    "color": "orange",
    "name": "dépression extra-tropicale"
  },
  "20": {
    "color": "orange",
    "name": "tempête tropicale"
  },
  "-1": {
    "color": "emerald",
    "name": "autres"
  }
}
