%YAML 1.1
%TAG !u! tag:unity3d.com,2011:
--- !u!114 &11400000
MonoBehaviour:
  m_ObjectHideFlags: 0
  m_CorrespondingSourceObject: {fileID: 0}
  m_PrefabInstance: {fileID: 0}
  m_PrefabAsset: {fileID: 0}
  m_GameObject: {fileID: 0}
  m_Enabled: 1
  m_EditorHideFlags: 0
  m_Script: {fileID: 11500000, guid: e1ecc754ed5c4b3ca0c82e41542f805d, type: 3}
  m_Name: red_skin
  m_EditorClassIdentifier: 
  Block: {fileID: 2100000, guid: 83400040cadcce540b6cb45923e528f7, type: 2}
  Paddle: {fileID: 2100000, guid: 830f5a5edcb91f8cd8e01e9b0918f09c, type: 2}
  Price: 50
