{
  "settings": {
    "audio.volume.notification": {},
    "audio.volume.content": {},
    "audio.volume.alarm": {},
    "tethering.wifi.ssid": {},
    "language.current": {},
    "time.timezone.automatic-update.enabled": {},
    "time.timezone": {},
    "time.clock.automatic-update.enabled": {},
    "bluetooth.enabled": {},
    "ril.data.roaming_enabled.warningDialog.enabled": {},
    "ril.cellbroadcast.disabled": {},
    "ril.mms.retrieval_mode": {},
    "ril.sms.encoding_mode": {},
    "ril.mms.service_mode": {},
    "keyboard.vibration": {},
    "screen.brightness": {},
    "custom.speeddials": {},
    "volte_vowifi_settings.show": {},
    "keypad.layouts.hindi": {},
    "keypad.layouts.assamese": {},
    "keypad.layouts.bengali": {},
    "keypad.layouts.gujarati": {},
    "keypad.layouts.marathi": {},
    "keypad.layouts.telugu": {},
    "keypad.layouts.tamil": {},
    "keypad.layouts.malayalam": {},
    "keypad.layouts.punjabi": {},
    "keypad.layouts.odia": {},
    "keypad.layouts.kannada": {},
    "keypad.layouts.nepali": {},
    "keypad.layouts.konkani": {},
    "keypad.layouts.maithili": {},
    "keypad.layouts.dogri": {},
    "keypad.layouts.sindhi": {},
    "keypad.layouts.sanskrit": {},
    "keypad.layouts.manipuri": {},
    "keypad.layouts.bodo": {},
    "keypad.layouts.santali": {},
    "keypad.layouts.arabic": {},
    "keypad.layouts.chinese_cn": {},
    "keypad.layouts.dutch": {},
    "keypad.layouts.english_gb": {},
    "keypad.layouts.french_fr": {},
    "keypad.layouts.german": {},
    "keypad.layouts.hungarian": {},
    "keypad.layouts.italian": {},
    "keypad.layouts.polish": {},
    "keypad.layouts.romanian": {},
    "keypad.layouts.portugese_pt": {},
    "keypad.layouts.russian": {},
    "keypad.layouts.spanish_es": {},
    "keypad.layouts.turkish": {},
    "keypad.layouts.vietnamese": {},
    "keypad.layouts.czech": {},
    "keypad.layouts.finnish": {},
    "keypad.layouts.greek": {},
    "keypad.layouts.macedonian": {},
    "keypad.layouts.serbian": {},
    "keypad.layouts.slovak": {},
    "keypad.layouts.slovenian": {},
    "keypad.layouts.swedish": {},
    "keypad.layouts.albanian": {},
    "keypad.layouts.bosnian": {},
    "keypad.layouts.chinese_hk": {},
    "keypad.layouts.chinese_tw": {},
    "keypad.layouts.danish": {},
    "keypad.layouts.icelandic": {},
    "keypad.layouts.norwegian": {},
    "ftu.config": {},
    "ril.data.roaming_enabled": {},
    "cmas.settings.show": {},
    "cmas.extreme.enabled": {} ,
    "cmas.severe.enabled": {},
    "cmas.amber.enabled": {},
    "cmas.monthlytest.enabled": {},
    "mms.enable": {},
    "slider.sound.enabled": {},
    "auto.send.crash.sms": {},
    "locale.hour12": {},
    "ril.data.enabled": {},
    "phone.ring.keypad": {},
    "data.roaming.domestic_international.enabled": {},
    "Customization.email.Signature": {},
    "speed.dial.enable":{}

  },
  "prefs": {
    "network.http.connection-timeout": {}
  },
  "config": {
    "config.test": {}
  }
}
