<?xml version="1.0" standalone="no"?>
<!DOCTYPE svg PUBLIC "-//W3C//DTD SVG 20010904//EN"
 "http://www.w3.org/TR/2001/REC-SVG-20010904/DTD/svg10.dtd">
<svg version="1.0" xmlns="http://www.w3.org/2000/svg"
 width="752.000000pt" height="752.000000pt" viewBox="0 0 752.000000 752.000000"
 preserveAspectRatio="xMidYMid meet">

<g transform="translate(0.000000,752.000000) scale(0.100000,-0.100000)"
fill="#FFE128" stroke="none">
<path d="M3660 7083 c-14 -4 -1273 -1793 -1266 -1800 2 -2 85 43 184 100 l182
104 555 793 c305 436 552 796 549 801 -5 9 -175 11 -204 2z"/>
<path d="M3566 6355 c-256 -366 -462 -665 -458 -665 4 0 88 47 187 104 l180
103 357 509 c196 280 357 514 357 519 1 9 -137 95 -152 95 -3 0 -215 -299
-471 -665z"/>
<path d="M3154 6835 l-180 -104 -1107 -1581 -1107 -1580 2 -160 3 -160 481
688 481 687 11 87 c19 150 76 232 219 316 l91 53 650 929 c358 512 648 930
644 929 -4 0 -88 -47 -188 -104z"/>
<path d="M4042 6423 l-292 -417 67 -12 c38 -6 80 -17 96 -25 17 -7 31 -9 36
-3 18 19 552 786 549 788 -17 14 -147 86 -154 86 -6 0 -141 -188 -302 -417z"/>
<path d="M4366 6274 c-152 -217 -274 -399 -271 -404 4 -7 116 -74 147 -88 3
-2 131 176 284 394 l278 397 -24 16 c-13 9 -49 31 -80 48 l-57 33 -277 -396z"/>
<path d="M2438 6426 l-177 -103 -751 -1071 -750 -1071 2 -160 3 -160 925 1320
c509 727 929 1327 933 1335 4 8 4 14 0 13 -4 0 -88 -47 -185 -103z"/>
<path d="M4685 6119 c-143 -204 -268 -383 -277 -398 l-17 -27 79 -47 80 -46
24 32 c13 18 135 192 271 387 136 195 252 360 257 366 6 8 -16 26 -70 58 -43
25 -81 46 -83 46 -2 0 -121 -167 -264 -371z"/>
<path d="M4975 5923 c-148 -213 -271 -392 -273 -398 -3 -14 137 -98 153 -92
10 4 543 760 551 782 4 10 -134 95 -152 95 -5 -1 -130 -175 -279 -387z"/>
<path d="M5283 5749 c-150 -214 -274 -394 -275 -400 -3 -10 134 -100 150 -99
6 1 524 738 546 778 10 18 1 25 -93 79 l-56 31 -272 -389z"/>
<path d="M1730 6019 l-185 -107 -392 -558 -392 -559 -1 -160 c0 -156 0 -159
19 -140 23 25 1143 1627 1139 1629 -2 1 -86 -46 -188 -105z"/>
<path d="M5645 5658 c-115 -166 -240 -345 -277 -398 l-67 -97 81 -47 c44 -26
82 -45 83 -44 5 6 541 773 548 785 5 8 -17 26 -62 52 -38 23 -76 43 -83 46 -8
2 -92 -109 -223 -297z"/>
<path d="M6092 5683 c-119 -169 -467 -667 -476 -682 -6 -9 4 -24 31 -50 21
-20 50 -51 64 -69 l26 -34 291 417 c161 229 292 419 292 423 0 7 -142 92 -153
92 -3 0 -37 -44 -75 -97z"/>
<path d="M1085 5650 c-205 -123 -298 -266 -320 -490 -6 -67 -5 -73 8 -60 13
13 399 562 421 598 13 22 -7 13 -109 -48z"/>
<path d="M6121 5113 l-341 -487 0 -160 c0 -100 4 -156 9 -151 6 6 193 271 416
590 l406 580 -61 58 c-33 31 -67 57 -74 57 -8 0 -168 -219 -355 -487z"/>
<path d="M5966 4280 c-405 -577 -736 -1052 -736 -1055 0 -3 49 -5 109 -5 l109
0 29 38 c16 20 312 441 657 934 l628 897 -7 58 c-8 68 -34 171 -46 178 -4 3
-339 -467 -743 -1045z"/>
<path d="M3497 4931 c-43 -10 -84 -24 -91 -32 -8 -8 -210 -295 -450 -638
l-437 -623 6 -47 c11 -86 38 -202 46 -199 9 3 1089 1543 1089 1552 0 11 -85 4
-163 -13z"/>
<path d="M3251 4072 l-614 -877 37 -70 c41 -77 64 -111 70 -104 17 18 1326
1893 1323 1895 -6 7 -149 34 -175 34 -24 -1 -89 -89 -641 -878z"/>
<path d="M3540 3873 l-691 -987 65 -65 c58 -57 68 -64 80 -51 13 13 1347 1916
1390 1982 l18 27 -81 40 c-44 23 -82 41 -85 41 -2 0 -315 -444 -696 -987z"/>
<path d="M3041 4729 c-152 -107 -292 -264 -379 -427 -51 -96 -143 -367 -114
-337 5 6 128 179 272 385 144 206 271 387 282 403 11 15 18 27 15 27 -2 0 -36
-23 -76 -51z"/>
<path d="M6203 4007 c-299 -426 -543 -777 -543 -781 0 -3 27 -6 61 -6 l61 0
-4 -70 c-2 -39 -1 -70 2 -70 3 1 222 312 488 691 l482 691 -2 160 -3 159 -542
-774z"/>
<path d="M3884 3753 c-357 -510 -675 -964 -707 -1010 l-58 -83 85 -42 c47 -23
87 -40 89 -38 2 3 313 447 692 988 l688 983 -34 35 c-19 20 -50 49 -70 64
l-36 29 -649 -926z"/>
<path d="M4122 3481 c-359 -513 -655 -938 -658 -945 -5 -14 78 -34 158 -39
l38 -2 609 869 610 869 -34 66 c-18 36 -41 77 -52 90 l-19 23 -652 -931z"/>
<path d="M1270 3687 c-250 -357 -470 -671 -488 -697 l-33 -47 3 -159 3 -159
488 696 488 697 -3 160 -3 159 -455 -650z"/>
<path d="M4463 3358 c-332 -474 -601 -863 -600 -865 6 -5 182 26 222 40 37 13
74 63 622 843 320 456 582 832 582 837 1 4 -50 7 -111 7 l-113 -1 -602 -861z"/>
<path d="M4965 3463 c-291 -416 -532 -760 -534 -766 -8 -21 99 62 180 140 93
90 185 212 240 317 l34 66 66 0 c55 0 69 4 86 23 18 19 619 875 667 950 l18
27 -113 0 -114 0 -530 -757z"/>
<path d="M6261 3479 c-479 -683 -485 -692 -493 -753 -16 -123 -90 -227 -211
-299 -56 -34 -73 -57 -703 -957 -355 -507 -644 -923 -642 -925 2 -2 84 43 183
99 l180 103 1088 1552 1087 1552 -2 159 -3 160 -484 -691z"/>
<path d="M1235 3025 l-487 -695 7 -52 c10 -71 44 -180 55 -176 5 2 214 296
465 653 l455 650 0 158 c0 86 -2 157 -5 157 -2 0 -223 -313 -490 -695z"/>
<path d="M5833 2257 c-501 -716 -910 -1303 -908 -1305 2 -2 84 43 184 100
l181 103 730 1042 730 1043 -2 160 -3 160 -912 -1303z"/>
<path d="M1312 2524 l-404 -576 29 -30 c31 -33 112 -92 118 -86 2 2 155 219
340 483 l335 479 0 153 c0 84 -3 153 -8 153 -4 0 -189 -259 -410 -576z"/>
<path d="M6719 2910 c-30 -40 -1071 -1528 -1083 -1549 -5 -7 11 -2 35 12 24
14 109 63 189 109 l145 83 367 524 c415 592 382 527 376 741 l-3 115 -26 -35z"/>
<path d="M1767 2561 c-46 -53 -568 -813 -563 -818 20 -20 152 -91 157 -85 10
10 549 781 549 785 0 1 -29 32 -64 69 -59 59 -66 64 -79 49z"/>
<path d="M1776 1964 c-153 -218 -276 -397 -274 -398 22 -18 151 -87 158 -84 5
2 133 179 284 395 193 276 271 395 263 401 -27 20 -135 82 -144 82 -6 0 -135
-178 -287 -396z"/>
<path d="M6543 2049 c-105 -151 -190 -276 -187 -278 12 -12 173 101 226 158
89 98 165 273 156 363 -3 29 -20 7 -195 -243z"/>
<path d="M4971 2091 l-184 -106 -568 -810 c-557 -796 -566 -810 -540 -818 29
-9 127 -1 181 14 32 9 86 83 668 916 348 498 631 907 630 908 -2 1 -86 -46
-187 -104z"/>
<path d="M2086 1796 c-152 -217 -276 -398 -276 -403 0 -7 140 -93 153 -93 5 0
557 785 557 793 0 3 -26 20 -57 37 -32 18 -68 39 -79 47 -21 13 -31 0 -298
-381z"/>
<path d="M2390 1618 c-151 -215 -276 -395 -278 -399 -2 -4 32 -28 75 -53 60
-35 81 -42 90 -33 6 7 118 165 249 352 130 187 252 361 270 386 l33 46 -76 44
c-42 24 -79 45 -83 47 -3 1 -129 -174 -280 -390z"/>
<path d="M2688 1433 l-277 -396 77 -47 c59 -37 80 -45 90 -36 32 30 550 782
543 789 -11 11 -142 87 -150 87 -3 0 -131 -179 -283 -397z"/>
<path d="M4258 1682 l-187 -107 -375 -535 -374 -535 37 -23 c20 -13 57 -34 82
-47 l45 -23 425 606 c233 333 450 643 482 689 32 46 57 83 55 83 -2 0 -87 -48
-190 -108z"/>
<path d="M2997 1265 c-147 -211 -270 -390 -272 -397 -4 -9 20 -29 70 -58 75
-42 77 -43 94 -24 22 23 530 750 537 768 4 11 -130 97 -152 95 -5 0 -129 -173
-277 -384z"/>
<path d="M3301 1086 c-151 -216 -275 -397 -274 -402 0 -9 139 -94 151 -94 4 1
141 193 305 428 l299 427 -74 6 c-40 3 -86 11 -101 18 -16 6 -29 11 -30 11 -1
-1 -126 -178 -276 -394z"/>
</g>
</svg>
