Update abstract.go

31 jobs for master in 24 minutes and 41 seconds (queued for 1 second)
latest
Status Job ID Name Coverage
  Prebuild
passed #238499111
check feature flags docs

00:01:20

passed #238499104
clone test repo

00:01:16

passed #238499109
dep check

00:01:29

passed #238499103
docker
helper images

00:06:04

manual #238499105
allowed to fail manual
review-docs-deploy
passed #238499107
gitlab-org
tests definitions

00:03:25

 
  Test
passed #238499114
code_quality

00:01:22

passed #238499125
docs check links

00:00:58

failed #238499126
git 1.7.1

00:02:06

passed #238499113
allowed to fail
license_management

00:04:03

passed #238499115
docker
unit test 1/5

00:11:24

failed #238499116
docker
unit test 2/5

00:16:36

failed #238499117
docker
unit test 3/5

00:11:24

passed #238499118
docker
unit test 4/5

00:06:32

passed #238499119
docker
unit test 5/5

00:06:01

passed #238499120
docker allowed to fail
unit test with race 1/5

00:12:41

failed #238499121
docker allowed to fail
unit test with race 2/5

00:18:02

failed #238499122
docker allowed to fail
unit test with race 3/5

00:13:39

passed #238499123
docker allowed to fail
unit test with race 4/5

00:05:18

passed #238499124
docker allowed to fail
unit test with race 5/5

00:08:00

 
  Coverage
canceled #238499129
race conditions detector

00:00:33

canceled #238499128
test coverage report

00:00:33

canceled #238499130
test junit report

00:00:32

 
  Build
canceled #238499131
gitlab-org
binaries darwin/386 darwin/amd64

canceled #238499132
gitlab-org
binaries freebsd/386 freebsd/amd64 freebsd/arm

canceled #238499133
gitlab-org
binaries linux/386 linux/amd64 linux/arm

canceled #238499135
gitlab-org
binaries windows/386 windows/amd64

 
  Package
canceled #238499136
gitlab-org
package-deb

canceled #238499137
gitlab-org
package-rpm

 
  Release
canceled #238499138
static QA

 
  Cleanup
canceled #238499139
allowed to fail manual
review-docs-cleanup

 
Name Stage Failure
failed
unit test with race 2/5 Test
FAIL
coverage: 64.3% of statements
exit status 1
FAIL gitlab.com/gitlab-org/gitlab-runner/executors/docker/machine 0.138s
Makefile:134: recipe for target 'parallel_test_execute' failed
make: *** [parallel_test_execute] Error 1
Uploading artifacts...
.cover/*: found 14 matching files
.testoutput/*: found 14 matching files

Uploading artifacts to coordinator... ok
id=238499121 responseStatus=201 Created token=wGu_NKA1
failed
unit test 2/5 Test
coverage: 64.3% of statements
ok gitlab.com/gitlab-org/gitlab-runner/executors/docker/machine 0.039s
Makefile:134: recipe for target 'parallel_test_execute' failed
make: *** [parallel_test_execute] Error 1
Uploading artifacts...
.cover/*: found 14 matching files
.testoutput/*: found 14 matching files

Uploading artifacts to coordinator... ok
id=238499116 responseStatus=201 Created token=SEC-1htG
ERROR: Job failed: exit code 1
failed
unit test with race 3/5 Test
coverage: 62.4% of statements
ok gitlab.com/gitlab-org/gitlab-runner/helpers/archives 1.053s
Makefile:134: recipe for target 'parallel_test_execute' failed
make: *** [parallel_test_execute] Error 1
Uploading artifacts...
.cover/*: found 14 matching files
.testoutput/*: found 14 matching files

Uploading artifacts to coordinator... ok
id=238499122 responseStatus=201 Created token=s9oxDdUE
ERROR: Job failed: exit code 1
failed
unit test 3/5 Test
coverage: 62.4% of statements
ok gitlab.com/gitlab-org/gitlab-runner/helpers/archives 0.044s
Makefile:134: recipe for target 'parallel_test_execute' failed
make: *** [parallel_test_execute] Error 1
Uploading artifacts...
.cover/*: found 14 matching files
.testoutput/*: found 14 matching files

Uploading artifacts to coordinator... ok
id=238499117 responseStatus=201 Created token=UdYXvKHz
ERROR: Job failed: exit code 1
failed
git 1.7.1 Test
$ echo Hello World
Hello World
Job succeeded
FAIL
coverage: 76.6% of statements
FAIL gitlab.com/gitlab-org/gitlab-runner/executors/shell 17.679s
ok gitlab.com/gitlab-org/gitlab-runner/shells 0.036s coverage: 29.4% of statements
make: *** [test] Error 1
ERROR: Job failed: exit code 1