CRITICAL - 2021-01-30 05:14:42 --> Too few arguments to function App\Models\DailyModel::getWeather(), 0 passed in C:\xampp\htdocs\weather-web\app\Controllers\Daily.php on line 14 and exactly 1 expected
#0 C:\xampp\htdocs\weather-web\app\Controllers\Daily.php(14): App\Models\DailyModel->getWeather()
#1 C:\xampp\htdocs\weather-web\system\CodeIgniter.php(918): App\Controllers\Daily->index()
#2 C:\xampp\htdocs\weather-web\system\CodeIgniter.php(404): CodeIgniter\CodeIgniter->runController(Object(App\Controllers\Daily))
#3 C:\xampp\htdocs\weather-web\system\CodeIgniter.php(312): CodeIgniter\CodeIgniter->handleRequest(NULL, Object(Config\Cache), false)
#4 C:\xampp\htdocs\weather-web\public\index.php(45): CodeIgniter\CodeIgniter->run()
#5 C:\xampp\htdocs\weather-web\system\Commands\Server\rewrite.php(34): require_once('C:\\xampp\\htdocs...')
#6 {main}
CRITICAL - 2021-01-30 05:15:42 --> Too few arguments to function App\Models\DailyModel::getWeather(), 0 passed in C:\xampp\htdocs\weather-web\app\Controllers\Daily.php on line 14 and exactly 1 expected
#0 C:\xampp\htdocs\weather-web\app\Controllers\Daily.php(14): App\Models\DailyModel->getWeather()
#1 C:\xampp\htdocs\weather-web\system\CodeIgniter.php(918): App\Controllers\Daily->index()
#2 C:\xampp\htdocs\weather-web\system\CodeIgniter.php(404): CodeIgniter\CodeIgniter->runController(Object(App\Controllers\Daily))
#3 C:\xampp\htdocs\weather-web\system\CodeIgniter.php(312): CodeIgniter\CodeIgniter->handleRequest(NULL, Object(Config\Cache), false)
#4 C:\xampp\htdocs\weather-web\public\index.php(45): CodeIgniter\CodeIgniter->run()
#5 C:\xampp\htdocs\weather-web\system\Commands\Server\rewrite.php(34): require_once('C:\\xampp\\htdocs...')
#6 {main}
CRITICAL - 2021-01-30 05:16:59 --> Too few arguments to function App\Models\DailyModel::getWeather(), 0 passed in C:\xampp\htdocs\weather-web\app\Controllers\Daily.php on line 14 and exactly 1 expected
#0 C:\xampp\htdocs\weather-web\app\Controllers\Daily.php(14): App\Models\DailyModel->getWeather()
#1 C:\xampp\htdocs\weather-web\system\CodeIgniter.php(918): App\Controllers\Daily->index()
#2 C:\xampp\htdocs\weather-web\system\CodeIgniter.php(404): CodeIgniter\CodeIgniter->runController(Object(App\Controllers\Daily))
#3 C:\xampp\htdocs\weather-web\system\CodeIgniter.php(312): CodeIgniter\CodeIgniter->handleRequest(NULL, Object(Config\Cache), false)
#4 C:\xampp\htdocs\weather-web\public\index.php(45): CodeIgniter\CodeIgniter->run()
#5 C:\xampp\htdocs\weather-web\system\Commands\Server\rewrite.php(34): require_once('C:\\xampp\\htdocs...')
#6 {main}
CRITICAL - 2021-01-30 05:22:07 --> Too few arguments to function App\Models\DailyModel::getWeather(), 0 passed in C:\xampp\htdocs\weather-web\app\Controllers\Daily.php on line 14 and exactly 1 expected
#0 C:\xampp\htdocs\weather-web\app\Controllers\Daily.php(14): App\Models\DailyModel->getWeather()
#1 C:\xampp\htdocs\weather-web\system\CodeIgniter.php(918): App\Controllers\Daily->index()
#2 C:\xampp\htdocs\weather-web\system\CodeIgniter.php(404): CodeIgniter\CodeIgniter->runController(Object(App\Controllers\Daily))
#3 C:\xampp\htdocs\weather-web\system\CodeIgniter.php(312): CodeIgniter\CodeIgniter->handleRequest(NULL, Object(Config\Cache), false)
#4 C:\xampp\htdocs\weather-web\public\index.php(45): CodeIgniter\CodeIgniter->run()
#5 C:\xampp\htdocs\weather-web\system\Commands\Server\rewrite.php(34): require_once('C:\\xampp\\htdocs...')
#6 {main}
