{
    "function": "divider_with_remainder_2b",
    "cgp_functions": [16,17,18,19,20,21,22,23],
    "inputs": 4,
    "outputs": 4,
    "columns": 10,
    "rows": 10,
    "block_inputs": 3,
    "l_back": 10
}