1 10 20
100 200 125
201 210 89
900 1000 174
84955 91024 333
69875 21526 340
22302 86464 351
14526 66894 340
35106 6279 311
93346 48308 351
43058 39892 306
28614 36017 324
16392 64332 340
57724 30164 340
55374 93483 351
41899 32968 324
45211 32568 324
45399 1659 324
70863 78451 351
87937 57260 351
23157 21849 269
16423 40882 324
4030 38072 324
33747 52201 324
73824 34491 340
11257 17179 276
44861 87083 351
26496 22850 282
37615 64123 340
66179 59452 335
140 64459 340
77277 17273 351
33906 57829 340
98431 84179 333
80069 87893 333
22720 77983 351
61368 39248 340
62533 74892 330
22972 54893 340
47508 28077 324
37231 58712 340
29374 70881 340
77029 45475 340
89772 82479 333
10753 1563 262
74984 46278 340
59075 94703 351
85836 34615 351
7106 36440 324
5469 59793 340
53157 42545 340
11766 61253 340
13541 86794 351
90093 15065 351
519 27881 308
43408 23474 324
55413 78195 351
53198 6251 340
808 47073 324
41948 50335 314
34096 15968 308
61507 78581 351
92097 46622 351
39688 28531 324
11668 57226 340
46860 47988 314
61044 61052 180
83134 71688 351
45217 90030 351
71556 87107 351
31924 5721 308
18855 2839 279
10607 58511 340
80173 10295 351
6295 20305 279
56777 93040 351
80593 73534 351
73701 39018 340
36272 94789 351
24758 36035 324
28164 43999 324
13370 32057 308
48950 86072 351
27113 93117 351
53852 69198 335
19867 85742 351
65039 94374 351
18572 80542 351
27162 92186 351
542 88907 351
10697 86058 351
85813 50487 351
89743 95622 333
16305 13793 271
88135 10684 351
47664 65228 340
59855 54438 322
38286 48922 314
29769 93877 351
39166 87219 351
96192 53036 351
64791 60294 335
44464 69294 340
59232 72650 335
73592 83618 351
94787 53841 351
20040 58329 340
40083 4169 324
98037 89740 333
40541 77199 351
9925 96751 351
71366 81828 351
62624 7428 340
18026 57783 340
14853 13781 271
77638 60581 351
32762 11627 308
31338 43998 324
26064 70475 340
77490 60875 351
58017 78131 351
84972 80270 320
68229 98323 351
57848 1493 340
96877 15635 351
80217 6921 351
58588 21952 340
97975 21669 351
46041 46958 283
92977 34389 351
87619 9018 351
96616 70252 351
77020 52766 335
38286 3966 324
51873 94154 351
41704 52527 340
14580 95690 351
5157 47142 324
69425 6885 340
65538 4169 340
72752 49925 340
90737 52115 351
41405 38404 306
45460 84937 351
26414 5639 282
31649 41397 324
58518 82065 351
69350 13095 340
39516 13652 324
3190 20017 279
11233 80464 351
71811 71514 250
26400 63197 340
96751 85577 333
