1 10 20
100 200 125
201 210 89
900 1000 174
2 1 2
43556 62107 340
78540 10670 351
84717 3800 351
42761 21852 324
33223 89326 351
19979 30377 308
3696 88543 351
55980 9683 340
9985 2139 262
75822 77838 351
23411 36728 324
33806 146868 375
436717 664367 509
81112 293138 443
109156 753449 509
11037 828510 509
101011 491782 449
549985 635669 509
577775 314861 470
551893 756773 509
765035 384033 509
873253 221450 525
141239 758017 509
733149 13740 509
172270 122547 383
445590 875424 525
889261 954283 507
446262 81863 449
35226 70504 340
772918 828154 468
470081 11004 449
584095 202139 470
967465 93045 525
500531 597353 470
132549 468001 449
304398 892569 525
119859 104705 354
334451 123907 443
911844 886027 476
419659 234117 449
650708 440672 509
589539 176192 470
98633 285679 443
297018 832995 509
918644 312849 525
486980 188462 449
309985 509395 449
577630 878610 525
187572 800439 509
268269 265156 345
701155 69093 509
46467 972912 525
949107 97983 525
611239 104450 470
509707 251418 449
933496 352915 525
171110 276800 443
23364 236211 443
345178 930566 525
94007 122750 354
891594 724087 525
997617 70979 525
129329 204163 383
841812 679883 525
785167 957280 525
242088 330570 407
485477 878548 525
898146 807613 525
328342 557757 470
823469 553341 509
988874 801418 525
125798 79627 354
134815 490917 449
468507 183144 449
295994 758544 509
214210 264295 443
328733 220743 443
871527 505854 525
859917 125907 525
297122 87555 443
878618 123194 525
536279 414451 470
803367 165940 509
411742 212731 449
586553 372973 470
100488 272843 443
325655 187682 443
688478 825164 504
254829 655058 509
194431 834249 509
229664 754828 509
843215 949001 507
942733 499708 525
819074 433213 509
130794 747307 509
117047 132395 344
834169 258075 509
434247 619440 470
144728 57217 375
987055 401744 525
279408 580840 470
301416 90979 443
911471 65767 525
459260 511810 444
651382 11019 509
377297 624439 470
394212 355175 436
307551 49116 443
357809 213636 443
191770 395491 443
692776 372989 509
980474 455962 525
1 999999 525
300 400 144
500 600 137
193 937 179
1 10000 262
5000 10000 262
1000 2000 182
2000 3000 217
2000 5000 238
3000 4000 238
5000 6000 236
6000 7000 262
8000 9000 247
9000 10000 260
500 800 171
200 201 27
800 7800 262
9000 200 262
440 470 129
990 1000 112
9900 1000 262
3 20 21
113 170 122
8800 8867 172
700 7600 262
5793 9237 262
4000 4783 215
800 900 179
400 500 142
850 910 179
7000 8500 252
10000 9999 92
4 9 20
80 70 116
349 489 142
678 988 179
5478 7355 262
23 52 112
74 98 119
8328 8389 234
12 33 112
67 8299 262
