1 10 20
100 200 125
201 210 89
900 1000 174
55393 2939 340
56932 8238 340
5920 586 238
697 1 145
560 384 142
492 205 144
696 234 145
25 9342 262
3942 5823 236
5885 23 238
2358 345 183
49235 2 324
23 2 21
2 5 8
123 1323 182
593 39294 324
3 34 112
83 23 116
394 12 144
5829 23924 282
9999 1 262
385 583 142
349 124 144
8587 820 262
800 800 29
212 312 128
582 149 144
9812 123 262
123 52 119
1234 83 182
23 43 112
5692 2 238
794 12 171
53 7594 262
2305 69 183
630 30 144
988 72 179
238 1 128
19238 1 279
1 2 2
958 23 179
5923 12323 268
2345 923 183
3920 12 238
506 23 144
23492 5355 279
3934 832 238
3950 1243 238
5932 9593 262
392 302 144
3959 2030 238
5929 2850 238
5938 8385 262
320 305 131
593 294 144
2958 2093 217
4934 8853 262
3492 832 217
3942 95 238
32 6939 262
23 5932 238
2394 394 183
2934 239 217
692 60 145
29 1 112
594 293 144
5932 203 238
683 250 145
2394 205 183
23925 23 282
4395 239 238
34295 594 311
239 234 128
5960 23 238
5923 2340 238
3420 234 217
6938 192 262
5920 582 238
285 1953 182
32850 12 308
5395 934 238
59238 5923 340
592 234 144
49 2 112
3592 53 217
392 682 145
592 34 144
295 2 128
692 34 145
9523 23 262
5923 5923 37
869 286 171
293 234 128
694 2 145
5968 60 238
295 2394 183
2852 2344 209
697 494 145
6938 402 262
9348 4952 262
596 230 144
1 999999 525
