........................
----------------------------------------------------------------------
Ran 24 tests in 0.256s

OK
Name             Stmts   Miss Branch BrPart  Cover   Missing
------------------------------------------------------------
Collatz.py          50      0     16      0   100%
TestCollatz.py     102      0      0      0   100%
------------------------------------------------------------
TOTAL              152      0     16      0   100%
