1 10 20
100 200 125
201 210 89
900 1000 174
15 20 21
535 570 137
600 1000 179
1000 500 179
265 1000 179
5000 8000 262
9000 9999 260
1 75 116
5 20 21
16 2345 183
18 1800 182
1000 2000 182
974 988 143
12 3 20
1 67 113
1 543 144
2 72 113
3 456 144
1234 1678 180
1456 2134 180
254 2222 182
1234 9761 262
12 2000 182
3 5000 238
500 3000 217
3000 3500 199
3456 7654 262
123 1230 182
72 77 116
79 910 179
1900 2900 209
7500 6500 257
2332 3456 217
90 9979 262
45 62 113
79 800 171
546 2177 182
4500 6500 262
3900 4900 215
647 3245 217
2389 6473 262
1 10000 262
689 1 145
49 987 179
992 1900 182
1992 3289 217
3000 4000 238
5000 5071 179
34 400 144
69 700 145
980 4567 238
65 765 171
8000 8100 190
9234 9765 260
9765 9999 242
7569 9000 252
3333 4444 238
5555 7777 262
23 4444 238
32 7400 262
65 1200 182
63 75 116
891 3200 217
739 3894 238
234 854 171
46 425 144
323 544 144
465 653 145
2355 8433 262
564 465 142
25 456 144
234 569 144
694 9000 262
53 87 116
87 1 116
46 493 144
2345 3855 238
2476 5923 238
583 685 145
645 743 171
674 354 145
74 25 116
744 8 171
8 870 171
20 2500 209
56 5630 238
43 127 119
60 6000 238
1 999999 525
800000 999999 525
100000 200000 383
125678 345678 443
45680 100000 351
70000 200000 383
56799 150000 375
300 400 144
500 1 144
234 9111 262