1
12
testnet_sorting-0 testnet_sorting-sort-2-2-e8e521 testnet_sorting-sort-4-2-fb97d4 testnet_sorting-sort-4-4-cf6a65 testnet_sorting-sort-8-2-e6f459 testnet_sorting-sort-8-4-4f65d4 testnet_sorting-sort-8-8-bad640 testnet_sorting-sort-16-2-e61a44 testnet_sorting-sort-16-4-af1992 testnet_sorting-sort-16-8-78de58 testnet_sorting-sort-16-16-19c78d testnet_sorting-1
1 0
1 1
1 2
1 3
1 4
1 5
1 6
1 7
1 8
1 9
1 10
1 11
0
./compile.py Programs/testnet/testnet_sorting/
