<?xml version="1.0" encoding="UTF-8"?>
<Project>
   <description></description>
   <name>LiaTest</name>
   <tag></tag>
   <UUID>3676c00f-2667-47f0-b01b-f4da397d0af3</UUID>
   <migratedVersion>5.4.0</migratedVersion>
   <pageLoadTimeout>0</pageLoadTimeout>
</Project>
