<svg width="21" height="18" viewBox="0 0 21 18" fill="none" xmlns="http://www.w3.org/2000/svg">
<path fill-rule="evenodd" clip-rule="evenodd" d="M13.1816 12.4959C10.2001 14.6498 5.8357 14.4803 3.07181 11.9873C0.10627 9.31254 0.10627 4.97583 3.07181 2.30103C6.03736 -0.373779 10.8455 -0.373779 13.811 2.30103C16.5749 4.79394 16.7628 8.73041 14.3749 11.4197L20.1749 16.6511C20.5044 16.9483 20.5044 17.4302 20.1749 17.7274C19.8454 18.0246 19.3112 18.0246 18.9817 17.7274L13.1816 12.4959ZM4.26506 10.9111C1.95852 8.83069 1.95852 5.45769 4.26506 3.37728C6.57159 1.29688 10.3112 1.29688 12.6178 3.37728C14.9226 5.45616 14.9243 8.82574 12.6228 10.9065C12.6211 10.908 12.6194 10.9095 12.6177 10.9111C12.616 10.9126 12.6144 10.9141 12.6127 10.9157C10.3057 12.9915 6.5699 12.99 4.26506 10.9111Z" fill="#8E8E8E"/>
</svg>
