<svg width="50" height="50" viewBox="0 0 50 50" fill="none" xmlns="http://www.w3.org/2000/svg">
<ellipse cx="24.8148" cy="25" rx="24.3226" ry="25" fill="#DCE9FF"/>
<path fill-rule="evenodd" clip-rule="evenodd" d="M19.7508 15.2775C19.7508 13.168 21.4145 11.458 23.4668 11.458H26.1693C28.2215 11.458 29.8852 13.168 29.8852 15.2775V18.0552C29.8852 18.6305 29.4315 19.0969 28.8718 19.0969H20.7642C20.2045 19.0969 19.7508 18.6305 19.7508 18.0552V15.2775ZM23.4668 13.5413C22.5339 13.5413 21.7777 14.3186 21.7777 15.2775V17.0136H27.8583V15.2775C27.8583 14.3186 27.1021 13.5413 26.1693 13.5413H23.4668Z" fill="#4588FD"/>
<path fill-rule="evenodd" clip-rule="evenodd" d="M17.3684 15.1785C17.5393 15.0943 17.7289 15.2283 17.7286 15.423L17.7239 18.0552C17.7239 19.7811 19.0851 21.1802 20.7642 21.1802H28.8718C30.5509 21.1802 31.9121 19.7811 31.9121 18.0552V15.4223C31.9121 15.2278 32.1016 15.0941 32.2723 15.1782C33.8737 15.9673 34.9524 17.648 34.9524 19.5628V34.1315C34.9524 36.5075 33.2305 38.5115 30.9366 38.8052C26.8732 39.3253 22.7628 39.3253 18.6995 38.8052C16.4055 38.5115 14.6836 36.5075 14.6836 34.1315V19.5628C14.6836 17.6482 15.7668 15.9677 17.3684 15.1785ZM28.8718 24.9997C29.4315 24.9997 29.8852 25.466 29.8852 26.0413C29.8852 26.6166 29.4315 27.083 28.8718 27.083H20.7642C20.2045 27.083 19.7508 26.6166 19.7508 26.0413C19.7508 25.466 20.2045 24.9997 20.7642 24.9997H28.8718ZM27.5205 29.1663C28.0802 29.1663 28.534 29.6327 28.534 30.208C28.534 30.7833 28.0802 31.2497 27.5205 31.2497H20.7642C20.2045 31.2497 19.7508 30.7833 19.7508 30.208C19.7508 29.6327 20.2045 29.1663 20.7642 29.1663H27.5205Z" fill="#4588FD"/>
</svg>
