{
    "$schema": "https://zed.dev/schema/themes/v0.1.0.json",
    "name": "Struct Theme",
    "author": "Struct",
    "themes": [
        {
            "name": "Struct",
            "appearance": "dark",
            "style": {
                "border": "#222",
                "border.variant": "#222",
                "border.focused": "#222",
                "border.selected": "#222",
                "border.transparent": "#0000",
                "border.disabled": "#222",
                "elevated_surface.background": "#080808ee",
                "surface.background": "#0000",
                "background": "#080808dd",
                "background.appearance": "blurred",
                "element.background": "#0000",
                "element.hover": "#0000",
                "element.active": "#0000",
                "element.selected": "#0000",
                "element.disabled": "#0000",
                "drop_target.background": "#ffffff10",
                "ghost_element.background": "#0000",
                "ghost_element.hover": "#ffffff08",
                "ghost_element.active": "#222",
                "ghost_element.selected": "#222",
                "ghost_element.disabled": "#0000",
                "text": "#666",
                "text.muted": "#666",
                "text.placeholder": "#666",
                "text.disabled": "#666",
                "text.accent": "#666",
                "icon": "666",
                "icon.muted": "#666",
                "icon.disabled": "#666",
                "icon.placeholder": "#666",
                "icon.accent": "#666",
                "status_bar.background": "#121212",
                "title_bar.background": "#121212",
                "toolbar.background": "#121212",
                "tab_bar.background": "#121212",
                "tab.inactive_background": "#121212",
                "tab.active_background": "#222",
                "search.match_background": "#ffffff20",
                "panel.background": "#121212",
                "panel.focused_border": null,
                "pane.focused_border": null,
                "scrollbar.thumb.background": "#ffffff10",
                "scrollbar.thumb.hover_background": "#0000",
                "scrollbar.thumb.border": "#0003",
                "scrollbar.track.background": "#0000",
                "scrollbar.track.border": "#ffffff08",
                "editor.foreground": "#bebebe",
                "editor.background": "#0000",
                "editor.gutter.background": "#0000",
                "editor.subheader.background": "#0000",
                "editor.active_line.background": "#ffffff08",
                "editor.highlighted_line.background": "#0000",
                "editor.line_number": "#444",
                "editor.active_line_number": "#bebebe",
                "editor.invisible": "#444",
                "editor.wrap_guide": "#ffffff10",
                "editor.active_wrap_guide": "#ffffff10",
                "editor.document_highlight.read_background": "#0000",
                "editor.document_highlight.write_background": "#0000",
                "terminal.background": "#080808",
                "terminal.foreground": "#bebebe",
                "terminal.bright_foreground": "#bebebe",
                "terminal.dim_foreground": "#bebebe",
                "terminal.ansi.black": "#1d2021ff",
                "terminal.ansi.bright_black": "#73675eff",
                "terminal.ansi.dim_black": "#fbf1c7ff",
                "terminal.ansi.red": "#fb4a35ff",
                "terminal.ansi.bright_red": "#93201dff",
                "terminal.ansi.dim_red": "#ffaa95ff",
                "terminal.ansi.green": "#b7bb26ff",
                "terminal.ansi.bright_green": "#605c1bff",
                "terminal.ansi.dim_green": "#e0dc98ff",
                "terminal.ansi.yellow": "#f9bd2fff",
                "terminal.ansi.bright_yellow": "#91611bff",
                "terminal.ansi.dim_yellow": "#fedc9bff",
                "terminal.ansi.blue": "#83a598ff",
                "terminal.ansi.bright_blue": "#414f4aff",
                "terminal.ansi.dim_blue": "#c0d2cbff",
                "terminal.ansi.magenta": "#a89984ff",
                "terminal.ansi.bright_magenta": "#514a41ff",
                "terminal.ansi.dim_magenta": "#d2cabfff",
                "terminal.ansi.cyan": "#8ec07cff",
                "terminal.ansi.bright_cyan": "#45603eff",
                "terminal.ansi.dim_cyan": "#c7dfbdff",
                "terminal.ansi.white": "#fbf1c7ff",
                "terminal.ansi.bright_white": "#fbf1c7ff",
                "terminal.ansi.dim_white": "#b0a189ff",
                "link_text.hover": "#bebebe",
                "conflict": "#f03",
                "conflict.background": "#ff003308",
                "conflict.border": "#f03",
                "created": "#bb2",
                "created.background": "#bbbb2208",
                "created.border": "bb2",
                "deleted": "#f03",
                "deleted.background": "#ff003308",
                "deleted.border": "#f03",
                "error": "#f03",
                "error.background": "#ff003308",
                "error.border": "#f03",
                "hidden": "#444",
                "hidden.background": "#44444408",
                "hidden.border": "#444",
                "hint": "#666",
                "hint.background": "#080808ee",
                "hint.border": "#222",
                "ignored": "#444",
                "ignored.background": "#44444408",
                "ignored.border": "#444",
                "info": "#666",
                "info.background": "#080808ee",
                "info.border": "#222",
                "modified": "#fa0",
                "modified.background": "#ffaa0008",
                "modified.border": "#fa0",
                "predictive": "#666",
                "predictive.background": "#66666608",
                "predictive.border": "#666",
                "renamed": "#bb2",
                "renamed.background": "#bbbb2208",
                "renamed.border": "#bb2",
                "success": "#bb2",
                "success.background": "#bbbb2208",
                "success.border": "#bb2",
                "unreachable": "#f03",
                "unreachable.background": "#ff003308",
                "unreachable.border": "#f03",
                "warning": "#fa0",
                "warning.background": "ffaa0008",
                "warning.border": "#fa0",
                "players": [
                    {"cursor": "#bebebe", "background": "#ffffff08", "selection": "#ffffff10"},
                    {"cursor": "#a89984ff", "background": "#a89984ff", "selection": "#a899843d"},
                    {"cursor": "#fd801bff", "background": "#fd801bff", "selection": "#fd801b3d"},
                    {"cursor": "#d3869bff", "background": "#d3869bff", "selection": "#d3869b3d"},
                    {"cursor": "#8ec07cff", "background": "#8ec07cff", "selection": "#8ec07c3d"},
                    {"cursor": "#fb4a35ff", "background": "#fb4a35ff", "selection": "#fb4a353d"},
                    {"cursor": "#f9bd2fff", "background": "#f9bd2fff", "selection": "#f9bd2f3d"},
                    {"cursor": "#b7bb26ff", "background": "#b7bb26ff", "selection": "#b7bb263d"}
                ],
                "syntax": {
                    "attribute": {"color": "#bebebe", "font_style": null, "font_weight": null},
                    "boolean": {"color": "#fa0", "font_style": null, "font_weight": null},
                    "comment": {"color": "#444", "font_style": "italic", "font_weight": null},
                    "comment.doc": {"color": "#444","font_style": "italic", "font_weight": null},
                    "constant": {"color": "#fa0", "font_style": null, "font_weight": null},
                    "constructor": {"color": "#bebebe", "font_style": null, "font_weight": null},
                    "embedded": {"color": "#bebebe", "font_style": null,"font_weight": null},
                    "emphasis": {"color": "#bebebe", "font_style": null, "font_weight": null},
                    "emphasis.strong": {"color": "#bebebe", "font_style": null, "font_weight": 700},
                    "enum": {"color": "#fa0", "font_style": null, "font_weight": null},
                    "function": {"color": "#bb2", "font_style": null, "font_weight": null},
                    "function.builtin": {"color": "#bb2", "font_style": null, "font_weight": null},
                    "hint": {"color": "#bebebe", "font_style": null, "font_weight": 700},
                    "keyword": {"color": "#f03", "font_style": null, "font_weight": null},
                    "label": {"color": "#bebebe", "font_style": null, "font_weight": null},
                    "link_text": {"color": "#bebebe", "font_style": "italic", "font_weight": null},
                    "link_uri": {"color": "#bebebe", "font_style": null, "font_weight": null},
                    "number": {"color": "#fa0", "font_style": null, "font_weight": null},
                    "operator": {"color": "#bebebe", "font_style": null, "font_weight": null},
                    "predictive": {"color": "#bebebe", "font_style": "italic", "font_weight": null},
                    "preproc": {"color": "#bebebe", "font_style": null, "font_weight": null},
                    "primary": {"color": "#bebebe", "font_style": null, "font_weight": null},
                    "property": {"color": "#bebebe", "font_style": null, "font_weight": null},
                    "punctuation": {"color": "#bebebe", "font_style": null, "font_weight": null},
                    "punctuation.bracket": {"color": "#bebebe", "font_style": null, "font_weight": null},
                    "punctuation.delimiter": {"color": "#bebebe", "font_style": null, "font_weight": null},
                    "punctuation.list_marker": {"color": "#bebebe", "font_style": null, "font_weight": null},
                    "punctuation.special": {"color": "#bebebe", "font_style": null, "font_weight": null},
                    "string": {"color": "#bb2", "font_style": null, "font_weight": null},
                    "string.escape": {"color": "#bebebe", "font_style": null, "font_weight": null},
                    "string.regex": {"color": "#bb2", "font_style": null, "font_weight": null},
                    "string.special": {"color": "#bb2", "font_style": null, "font_weight": null},
                    "string.special.symbol": {"color": "#bb2", "font_style": null, "font_weight": null},
                    "tag": {"color": "#bebebe", "font_style": null, "font_weight": null},
                    "text.literal": {"color": "#bebebe", "font_style": null, "font_weight": null},
                    "title": {"color": "#bebebe", "font_style": null, "font_weight": 700},
                    "type": {"color": "#fa0", "font_style": null, "font_weight": null},
                    "variable": {"color": "#bebebe", "font_style": null, "font_weight": null},
                    "variant": {"color": "#bebebe", "font_style": null, "font_weight": null}
                }
            }
        }
    ]
}
