<?xml version="1.0" encoding="UTF-8"?>
<svg width="24mm" height="24mm" version="1.1" viewBox="0 0 24 24" xmlns="http://www.w3.org/2000/svg">
<path d="m9.525 11.176-2.7013-4.8264 9.0513-3.6867 2.1167 2.6283 4.781 8.4667-7.956 5.2917h-8.4667l-2.9104-6.8792z" fill="none" stroke="#000" stroke-linejoin="round" stroke-width=".52917"/>
</svg>
