{
    "databaseHost": "localhost",
    "databasePort": "3306",
    "databaseUser": "xxxadmindbxxx",
    "databasePassword": "xxx1234xxx",
    "database": "temperature",
    "mqttBroker": "localhost",
    "mqttPort": "1883",
    "measuringInterval": "7.0", 
    "webSocketPort" : "3000",
    "mailPassword":"xxxx xxxx xxxx xxxx",
    "fromMailAddress" : "xxxxxxxxx@gmail.com",
    "mailService" : "gmail",
    "api" : "xxxxxxxxxxxxx"
   }
   
