   1        0.0000000      0.0000000      0.0000000     2.00000    -1868.84456     2.00000    -1868.84607     2.00000     -152.51799     2.00000     -152.44423     2.00000     -102.04530     2.00000     -102.04530     2.00000     -102.04528     2.00000     -102.02022     2.00000     -102.02021     2.00000     -102.02018     2.00000      -12.46295     2.00000       -0.67650     2.00000       -0.67532     2.00000       -0.67522     0.00000        2.50590     0.00000        2.50650     0.00000        2.50711     0.00000        3.29228     0.00000        8.04971     0.00000        8.05291     0.00000        8.41721     0.00000       11.88458     0.00000       11.88933     0.00000       11.88957
   2        0.0555556      0.0000000      0.0555556     2.00000    -1868.84660     2.00000    -1868.84777     2.00000     -152.51493     2.00000     -152.44250     2.00000     -102.04631     2.00000     -102.04629     2.00000     -102.04782     2.00000     -102.02281     2.00000     -102.02066     2.00000     -102.02062     2.00000      -12.40898     2.00000       -0.98544     2.00000       -0.85282     2.00000       -0.85167     0.00000        2.35967     0.00000        2.74795     0.00000        2.74881     0.00000        3.54446     0.00000        7.67183     0.00000        8.12891     0.00000        8.57363     0.00000       12.00918     0.00000       12.01401     0.00000       12.26379
   3        0.1111111      0.0000000      0.1111111     2.00000    -1868.84907     2.00000    -1868.84975     2.00000     -152.51172     2.00000     -152.44246     2.00000     -102.04737     2.00000     -102.04735     2.00000     -102.04991     2.00000     -102.02603     2.00000     -102.02110     2.00000     -102.02107     2.00000      -12.24399     2.00000       -1.82924     2.00000       -1.33048     2.00000       -1.32956     0.00000        1.99680     0.00000        3.43887     0.00000        3.44013     0.00000        4.17338     0.00000        6.96257     0.00000        8.33672     0.00000        9.09060     0.00000       12.34684     0.00000       12.35148     0.00000       13.11436
   4        0.1666667      0.0000000      0.1666667     2.00000    -1868.84860     2.00000    -1868.84898     2.00000     -152.51172     2.00000     -152.44704     2.00000     -102.04753     2.00000     -102.04751     2.00000     -102.04793     2.00000     -102.02648     2.00000     -102.02096     2.00000     -102.02093     2.00000      -11.97409     2.00000       -2.87085     2.00000       -1.89643     2.00000       -1.89578     0.00000        1.56199     0.00000        4.35809     0.00000        4.35986     0.00000        4.33488     0.00000        6.87577     0.00000        8.63170     0.00000        9.94778     0.00000       12.83529     0.00000       12.83947     0.00000       14.10969
   5        0.2222222      0.0000000      0.2222222     2.00000    -1868.84617     2.00000    -1868.84643     2.00000     -152.51311     2.00000     -152.45550     2.00000     -102.04717     2.00000     -102.04715     2.00000     -102.04324     2.00000     -102.02489     2.00000     -102.02025     2.00000     -102.02023     2.00000      -11.63288     2.00000       -3.81680     2.00000       -2.38800     2.00000       -2.38750     0.00000        1.17128     0.00000        3.61824     0.00000        5.29620     0.00000        5.29849     0.00000        7.70858     0.00000        9.00578     0.00000       10.99846     0.00000       13.39713     0.00000       13.40028     0.00000       15.08315
   6        0.2777778      0.0000000      0.2777778     2.00000    -1868.84621     2.00000    -1868.84631     2.00000     -152.50813     2.00000     -152.46074     2.00000     -102.04778     2.00000     -102.04777     2.00000     -102.04215     2.00000     -102.02652     2.00000     -102.02007     2.00000     -102.02005     2.00000      -11.24020     2.00000       -4.63942     2.00000       -2.76242     2.00000       -2.76200     0.00000        0.87716     0.00000        2.74284     0.00000        6.18364     0.00000        6.18643     0.00000        8.72717     0.00000        9.49650     0.00000       12.10206     0.00000       13.86600     0.00000       13.86697     0.00000       16.04441
   7        0.3333333      0.0000000      0.3333333     2.00000    -1868.84884     2.00000    -1868.84867     2.00000     -152.49851     2.00000     -152.46161     2.00000     -102.04918     2.00000     -102.04917     2.00000     -102.04419     2.00000     -102.03142     2.00000     -102.02047     2.00000     -102.02045     2.00000      -10.71697     2.00000       -5.63531     2.00000       -3.09150     2.00000       -3.09117     0.00000        0.63331     0.00000        1.95907     0.00000        7.19491     0.00000        7.19821     0.00000        9.89202     0.00000       10.15216     0.00000       13.15065     0.00000       13.77702     0.00000       13.77944     0.00000       16.71975
   8        0.3888889      0.0000000      0.3888889     2.00000    -1868.84961     2.00000    -1868.84930     2.00000     -152.49209     2.00000     -152.46567     2.00000     -102.04982     2.00000     -102.04981     2.00000     -102.04315     2.00000     -102.03420     2.00000     -102.02041     2.00000     -102.02039     2.00000      -10.04147     2.00000       -6.71082     2.00000       -3.36270     2.00000       -3.36242     0.00000        0.47121     0.00000        1.32585     0.00000        8.31574     0.00000        8.31949     0.00000       10.95573     0.00000       11.13958     0.00000       12.95572     0.00000       12.95986     0.00000       13.84560     0.00000       15.30663
   9        0.4444444      0.0000000      0.4444444     2.00000    -1868.84744     2.00000    -1868.84718     2.00000     -152.48924     2.00000     -152.47470     2.00000     -102.04954     2.00000     -102.04953     2.00000     -102.03824     2.00000     -102.03378     2.00000     -102.01979     2.00000     -102.01978     2.00000       -9.27484     2.00000       -7.69392     2.00000       -3.53633     2.00000       -3.53608     0.00000        0.44582     0.00000        0.86633     0.00000        9.42374     0.00000        9.42759     0.00000       11.87044     0.00000       11.89581     0.00000       11.90000     0.00000       12.31351     0.00000       14.01581     0.00000       13.84820
  10        0.5000000      0.0000000      0.5000000     2.00000    -1868.84549     2.00000    -1868.84549     2.00000     -152.48529     2.00000     -152.48529     2.00000     -102.04904     2.00000     -102.04904     2.00000     -102.03341     2.00000     -102.03341     2.00000     -102.01921     2.00000     -102.01921     2.00000       -8.51060     2.00000       -8.51039     2.00000       -3.59486     2.00000       -3.59460     0.00000        0.57675     0.00000        0.57705     0.00000       10.13217     0.00000       10.13232     0.00000       11.18643     0.00000       11.18644     0.00000       12.87812     0.00000       12.87820     0.00000       13.25854     0.00000       13.25891
