   1        0.3750000      0.3750000      0.7500000     2.00000       -8.85704     2.00000       -7.89700     2.00000       -5.02970     2.00000       -3.18381     0.00000        0.97432     0.00000        3.91365     0.00000        7.26959     0.00000        7.77047     0.00000        7.96184     0.00000        8.46865     0.00000       14.59235
   2        0.3529412      0.3529412      0.7058824     2.00000       -9.07117     2.00000       -7.68211     2.00000       -5.12989     2.00000       -3.02527     0.00000        1.15950     0.00000        4.81732     0.00000        6.74184     0.00000        7.22070     0.00000        7.54102     0.00000        8.01395     0.00000       14.90983
   3        0.3308824      0.3308824      0.6617647     2.00000       -9.33212     2.00000       -7.43025     2.00000       -5.13446     2.00000       -2.84582     0.00000        1.36910     0.00000        5.68543     0.00000        6.23353     0.00000        6.77564     0.00000        7.13646     0.00000        7.59237     0.00000       14.73066
   4        0.3088235      0.3088235      0.6176471     2.00000       -9.62398     2.00000       -7.14383     2.00000       -5.04652     2.00000       -2.64994     0.00000        1.59807     0.00000        5.75029     0.00000        5.91801     0.00000        6.75809     0.00000        7.01609     0.00000        7.21141     0.00000       14.24029
   5        0.2867647      0.2867647      0.5735294     2.00000       -9.93453     2.00000       -6.82043     2.00000       -4.88280     2.00000       -2.44271     0.00000        1.83934     0.00000        5.29572     0.00000        5.53828     0.00000        6.41514     0.00000        6.87919     0.00000        7.91084     0.00000       13.75674
   6        0.2647059      0.2647059      0.5294118     2.00000      -10.24924     2.00000       -6.46164     2.00000       -4.65857     2.00000       -2.23043     0.00000        2.08348     0.00000        4.87237     0.00000        5.11765     0.00000        6.11853     0.00000        6.60295     0.00000        8.85804     0.00000       13.29533
   7        0.2426471      0.2426471      0.4852941     2.00000      -10.55509     2.00000       -6.07213     2.00000       -4.38285     2.00000       -2.01840     0.00000        2.31805     0.00000        4.48307     0.00000        4.71589     0.00000        5.87767     0.00000        6.38815     0.00000        9.72649     0.00000       12.62428
   8        0.2205882      0.2205882      0.4411765     2.00000      -10.84868     2.00000       -5.64545     2.00000       -4.06280     2.00000       -1.80959     0.00000        2.52683     0.00000        4.12635     0.00000        4.33871     0.00000        5.69953     0.00000        6.23985     0.00000       10.38442     0.00000       11.62117
   9        0.1985294      0.1985294      0.3970588     2.00000      -11.12372     2.00000       -5.18308     2.00000       -3.70334     2.00000       -1.60818     0.00000        2.69128     0.00000        3.80008     0.00000        3.98797     0.00000        5.58947     0.00000        6.16292     0.00000       10.63018     0.00000       10.67551
  10        0.1764706      0.1764706      0.3529412     2.00000      -11.37486     2.00000       -4.69201     2.00000       -3.31240     2.00000       -1.41911     0.00000        2.79613     0.00000        3.50443     0.00000        3.66836     0.00000        5.53845     0.00000        6.16135     0.00000        9.70574     0.00000       10.60244
  11        0.1544118      0.1544118      0.3088235     2.00000      -11.60172     2.00000       -4.16811     2.00000       -2.90225     2.00000       -1.24812     0.00000        2.83711     0.00000        3.23913     0.00000        3.38533     0.00000        5.50531     0.00000        6.23842     0.00000        8.87831     0.00000       10.30695
  12        0.1323529      0.1323529      0.2647059     2.00000      -11.80028     2.00000       -3.62245     2.00000       -2.48565     2.00000       -1.10189     0.00000        2.82563     0.00000        3.00629     0.00000        3.14016     0.00000        5.40442     0.00000        6.39186     0.00000        8.22381     0.00000        9.90124
  13        0.1102941      0.1102941      0.2205882     2.00000      -11.96875     2.00000       -3.06365     2.00000       -2.07490     2.00000       -0.98354     0.00000        2.78018     0.00000        2.81033     0.00000        2.93005     0.00000        5.12711     0.00000        6.61263     0.00000        7.82613     0.00000        9.45486
  14        0.0882353      0.0882353      0.1764706     2.00000      -12.10853     2.00000       -2.48366     2.00000       -1.68144     2.00000       -0.89369     0.00000        2.65202     0.00000        2.71505     0.00000        2.75096     0.00000        4.64613     0.00000        6.88744     0.00000        7.67715     0.00000        9.02016
  15        0.0661765      0.0661765      0.1323529     2.00000      -12.21796     2.00000       -1.90624     2.00000       -1.32267     2.00000       -0.83109     0.00000        2.53068     0.00000        2.59715     0.00000        2.64198     0.00000        4.06764     0.00000        7.19104     0.00000        7.67863     0.00000        8.64757
  16        0.0441176      0.0441176      0.0882353     2.00000      -12.29657     2.00000       -1.36929     2.00000       -1.02812     2.00000       -0.79158     0.00000        2.44475     0.00000        2.47274     0.00000        2.55993     0.00000        3.52139     0.00000        7.48350     0.00000        7.73239     0.00000        8.37808
  17        0.0220588      0.0220588      0.0441176     2.00000      -12.34445     2.00000       -0.93907     2.00000       -0.83372     2.00000       -0.77143     0.00000        2.39051     0.00000        2.39497     0.00000        2.44517     0.00000        3.14597     0.00000        7.70908     0.00000        7.77971     0.00000        8.22792
  18        0.0000000      0.0000000      0.0000000     2.00000      -12.36054     2.00000       -0.76598     2.00000       -0.76598     2.00000       -0.76598     0.00000        2.37050     0.00000        2.37050     0.00000        2.37050     0.00000        3.02925     0.00000        7.79697     0.00000        7.79697     0.00000        8.18291
