   1        0.0000000      0.0000000      0.0000000     2.00000      -12.24974     2.00000       -0.51273     2.00000       -0.51273     2.00000       -0.51273     0.00000        2.63834     0.00000        2.63834     0.00000        2.63834     0.00000        3.32191     0.00000        8.19568     0.00000        8.19568     0.00000        8.49418
   2        0.0312500      0.0000000      0.0312500     2.00000      -12.23353     2.00000       -0.63080     2.00000       -0.58159     2.00000       -0.58159     0.00000        2.59297     0.00000        2.72911     0.00000        2.72911     0.00000        3.43212     0.00000        8.06955     0.00000        8.21515     0.00000        8.54451
   3        0.0625000      0.0000000      0.0625000     2.00000      -12.18509     2.00000       -0.94788     2.00000       -0.76801     2.00000       -0.76801     0.00000        2.46505     0.00000        2.98062     0.00000        2.98062     0.00000        3.72655     0.00000        7.74478     0.00000        8.27184     0.00000        8.70610
   4        0.0937500      0.0000000      0.0937500     2.00000      -12.10540     2.00000       -1.37998     2.00000       -1.02474     2.00000       -1.02473     0.00000        2.27598     0.00000        3.34254     0.00000        3.34254     0.00000        4.10393     0.00000        7.33882     0.00000        8.36342     0.00000        8.99057
   5        0.1250000      0.0000000      0.1250000     2.00000      -11.99545     2.00000       -1.86360     2.00000       -1.30881     2.00000       -1.30881     0.00000        2.05069     0.00000        3.76966     0.00000        3.76966     0.00000        4.42160     0.00000        6.99591     0.00000        8.49085     0.00000        9.39126
   6        0.1562500      0.0000000      0.1562500     2.00000      -11.85400     2.00000       -2.38766     2.00000       -1.60083     2.00000       -1.60083     0.00000        1.80854     0.00000        4.24584     0.00000        4.24584     0.00000        4.50502     0.00000        6.90510     0.00000        8.65715     0.00000        9.89107
   7        0.1875000      0.0000000      0.1875000     2.00000      -11.67954     2.00000       -2.94807     2.00000       -1.89190     2.00000       -1.89189     0.00000        1.56526     0.00000        4.26682     0.00000        4.76475     0.00000        4.76475     0.00000        7.17504     0.00000        8.86276     0.00000       10.46807
   8        0.2187500      0.0000000      0.2187500     2.00000      -11.47376     2.00000       -3.51828     2.00000       -2.16859     2.00000       -2.16859     0.00000        1.33719     0.00000        3.83035     0.00000        5.30822     0.00000        5.30822     0.00000        7.68565     0.00000        9.10510     0.00000       11.09718
   9        0.2500000      0.0000000      0.2500000     2.00000      -11.23932     2.00000       -4.08139     2.00000       -2.42048     2.00000       -2.42048     0.00000        1.13478     0.00000        3.33270     0.00000        5.86143     0.00000        5.86143     0.00000        8.29931     0.00000        9.38344     0.00000       11.75478
  10        0.2812500      0.0000000      0.2812500     2.00000      -10.97436     2.00000       -4.64425     2.00000       -2.64647     2.00000       -2.64647     0.00000        0.95937     0.00000        2.84076     0.00000        6.42588     0.00000        6.42588     0.00000        8.95830     0.00000        9.70058     0.00000       12.41871
  11        0.3125000      0.0000000      0.3125000     2.00000      -10.67675     2.00000       -5.21013     2.00000       -2.84712     2.00000       -2.84712     0.00000        0.81090     0.00000        2.38310     0.00000        7.00578     0.00000        7.00578     0.00000        9.64113     0.00000       10.05818     0.00000       13.05693
  12        0.3437500      0.0000000      0.3437500     2.00000      -10.35031     2.00000       -5.76482     2.00000       -3.01858     2.00000       -3.01857     0.00000        0.69421     0.00000        1.97318     0.00000        7.59458     0.00000        7.59458     0.00000       10.32660     0.00000       10.45423     0.00000       13.61570
  13        0.3750000      0.0000000      0.3750000     2.00000       -9.99957     2.00000       -6.30046     2.00000       -3.15787     2.00000       -3.15787     0.00000        0.61518     0.00000        1.61718     0.00000        8.18550     0.00000        8.18550     0.00000       10.88733     0.00000       10.99747     0.00000       13.30635
  14        0.4062500      0.0000000      0.4062500     2.00000       -9.62195     2.00000       -6.82541     2.00000       -3.26636     2.00000       -3.26636     0.00000        0.57712     0.00000        1.31609     0.00000        8.77933     0.00000        8.77933     0.00000       11.35959     0.00000       11.64948     0.00000       12.75383
  15        0.4375000      0.0000000      0.4375000     2.00000       -9.21319     2.00000       -7.34381     2.00000       -3.34553     2.00000       -3.34553     0.00000        0.58205     0.00000        1.06886     0.00000        9.36997     0.00000        9.36997     0.00000       11.87237     0.00000       12.16471     0.00000       12.16471
  16        0.4687500      0.0000000      0.4687500     2.00000       -8.77752     2.00000       -7.84559     2.00000       -3.39422     2.00000       -3.39422     0.00000        0.63209     0.00000        0.87387     0.00000        9.91339     0.00000        9.91339     0.00000       11.61189     0.00000       11.61189     0.00000       12.42351
  17        0.5000000      0.0000000      0.5000000     2.00000       -8.32237     2.00000       -8.32237     2.00000       -3.41069     2.00000       -3.41069     0.00000        0.72890     0.00000        0.72891     0.00000       10.20138     0.00000       10.20138     0.00000       11.31469     0.00000       11.31469     0.00000       13.01166
