   1        0.0000000      0.0000000      0.0000000     2.00000    -1866.25837     2.00000    -1866.25721     2.00000     -151.41689     2.00000     -151.37826     2.00000     -102.04473     2.00000     -102.04473     2.00000     -102.04473     2.00000     -102.03688     2.00000     -102.03688     2.00000     -102.03687     2.00000      -12.31506     2.00000       -0.71281     2.00000       -0.71165     2.00000       -0.71156     0.00000        2.40921     0.00000        2.40980     0.00000        2.41038     0.00000        3.12731     0.00000        7.87890     0.00000        7.88206     0.00000        7.90937     0.00000       11.70873     0.00000       11.71320     0.00000       11.71349
   2        0.0555556      0.0000000      0.0555556     2.00000    -1866.25668     2.00000    -1866.25548     2.00000     -151.41301     2.00000     -151.37514     2.00000     -102.04591     2.00000     -102.04591     2.00000     -102.04898     2.00000     -102.04089     2.00000     -102.03725     2.00000     -102.03724     2.00000      -12.26086     2.00000       -1.01649     2.00000       -0.88476     2.00000       -0.88362     0.00000        2.26438     0.00000        2.64422     0.00000        2.64506     0.00000        3.36842     0.00000        7.51019     0.00000        7.95889     0.00000        8.08466     0.00000       11.79607     0.00000       11.80062     0.00000       12.00451
   3        0.1111111      0.0000000      0.1111111     2.00000    -1866.25455     2.00000    -1866.25335     2.00000     -151.40942     2.00000     -151.37298     2.00000     -102.04742     2.00000     -102.04742     2.00000     -102.05310     2.00000     -102.04523     2.00000     -102.03740     2.00000     -102.03739     2.00000      -12.09601     2.00000       -1.84616     2.00000       -1.35123     2.00000       -1.35032     0.00000        1.90262     0.00000        3.31744     0.00000        3.31867     0.00000        3.96934     0.00000        6.79311     0.00000        8.16855     0.00000        8.59396     0.00000       12.04223     0.00000       12.04660     0.00000       12.62888
   4        0.1666667      0.0000000      0.1666667     2.00000    -1866.25545     2.00000    -1866.25436     2.00000     -151.41072     2.00000     -151.37613     2.00000     -102.04824     2.00000     -102.04824     2.00000     -102.05134     2.00000     -102.04457     2.00000     -102.03686     2.00000     -102.03686     2.00000      -11.82682     2.00000       -2.86887     2.00000       -1.90368     2.00000       -1.90302     0.00000        1.46843     0.00000        4.21265     0.00000        4.21431     0.00000        4.10030     0.00000        6.65516     0.00000        8.46481     0.00000        9.39316     0.00000       12.43035     0.00000       12.43435     0.00000       13.26456
   5        0.2222222      0.0000000      0.2222222     2.00000    -1866.25806     2.00000    -1866.25713     2.00000     -151.41481     2.00000     -151.38363     2.00000     -102.04858     2.00000     -102.04858     2.00000     -102.04552     2.00000     -102.04020     2.00000     -102.03571     2.00000     -102.03571     2.00000      -11.48805     2.00000       -3.79471     2.00000       -2.38257     2.00000       -2.38208     0.00000        1.08006     0.00000        3.38412     0.00000        5.12270     0.00000        5.12495     0.00000        7.43186     0.00000        8.83820     0.00000       10.36251     0.00000       12.93087     0.00000       12.93415     0.00000       13.77921
   6        0.2777778      0.0000000      0.2777778     2.00000    -1866.25805     2.00000    -1866.25725     2.00000     -151.41182     2.00000     -151.38648     2.00000     -102.04982     2.00000     -102.04982     2.00000     -102.04547     2.00000     -102.04085     2.00000     -102.03509     2.00000     -102.03509     2.00000      -11.10033     2.00000       -4.59784     2.00000       -2.74666     2.00000       -2.74624     0.00000        0.79047     0.00000        2.56979     0.00000        5.97639     0.00000        5.97912     0.00000        8.39681     0.00000        9.32488     0.00000       11.37566     0.00000       13.41724     0.00000       13.41872     0.00000       14.42800
   7        0.3333333      0.0000000      0.3333333     2.00000    -1866.25541     2.00000    -1866.25473     2.00000     -151.40329     2.00000     -151.38368     2.00000     -102.05172     2.00000     -102.05172     2.00000     -102.05077     2.00000     -102.04659     2.00000     -102.03511     2.00000     -102.03511     2.00000      -10.58274     2.00000       -5.57507     2.00000       -3.06760     2.00000       -3.06727     0.00000        0.55101     0.00000        1.85229     0.00000        6.94790     0.00000        6.95115     0.00000        9.51650     0.00000        9.97224     0.00000       12.32877     0.00000       13.37596     0.00000       13.37815     0.00000       15.47014
   8        0.3888889      0.0000000      0.3888889     2.00000    -1866.25444     2.00000    -1866.25393     2.00000     -151.39912     2.00000     -151.38468     2.00000     -102.05274     2.00000     -102.05274     2.00000     -102.05173     2.00000     -102.04860     2.00000     -102.03475     2.00000     -102.03475     2.00000       -9.91398     2.00000       -6.63298     2.00000       -3.33279     2.00000       -3.33251     0.00000        0.39072     0.00000        1.24874     0.00000        8.02275     0.00000        8.02644     0.00000       10.76213     0.00000       10.71791     0.00000       12.55742     0.00000       12.56151     0.00000       12.96397     0.00000       14.98195
   9        0.4444444      0.0000000      0.4444444     2.00000    -1866.25650     2.00000    -1866.25622     2.00000     -151.40003     2.00000     -151.39164     2.00000     -102.05275     2.00000     -102.05275     2.00000     -102.04691     2.00000     -102.04534     2.00000     -102.03395     2.00000     -102.03394     2.00000       -9.15587     2.00000       -7.60040     2.00000       -3.50256     2.00000       -3.50231     0.00000        0.36518     0.00000        0.79160     0.00000        9.07477     0.00000        9.07851     0.00000       11.65627     0.00000       11.52380     0.00000       11.52787     0.00000       11.80763     0.00000       13.03361     0.00000       13.73393
  10        0.5000000      0.0000000      0.5000000     2.00000    -1866.25811     2.00000    -1866.25811     2.00000     -151.40005     2.00000     -151.40005     2.00000     -102.05235     2.00000     -102.05235     2.00000     -102.04206     2.00000     -102.04206     2.00000     -102.03327     2.00000     -102.03327     2.00000       -8.40319     2.00000       -8.40298     2.00000       -3.55975     2.00000       -3.55950     0.00000        0.49762     0.00000        0.49791     0.00000        9.70971     0.00000        9.70984     0.00000       10.87323     0.00000       10.87326     0.00000       12.63489     0.00000       12.63498     0.00000       12.60358     0.00000       12.60389
