   1        0.6250000      0.2500000      0.6250000     2.00000       -8.45793     2.00000       -7.48113     2.00000       -4.56620     2.00000       -2.69559     0.00000        1.51210     0.00000        4.49926     0.00000        7.91294     0.00000        8.43823     0.00000        8.63008     0.00000        9.18899     0.00000       15.41693
   2        0.6000000      0.2000000      0.6000000     2.00000       -8.27638     2.00000       -7.69204     2.00000       -4.31695     2.00000       -2.84904     0.00000        1.33338     0.00000        3.48078     0.00000        8.54788     0.00000        9.13265     0.00000        9.12997     0.00000        9.74279     0.00000       14.95930
   3        0.5750000      0.1500000      0.5750000     2.00000       -8.16257     2.00000       -7.85178     2.00000       -3.99320     2.00000       -2.97309     0.00000        1.19073     0.00000        2.57672     0.00000        9.18755     0.00000        9.62306     0.00000        9.85975     0.00000       10.31988     0.00000       14.50437
   4        0.5500000      0.1000000      0.5500000     2.00000       -8.09765     2.00000       -7.96325     2.00000       -3.62067     2.00000       -3.06420     0.00000        1.08698     0.00000        1.79490     0.00000        9.79983     0.00000       10.05761     0.00000       10.60133     0.00000       10.88987     0.00000       13.99927
   5        0.5250000      0.0500000      0.5250000     2.00000       -8.06420     2.00000       -8.03084     2.00000       -3.28147     2.00000       -3.12061     0.00000        1.02303     0.00000        1.21734     0.00000       10.29457     0.00000       10.37637     0.00000       11.27544     0.00000       11.38145     0.00000       13.52315
   6        0.5000000      0.0000000      0.5000000     2.00000       -8.05385     2.00000       -8.05385     2.00000       -3.14004     2.00000       -3.14004     0.00000        1.00103     0.00000        1.00103     0.00000       10.49829     0.00000       10.49829     0.00000       11.60697     0.00000       11.60697     0.00000       13.30364
