   1        0.6250000      0.2500000      0.6250000     2.00000      -1784.13393     2.00000      -1784.13393     2.00000       -133.98699     2.00000       -133.98593     2.00000        -90.01531     2.00000        -90.01478     2.00000        -90.00647     2.00000        -90.00308     2.00000        -89.99474     2.00000        -89.99423     2.00000         -8.35747     2.00000         -7.35553     2.00000         -4.40097     2.00000         -2.55383     0.00000          1.09447     0.00000          4.03434     0.00000          7.31453     0.00000          7.87739     0.00000          8.05135     0.00000          8.56014     0.00000         14.70508     0.00000         14.91709     0.00000         15.46547     0.00000         16.27200     0.00000         16.63686
   2        0.6000000      0.2500000      0.6500000     2.00000      -1784.13393     2.00000      -1784.13393     2.00000       -133.98697     2.00000       -133.98595     2.00000        -90.01530     2.00000        -90.01481     2.00000        -90.00639     2.00000        -90.00316     2.00000        -89.99472     2.00000        -89.99424     2.00000         -8.33442     2.00000         -7.36543     2.00000         -4.38261     2.00000         -2.68989     0.00000          1.30290     0.00000          4.04931     0.00000          6.90754     0.00000          7.45974     0.00000          8.28136     0.00000          9.15262     0.00000         14.07016     0.00000         15.19391     0.00000         15.53515     0.00000         16.39016     0.00000         16.91388
   3        0.5750000      0.2500000      0.6750000     2.00000      -1784.13393     2.00000      -1784.13393     2.00000       -133.98691     2.00000       -133.98602     2.00000        -90.01528     2.00000        -90.01487     2.00000        -90.00616     2.00000        -90.00339     2.00000        -89.99466     2.00000        -89.99426     2.00000         -8.26530     2.00000         -7.39930     2.00000         -4.32782     2.00000         -3.01598     0.00000          1.84945     0.00000          4.09282     0.00000          6.31872     0.00000          6.69363     0.00000          8.86195     0.00000          9.89873     0.00000         13.40212     0.00000         14.67908     0.00000         16.07686     0.00000         16.83639     0.00000         17.44325
   4        0.5500000      0.2500000      0.7000000     2.00000      -1784.13393     2.00000      -1784.13393     2.00000       -133.98680     2.00000       -133.98613     2.00000        -90.01524     2.00000        -90.01496     2.00000        -90.00579     2.00000        -90.00376     2.00000        -89.99457     2.00000        -89.99430     2.00000         -8.15029     2.00000         -7.46921     2.00000         -4.23744     2.00000         -3.39357     0.00000          2.60385     0.00000          4.15860     0.00000          5.73838     0.00000          5.95072     0.00000          9.43300     0.00000         10.50464     0.00000         12.89517     0.00000         14.12536     0.00000         16.46846     0.00000         17.56344     0.00000         17.88768
   5        0.5250000      0.2500000      0.7250000     2.00000      -1784.13393     2.00000      -1784.13393     2.00000       -133.98665     2.00000       -133.98628     2.00000        -90.01519     2.00000        -90.01505     2.00000        -90.00532     2.00000        -90.00423     2.00000        -89.99448     2.00000        -89.99434     2.00000         -7.98968     2.00000         -7.59234     2.00000         -4.11300     2.00000         -3.72556     0.00000          3.46947     0.00000          4.22310     0.00000          5.21259     0.00000          5.26206     0.00000          9.96666     0.00000         10.71407     0.00000         12.77443     0.00000         13.58704     0.00000         16.88728     0.00000         17.74083     0.00000         18.34264
   6        0.5000000      0.2500000      0.7500000     2.00000      -1784.13393     2.00000      -1784.13393     2.00000       -133.98646     2.00000       -133.98646     2.00000        -90.01513     2.00000        -90.01513     2.00000        -90.00477     2.00000        -90.00477     2.00000        -89.99440     2.00000        -89.99440     2.00000         -7.78388     2.00000         -7.78388     2.00000         -3.95688     2.00000         -3.95688     0.00000          4.18069     0.00000          4.18069     0.00000          4.85717     0.00000          4.85717     0.00000         10.43770     0.00000         10.43770     0.00000         13.09950     0.00000         13.09950     0.00000         17.35112     0.00000         17.35112     0.00000         18.94322
