   1        0.0000000      0.0000000      0.0000000     2.00000      -1807.11266     2.00000      -1807.11262     2.00000       -141.41808     2.00000       -141.40912     2.00000        -95.33210     2.00000        -95.33210     2.00000        -95.33208     2.00000        -95.31507     2.00000        -95.31506     2.00000        -95.31504     2.00000        -14.14314     2.00000         -0.92479     2.00000         -0.92350     2.00000         -0.92342     0.00000          2.40125     0.00000          2.40188     0.00000          2.40251     0.00000          3.25944     0.00000          8.03415     0.00000          8.03751
   2        0.0172414      0.0172414      0.0172414     2.00000      -1807.11266     2.00000      -1807.11262     2.00000       -141.41808     2.00000       -141.40913     2.00000        -95.33210     2.00000        -95.33210     2.00000        -95.33208     2.00000        -95.31507     2.00000        -95.31507     2.00000        -95.31504     2.00000        -14.13889     2.00000         -0.97096     2.00000         -0.93112     2.00000         -0.93033     0.00000          2.41142     0.00000          2.41268     0.00000          2.41341     0.00000          3.28654     0.00000          8.02171     0.00000          8.02505
   3        0.0344828      0.0344828      0.0344828     2.00000      -1807.11266     2.00000      -1807.11262     2.00000       -141.41808     2.00000       -141.40914     2.00000        -95.33211     2.00000        -95.33210     2.00000        -95.33207     2.00000        -95.31509     2.00000        -95.31505     2.00000        -95.31503     2.00000        -14.12615     2.00000         -1.10551     2.00000         -0.95129     2.00000         -0.95048     0.00000          2.43792     0.00000          2.44150     0.00000          2.44275     0.00000          3.37165     0.00000          7.98563     0.00000          7.98891
   4        0.0517241      0.0517241      0.0517241     2.00000      -1807.11266     2.00000      -1807.11262     2.00000       -141.41807     2.00000       -141.40917     2.00000        -95.33213     2.00000        -95.33211     2.00000        -95.33205     2.00000        -95.31511     2.00000        -95.31504     2.00000        -95.31501     2.00000        -14.10490     2.00000         -1.31163     2.00000         -0.98387     2.00000         -0.98303     0.00000          2.45529     0.00000          2.49020     0.00000          2.49145     0.00000          3.51991     0.00000          7.92937     0.00000          7.93256
   5        0.0689655      0.0689655      0.0689655     2.00000      -1807.11266     2.00000      -1807.11263     2.00000       -141.41806     2.00000       -141.40921     2.00000        -95.33215     2.00000        -95.33214     2.00000        -95.33201     2.00000        -95.31514     2.00000        -95.31501     2.00000        -95.31499     2.00000        -14.07516     2.00000         -1.57116     2.00000         -1.02743     2.00000         -1.02657     0.00000          2.45248     0.00000          2.55545     0.00000          2.55669     0.00000          3.72757     0.00000          7.85792     0.00000          7.86100
   6        0.0862069      0.0862069      0.0862069     2.00000      -1807.11266     2.00000      -1807.11263     2.00000       -141.41804     2.00000       -141.40925     2.00000        -95.33219     2.00000        -95.33217     2.00000        -95.33197     2.00000        -95.31517     2.00000        -95.31499     2.00000        -95.31496     2.00000        -14.03694     2.00000         -1.86841     2.00000         -1.08022     2.00000         -1.07933     0.00000          2.42811     0.00000          2.63455     0.00000          2.63577     0.00000          3.98211     0.00000          7.77706     0.00000          7.78001
   7        0.1034483      0.1034483      0.1034483     2.00000      -1807.11266     2.00000      -1807.11263     2.00000       -141.41800     2.00000       -141.40931     2.00000        -95.33223     2.00000        -95.33222     2.00000        -95.33191     2.00000        -95.31522     2.00000        -95.31496     2.00000        -95.31493     2.00000        -13.99027     2.00000         -2.19140     2.00000         -1.14038     2.00000         -1.13945     0.00000          2.38632     0.00000          2.72428     0.00000          2.72548     0.00000          4.26942     0.00000          7.69276     0.00000          7.69554
   8        0.1206897      0.1206897      0.1206897     2.00000      -1807.11266     2.00000      -1807.11264     2.00000       -141.41796     2.00000       -141.40937     2.00000        -95.33227     2.00000        -95.33226     2.00000        -95.33185     2.00000        -95.31528     2.00000        -95.31491     2.00000        -95.31489     2.00000        -13.93522     2.00000         -2.53143     2.00000         -1.20603     2.00000         -1.20506     0.00000          2.33191     0.00000          2.82115     0.00000          2.82231     0.00000          4.57805     0.00000          7.61082     0.00000          7.61341
   9        0.1379310      0.1379310      0.1379310     2.00000      -1807.11267     2.00000      -1807.11264     2.00000       -141.41791     2.00000       -141.40945     2.00000        -95.33232     2.00000        -95.33231     2.00000        -95.33179     2.00000        -95.31534     2.00000        -95.31486     2.00000        -95.31484     2.00000        -13.87186     2.00000         -2.88226     2.00000         -1.27551     2.00000         -1.27448     0.00000          2.26885     0.00000          2.92152     0.00000          2.92263     0.00000          4.89988     0.00000          7.53674     0.00000          7.53914
  10        0.1551724      0.1551724      0.1551724     2.00000      -1807.11267     2.00000      -1807.11264     2.00000       -141.41785     2.00000       -141.40953     2.00000        -95.33237     2.00000        -95.33235     2.00000        -95.33172     2.00000        -95.31541     2.00000        -95.31481     2.00000        -95.31478     2.00000        -13.80029     2.00000         -3.23938     2.00000         -1.34732     2.00000         -1.34624     0.00000          2.20016     0.00000          3.02166     0.00000          3.02271     0.00000          5.22934     0.00000          7.47571     0.00000          7.47788
  11        0.1724138      0.1724138      0.1724138     2.00000      -1807.11267     2.00000      -1807.11264     2.00000       -141.41778     2.00000       -141.40963     2.00000        -95.33243     2.00000        -95.33241     2.00000        -95.33165     2.00000        -95.31548     2.00000        -95.31475     2.00000        -95.31472     2.00000        -13.72062     2.00000         -3.59945     2.00000         -1.42020     2.00000         -1.41906     0.00000          2.12816     0.00000          3.11794     0.00000          3.11890     0.00000          5.56264     0.00000          7.43257     0.00000          7.43448
  12        0.1896552      0.1896552      0.1896552     2.00000      -1807.11267     2.00000      -1807.11265     2.00000       -141.41770     2.00000       -141.40972     2.00000        -95.33249     2.00000        -95.33247     2.00000        -95.33157     2.00000        -95.31556     2.00000        -95.31469     2.00000        -95.31466     2.00000        -13.63301     2.00000         -3.95993     2.00000         -1.49307     2.00000         -1.49188     0.00000          2.05463     0.00000          3.20686     0.00000          3.20770     0.00000          5.89717     0.00000          7.41174     0.00000          7.41337
  13        0.2068966      0.2068966      0.2068966     2.00000      -1807.11267     2.00000      -1807.11265     2.00000       -141.41761     2.00000       -141.40983     2.00000        -95.33256     2.00000        -95.33254     2.00000        -95.33149     2.00000        -95.31565     2.00000        -95.31463     2.00000        -95.31460     2.00000        -13.53763     2.00000         -4.31880     2.00000         -1.56500     2.00000         -1.56375     0.00000          1.98099     0.00000          3.28531     0.00000          3.28600     0.00000          6.23103     0.00000          7.41705     0.00000          7.41838
  14        0.2241379      0.2241379      0.2241379     2.00000      -1807.11267     2.00000      -1807.11265     2.00000       -141.41751     2.00000       -141.40994     2.00000        -95.33263     2.00000        -95.33261     2.00000        -95.33141     2.00000        -95.31574     2.00000        -95.31457     2.00000        -95.31454     2.00000        -13.43472     2.00000         -4.67444     2.00000         -1.63519     2.00000         -1.63389     0.00000          1.90836     0.00000          3.35080     0.00000          3.35133     0.00000          6.56266     0.00000          7.45154     0.00000          7.45254
  15        0.2413793      0.2413793      0.2413793     2.00000      -1807.11268     2.00000      -1807.11265     2.00000       -141.41741     2.00000       -141.41005     2.00000        -95.33270     2.00000        -95.33268     2.00000        -95.33132     2.00000        -95.31583     2.00000        -95.31450     2.00000        -95.31448     2.00000        -13.32453     2.00000         -5.02545     2.00000         -1.70299     2.00000         -1.70163     0.00000          1.83765     0.00000          3.40173     0.00000          3.40209     0.00000          6.89046     0.00000          7.51716     0.00000          7.51783
  16        0.2586207      0.2586207      0.2586207     2.00000      -1807.11268     2.00000      -1807.11265     2.00000       -141.41731     2.00000       -141.41017     2.00000        -95.33277     2.00000        -95.33276     2.00000        -95.33124     2.00000        -95.31592     2.00000        -95.31444     2.00000        -95.31441     2.00000        -13.20742     2.00000         -5.37058     2.00000         -1.76785     2.00000         -1.76644     0.00000          1.76955     0.00000          3.43759     0.00000          3.43777     0.00000          7.21233     0.00000          7.61473     0.00000          7.61506
  17        0.2758621      0.2758621      0.2758621     2.00000      -1807.11268     2.00000      -1807.11265     2.00000       -141.41720     2.00000       -141.41029     2.00000        -95.33284     2.00000        -95.33282     2.00000        -95.33116     2.00000        -95.31601     2.00000        -95.31437     2.00000        -95.31434     2.00000        -13.08380     2.00000         -5.70868     2.00000         -1.82934     2.00000         -1.82787     0.00000          1.70465     0.00000          3.45890     0.00000          3.45893     0.00000          7.52492     0.00000          7.74391     0.00000          7.74394
  18        0.2931035      0.2931035      0.2931035     2.00000      -1807.11268     2.00000      -1807.11265     2.00000       -141.41708     2.00000       -141.41042     2.00000        -95.33291     2.00000        -95.33289     2.00000        -95.33108     2.00000        -95.31610     2.00000        -95.31430     2.00000        -95.31428     2.00000        -12.95421     2.00000         -6.03861     2.00000         -1.88713     2.00000         -1.88561     0.00000          1.64338     0.00000          3.46699     0.00000          3.46713     0.00000          7.82249     0.00000          7.90312     0.00000          7.90345
  19        0.3103448      0.3103448      0.3103448     2.00000      -1807.11268     2.00000      -1807.11265     2.00000       -141.41697     2.00000       -141.41054     2.00000        -95.33297     2.00000        -95.33296     2.00000        -95.33100     2.00000        -95.31619     2.00000        -95.31424     2.00000        -95.31421     2.00000        -12.81934     2.00000         -6.35920     2.00000         -1.94096     2.00000         -1.93938     0.00000          1.58612     0.00000          3.46405     0.00000          3.46432     0.00000          8.09068     0.00000          8.09092     0.00000          8.09531
  20        0.3275862      0.3275862      0.3275862     2.00000      -1807.11269     2.00000      -1807.11265     2.00000       -141.41685     2.00000       -141.41066     2.00000        -95.33303     2.00000        -95.33302     2.00000        -95.33092     2.00000        -95.31628     2.00000        -95.31418     2.00000        -95.31415     2.00000        -12.68005     2.00000         -6.66915     2.00000         -1.99060     2.00000         -1.98898     0.00000          1.53315     0.00000          3.45249     0.00000          3.45288     0.00000          8.30422     0.00000          8.30506     0.00000          8.32571
  21        0.3448276      0.3448276      0.3448276     2.00000      -1807.11269     2.00000      -1807.11265     2.00000       -141.41674     2.00000       -141.41078     2.00000        -95.33309     2.00000        -95.33308     2.00000        -95.33085     2.00000        -95.31636     2.00000        -95.31412     2.00000        -95.31409     2.00000        -12.53750     2.00000         -6.96698     2.00000         -2.03590     2.00000         -2.03423     0.00000          1.48470     0.00000          3.43475     0.00000          3.43523     0.00000          8.49459     0.00000          8.54119     0.00000          8.54237
  22        0.3620690      0.3620690      0.3620690     2.00000      -1807.11269     2.00000      -1807.11265     2.00000       -141.41663     2.00000       -141.41090     2.00000        -95.33315     2.00000        -95.33313     2.00000        -95.33078     2.00000        -95.31643     2.00000        -95.31406     2.00000        -95.31404     2.00000        -12.39318     2.00000         -7.25089     2.00000         -2.07669     2.00000         -2.07499     0.00000          1.44097     0.00000          3.41311     0.00000          3.41367     0.00000          8.59297     0.00000          8.79905     0.00000          8.80045
  23        0.3793103      0.3793103      0.3793103     2.00000      -1807.11269     2.00000      -1807.11265     2.00000       -141.41652     2.00000       -141.41101     2.00000        -95.33320     2.00000        -95.33318     2.00000        -95.33071     2.00000        -95.31650     2.00000        -95.31401     2.00000        -95.31399     2.00000        -12.24911     2.00000         -7.51864     2.00000         -2.11289     2.00000         -2.11115     0.00000          1.40209     0.00000          3.38962     0.00000          3.39025     0.00000          8.63383     0.00000          9.07529     0.00000          9.07691
  24        0.3965517      0.3965517      0.3965517     2.00000      -1807.11269     2.00000      -1807.11265     2.00000       -141.41643     2.00000       -141.41111     2.00000        -95.33324     2.00000        -95.33323     2.00000        -95.33066     2.00000        -95.31657     2.00000        -95.31397     2.00000        -95.31394     2.00000        -12.10792     2.00000         -7.76738     2.00000         -2.14439     2.00000         -2.14261     0.00000          1.36820     0.00000          3.36603     0.00000          3.36670     0.00000          8.63981     0.00000          9.36744     0.00000          9.36925
  25        0.4137931      0.4137931      0.4137931     2.00000      -1807.11269     2.00000      -1807.11265     2.00000       -141.41634     2.00000       -141.41120     2.00000        -95.33328     2.00000        -95.33327     2.00000        -95.33061     2.00000        -95.31662     2.00000        -95.31393     2.00000        -95.31391     2.00000        -11.97314     2.00000         -7.99342     2.00000         -2.17113     2.00000         -2.16933     0.00000          1.33938     0.00000          3.34380     0.00000          3.34451     0.00000          8.62873     0.00000          9.67278     0.00000          9.67478
  26        0.4310345      0.4310345      0.4310345     2.00000      -1807.11269     2.00000      -1807.11265     2.00000       -141.41626     2.00000       -141.41128     2.00000        -95.33331     2.00000        -95.33330     2.00000        -95.33056     2.00000        -95.31667     2.00000        -95.31390     2.00000        -95.31388     2.00000        -11.84933     2.00000         -8.19207     2.00000         -2.19307     2.00000         -2.19125     0.00000          1.31572     0.00000          3.32410     0.00000          3.32484     0.00000          8.61135     0.00000          9.98790     0.00000          9.99008
  27        0.4482759      0.4482759      0.4482759     2.00000      -1807.11269     2.00000      -1807.11265     2.00000       -141.41620     2.00000       -141.41134     2.00000        -95.33334     2.00000        -95.33333     2.00000        -95.33053     2.00000        -95.31671     2.00000        -95.31388     2.00000        -95.31385     2.00000        -11.74223     2.00000         -8.35748     2.00000         -2.21017     2.00000         -2.20832     0.00000          1.29727     0.00000          3.30788     0.00000          3.30864     0.00000          8.59376     0.00000         10.30734     0.00000         10.30968
  28        0.4655173      0.4655173      0.4655173     2.00000      -1807.11269     2.00000      -1807.11265     2.00000       -141.41616     2.00000       -141.41139     2.00000        -95.33336     2.00000        -95.33334     2.00000        -95.33051     2.00000        -95.31673     2.00000        -95.31386     2.00000        -95.31383     2.00000        -11.65845     2.00000         -8.48296     2.00000         -2.22239     2.00000         -2.22053     0.00000          1.28406     0.00000          3.29582     0.00000          3.29659     0.00000          8.57938     0.00000         10.61938     0.00000         10.62189
  29        0.4827586      0.4827586      0.4827586     2.00000      -1807.11269     2.00000      -1807.11265     2.00000       -141.41613     2.00000       -141.41142     2.00000        -95.33337     2.00000        -95.33335     2.00000        -95.33049     2.00000        -95.31675     2.00000        -95.31385     2.00000        -95.31382     2.00000        -11.60469     2.00000         -8.56178     2.00000         -2.22973     2.00000         -2.22787     0.00000          1.27613     0.00000          3.28840     0.00000          3.28918     0.00000          8.57011     0.00000         10.89035     0.00000         10.89304
  30        0.5000000      0.5000000      0.5000000     2.00000      -1807.11269     2.00000      -1807.11265     2.00000       -141.41612     2.00000       -141.41143     2.00000        -95.33337     2.00000        -95.33336     2.00000        -95.33049     2.00000        -95.31675     2.00000        -95.31384     2.00000        -95.31382     2.00000        -11.58610     2.00000         -8.58871     2.00000         -2.23218     2.00000         -2.23031     0.00000          1.27349     0.00000          3.28589     0.00000          3.28667     0.00000          8.56692     0.00000         11.01683     0.00000         11.01963
