   1        0.5000000      0.5000000      0.5000000     2.00000      -10.18167     2.00000       -7.65172     2.00000       -1.96667     2.00000       -1.96667     0.00000        1.24494     0.00000        3.22094     0.00000        3.22094     0.00000        8.10945     0.00000       10.47108     0.00000       10.47108     0.00000       11.18945
   2        0.4861111      0.4861111      0.5277778     2.00000      -10.16239     2.00000       -7.64114     2.00000       -2.14519     2.00000       -2.00398     0.00000        1.40618     0.00000        3.18474     0.00000        3.30018     0.00000        8.15624     0.00000        9.94583     0.00000       10.29547     0.00000       11.27944
   3        0.4722222      0.4722222      0.5555556     2.00000      -10.10504     2.00000       -7.61128     2.00000       -2.58315     2.00000       -2.10594     0.00000        1.75612     0.00000        3.14415     0.00000        3.52491     0.00000        8.21419     0.00000        9.25093     0.00000        9.95988     0.00000       11.21432
   4        0.4583333      0.4583333      0.5833333     2.00000      -10.01076     2.00000       -7.56698     2.00000       -3.11364     2.00000       -2.25306     0.00000        1.97041     0.00000        3.31163     0.00000        3.87305     0.00000        7.94274     0.00000        8.88928     0.00000        9.60714     0.00000       11.27180
   5        0.4444444      0.4444444      0.6111111     2.00000       -9.87927     2.00000       -7.51780     2.00000       -3.66769     2.00000       -2.42836     0.00000        1.90080     0.00000        3.81610     0.00000        4.33015     0.00000        7.29815     0.00000        8.82518     0.00000        9.27246     0.00000       11.58561
   6        0.4305556      0.4305556      0.6388889     2.00000       -9.71158     2.00000       -7.48129     2.00000       -4.19626     2.00000       -2.61181     0.00000        1.69986     0.00000        4.50873     0.00000        4.87415     0.00000        6.59344     0.00000        8.71954     0.00000        8.96799     0.00000       12.18726
   7        0.4166667      0.4166667      0.6666667     2.00000       -9.51234     2.00000       -7.48435     2.00000       -4.62757     2.00000       -2.78437     0.00000        1.47865     0.00000        5.20764     0.00000        5.47739     0.00000        5.96067     0.00000        8.54240     0.00000        8.70317     0.00000       13.01344
   8        0.4027778      0.4027778      0.6944444     2.00000       -9.28489     2.00000       -7.56132     2.00000       -4.92232     2.00000       -2.94007     0.00000        1.27565     0.00000        5.09759     0.00000        6.12427     0.00000        6.20168     0.00000        8.32967     0.00000        8.49067     0.00000       13.99625
   9        0.3888889      0.3888889      0.7222222     2.00000       -9.04545     2.00000       -7.72313     2.00000       -5.05551     2.00000       -3.07569     0.00000        1.10452     0.00000        4.49572     0.00000        6.77182     0.00000        7.00379     0.00000        8.10798     0.00000        8.36788     0.00000       14.68785
  10        0.3750000      0.3750000      0.7500000     2.00000       -8.85704     2.00000       -7.89700     2.00000       -5.02970     2.00000       -3.18381     0.00000        0.97432     0.00000        3.91365     0.00000        7.26959     0.00000        7.77047     0.00000        7.96184     0.00000        8.46865     0.00000       14.59235
