   1        0.5000000      0.0000000      0.5000000     2.00000       -8.31363     2.00000       -8.31363     2.00000       -3.39778     2.00000       -3.39778     0.00000        0.77155     0.00000        0.77155     0.00000       10.28182     0.00000       10.28182     0.00000       11.38786     0.00000       11.38786     0.00000       13.07415
   2        0.5000000      0.0357143      0.5357143     2.00000       -8.30615     2.00000       -8.30615     2.00000       -3.45484     2.00000       -3.45483     0.00000        0.88319     0.00000        0.88319     0.00000       10.09707     0.00000       10.09707     0.00000       11.16374     0.00000       11.16374     0.00000       13.19559
   3        0.5000000      0.0714286      0.5714286     2.00000       -8.28502     2.00000       -8.28502     2.00000       -3.61357     2.00000       -3.61357     0.00000        1.21603     0.00000        1.21603     0.00000        9.46370     0.00000        9.46370     0.00000       10.94629     0.00000       10.94629     0.00000       13.28086
   4        0.5000000      0.1071429      0.6071429     2.00000       -8.25324     2.00000       -8.25324     2.00000       -3.83389     2.00000       -3.83389     0.00000        1.74340     0.00000        1.74340     0.00000        8.55373     0.00000        8.55373     0.00000       10.87521     0.00000       10.87521     0.00000       13.35770
   5        0.5000000      0.1428571      0.6428571     2.00000       -8.21627     2.00000       -8.21627     2.00000       -4.05904     2.00000       -4.05904     0.00000        2.41015     0.00000        2.41015     0.00000        7.57126     0.00000        7.57126     0.00000       10.85538     0.00000       10.85538     0.00000       13.44498
   6        0.5000000      0.1785714      0.6785714     2.00000       -8.18175     2.00000       -8.18175     2.00000       -4.23834     2.00000       -4.23834     0.00000        3.15217     0.00000        3.15217     0.00000        6.60593     0.00000        6.60593     0.00000       10.85298     0.00000       10.85298     0.00000       13.53136
   7        0.5000000      0.2142857      0.7142857     2.00000       -8.15726     2.00000       -8.15726     2.00000       -4.34337     2.00000       -4.34337     0.00000        3.89936     0.00000        3.89936     0.00000        5.72434     0.00000        5.72434     0.00000       10.85644     0.00000       10.85644     0.00000       13.59720
   8        0.5000000      0.2500000      0.7500000     2.00000       -8.14833     2.00000       -8.14833     2.00000       -4.37521     2.00000       -4.37521     0.00000        4.39752     0.00000        4.39752     0.00000        5.17967     0.00000        5.17967     0.00000       10.85874     0.00000       10.85874     0.00000       13.62228
