   1        0.5000000      0.2500000      0.7500000     2.00000       -8.32134     2.00000       -8.32134     2.00000       -4.59686     2.00000       -4.59686     0.00000        4.02234     0.00000        4.02234     0.00000        4.78767     0.00000        4.78767     0.00000       10.32013     0.00000       10.32013     0.00000       12.99957
   2        0.5000000      0.2727273      0.7272727     2.00000       -8.60542     2.00000       -8.04693     2.00000       -4.77842     2.00000       -4.35024     0.00000        3.75063     0.00000        4.06857     0.00000        4.75654     0.00000        5.12098     0.00000        9.66518     0.00000       10.73719     0.00000       12.53564
   3        0.5000000      0.2954545      0.7045455     2.00000       -8.88492     2.00000       -7.80346     2.00000       -4.86926     2.00000       -4.05806     0.00000        3.47312     0.00000        3.81695     0.00000        5.09615     0.00000        5.53830     0.00000        8.84108     0.00000       10.93616     0.00000       12.23206
   4        0.5000000      0.3181818      0.6818182     2.00000       -9.14601     2.00000       -7.62210     2.00000       -4.84375     2.00000       -3.73590     0.00000        3.23649     0.00000        3.51653     0.00000        5.55559     0.00000        5.99372     0.00000        7.94612     0.00000       10.97552     0.00000       12.01789
   5        0.5000000      0.3409091      0.6590909     2.00000       -9.38428     2.00000       -7.51794     2.00000       -4.67970     2.00000       -3.40166     0.00000        3.05686     0.00000        3.22446     0.00000        6.07326     0.00000        6.47306     0.00000        7.03104     0.00000       10.89446     0.00000       11.84961
   6        0.5000000      0.3636364      0.6363636     2.00000       -9.59515     2.00000       -7.48518     2.00000       -4.38483     2.00000       -3.07400     0.00000        2.94824     0.00000        2.94213     0.00000        6.13100     0.00000        6.63870     0.00000        6.96304     0.00000       10.70240     0.00000       11.70907
   7        0.5000000      0.3863636      0.6136364     2.00000       -9.77493     2.00000       -7.50163     2.00000       -3.99240     2.00000       -2.76954     0.00000        2.68223     0.00000        2.89510     0.00000        5.29448     0.00000        7.23782     0.00000        7.44340     0.00000       10.41247     0.00000       11.59017
   8        0.5000000      0.4090909      0.5909091     2.00000       -9.92509     2.00000       -7.54217     2.00000       -3.52224     2.00000       -2.50300     0.00000        2.40553     0.00000        2.91486     0.00000        4.53722     0.00000        7.87724     0.00000        7.87293     0.00000       10.09710     0.00000       11.49111
   9        0.5000000      0.4318182      0.5681818     2.00000      -10.04360     2.00000       -7.58890     2.00000       -3.01695     2.00000       -2.28448     0.00000        2.08796     0.00000        2.98764     0.00000        3.92307     0.00000        8.15628     0.00000        8.55327     0.00000        9.91880     0.00000       11.41255
  10        0.5000000      0.4545455      0.5454545     2.00000      -10.12842     2.00000       -7.62941     2.00000       -2.53338     2.00000       -2.11929     0.00000        1.71965     0.00000        3.08432     0.00000        3.50672     0.00000        8.20860     0.00000        9.25827     0.00000       10.02061     0.00000       11.35549
  11        0.5000000      0.4772727      0.5227273     2.00000      -10.17971     2.00000       -7.65629     2.00000       -2.14118     2.00000       -2.01637     0.00000        1.37746     0.00000        3.16925     0.00000        3.27691     0.00000        8.13552     0.00000        9.96885     0.00000       10.29354     0.00000       11.31405
  12        0.5000000      0.5000000      0.5000000     2.00000      -10.19692     2.00000       -7.66575     2.00000       -1.98202     2.00000       -1.98202     0.00000        1.23240     0.00000        3.20407     0.00000        3.20407     0.00000        8.09306     0.00000       10.45354     0.00000       10.45354     0.00000       11.17884
