   1        0.0000000      0.0000000      0.0000000     2.00000    -1870.04880     2.00000    -1870.04690     2.00000     -152.05103     2.00000     -151.97539     2.00000     -101.73065     2.00000     -101.73065     2.00000     -101.73064     2.00000     -101.70709     2.00000     -101.70708     2.00000     -101.70705     2.00000      -12.13674     2.00000       -0.35008     2.00000       -0.34889     2.00000       -0.34879     0.00000        2.82317     0.00000        2.82377     0.00000        2.82438     0.00000        3.57897     0.00000        8.40697     0.00000        8.41018     0.00000        8.63021     0.00000       12.34283     0.00000       12.34753     0.00000       12.34778
   2        0.0555556      0.0000000      0.0555556     2.00000    -1870.04931     2.00000    -1870.04784     2.00000     -152.04779     2.00000     -151.97346     2.00000     -101.73179     2.00000     -101.73177     2.00000     -101.73333     2.00000     -101.70977     2.00000     -101.70758     2.00000     -101.70755     2.00000      -12.08249     2.00000       -0.66084     2.00000       -0.52704     2.00000       -0.52588     0.00000        2.67290     0.00000        3.06514     0.00000        3.06601     0.00000        3.83205     0.00000        8.03239     0.00000        8.48647     0.00000        8.77869     0.00000       12.45299     0.00000       12.45776     0.00000       12.70239
   3        0.1111111      0.0000000      0.1111111     2.00000    -1870.04980     2.00000    -1870.04899     2.00000     -152.04441     2.00000     -151.97316     2.00000     -101.73302     2.00000     -101.73300     2.00000     -101.73563     2.00000     -101.71307     2.00000     -101.70808     2.00000     -101.70805     2.00000      -11.91734     2.00000       -1.50882     2.00000       -1.00512     2.00000       -1.00420     0.00000        2.29964     0.00000        3.75558     0.00000        3.75685     0.00000        4.46384     0.00000        7.31510     0.00000        8.69511     0.00000        9.27458     0.00000       12.76116     0.00000       12.76572     0.00000       13.50708
   4        0.1666667      0.0000000      0.1666667     2.00000    -1870.04941     2.00000    -1870.04903     2.00000     -152.04482     2.00000     -151.97803     2.00000     -101.73319     2.00000     -101.73318     2.00000     -101.73369     2.00000     -101.71343     2.00000     -101.70787     2.00000     -101.70784     2.00000      -11.64727     2.00000       -2.55412     2.00000       -1.57093     2.00000       -1.57027     0.00000        1.85094     0.00000        4.67379     0.00000        4.67556     0.00000        4.63303     0.00000        7.20376     0.00000        8.99106     0.00000       10.07796     0.00000       13.23012     0.00000       13.23424     0.00000       14.44075
   5        0.2222222      0.0000000      0.2222222     2.00000    -1870.04838     2.00000    -1870.04818     2.00000     -152.04675     2.00000     -151.98712     2.00000     -101.73271     2.00000     -101.73270     2.00000     -101.72892     2.00000     -101.71164     2.00000     -101.70704     2.00000     -101.70702     2.00000      -11.30643     2.00000       -3.50064     2.00000       -2.06167     2.00000       -2.06117     0.00000        1.44613     0.00000        3.92628     0.00000        5.61126     0.00000        5.61357     0.00000        8.03118     0.00000        9.36638     0.00000       11.02712     0.00000       13.78835     0.00000       13.79154     0.00000       15.32004
   6        0.2777778      0.0000000      0.2777778     2.00000    -1870.04823     2.00000    -1870.04815     2.00000     -152.04157     2.00000     -151.99257     2.00000     -101.73330     2.00000     -101.73329     2.00000     -101.72792     2.00000     -101.71315     2.00000     -101.70684     2.00000     -101.70682     2.00000      -10.91479     2.00000       -4.32070     2.00000       -2.43482     2.00000       -2.43439     0.00000        1.14309     0.00000        3.06492     0.00000        6.49788     0.00000        6.50069     0.00000        9.05694     0.00000        9.85842     0.00000       12.01304     0.00000       14.23811     0.00000       14.23913     0.00000       16.16827
   7        0.3333333      0.0000000      0.3333333     2.00000    -1870.04892     2.00000    -1870.04909     2.00000     -152.03123     2.00000     -151.99313     2.00000     -101.73481     2.00000     -101.73480     2.00000     -101.73021     2.00000     -101.71805     2.00000     -101.70730     2.00000     -101.70729     2.00000      -10.39212     2.00000       -5.31552     2.00000       -2.76297     2.00000       -2.76263     0.00000        0.89914     0.00000        2.29404     0.00000        7.50848     0.00000        7.51181     0.00000       10.23286     0.00000       10.51493     0.00000       13.02224     0.00000       14.08996     0.00000       14.09237     0.00000       17.06914
   8        0.3888889      0.0000000      0.3888889     2.00000    -1870.04902     2.00000    -1870.04931     2.00000     -152.02450     2.00000     -151.99714     2.00000     -101.73550     2.00000     -101.73550     2.00000     -101.72930     2.00000     -101.72075     2.00000     -101.70722     2.00000     -101.70721     2.00000       -9.71694     2.00000       -6.39140     2.00000       -3.03375     2.00000       -3.03347     0.00000        0.74685     0.00000        1.66246     0.00000        8.62598     0.00000        8.62977     0.00000       11.31861     0.00000       11.49460     0.00000       13.24802     0.00000       13.25214     0.00000       13.86650     0.00000       15.66063
   9        0.4444444      0.0000000      0.4444444     2.00000    -1870.04823     2.00000    -1870.04849     2.00000     -152.02196     2.00000     -152.00679     2.00000     -101.73517     2.00000     -101.73516     2.00000     -101.72438     2.00000     -101.72012     2.00000     -101.70647     2.00000     -101.70646     2.00000       -8.95085     2.00000       -7.37404     2.00000       -3.20705     2.00000       -3.20679     0.00000        0.73819     0.00000        1.19312     0.00000        9.72391     0.00000        9.72778     0.00000       12.23266     0.00000       12.19779     0.00000       12.20197     0.00000       12.67971     0.00000       14.19675     0.00000       14.28674
  10        0.5000000      0.0000000      0.5000000     2.00000    -1870.04764     2.00000    -1870.04764     2.00000     -152.01805     2.00000     -152.01804     2.00000     -101.73461     2.00000     -101.73461     2.00000     -101.71955     2.00000     -101.71954     2.00000     -101.70579     2.00000     -101.70579     2.00000       -8.18874     2.00000       -8.18853     2.00000       -3.26544     2.00000       -3.26519     0.00000        0.88743     0.00000        0.88773     0.00000       10.41418     0.00000       10.41433     0.00000       11.50730     0.00000       11.50728     0.00000       13.23890     0.00000       13.23898     0.00000       13.60806     0.00000       13.60842
