   1        0.0000000      0.0000000      0.0000000     2.00000    -1871.44395     2.00000    -1871.43552     2.00000     -151.36660     2.00000     -151.32320     2.00000     -102.06465     2.00000     -102.06465     2.00000     -102.06464     2.00000     -102.06097     2.00000     -102.06096     2.00000     -102.06094     2.00000      -12.25299     2.00000       -0.64509     2.00000       -0.64390     2.00000       -0.64381     0.00000        2.49157     0.00000        2.49217     0.00000        2.49276     0.00000        3.17500     0.00000        7.92287     0.00000        7.92604     0.00000        8.31778     0.00000       11.84584     0.00000       11.85059     0.00000       11.85082
   2        0.0555556      0.0000000      0.0555556     2.00000    -1871.44407     2.00000    -1871.43581     2.00000     -151.36600     2.00000     -151.32338     2.00000     -102.06511     2.00000     -102.06510     2.00000     -102.06512     2.00000     -102.06134     2.00000     -102.06089     2.00000     -102.06087     2.00000      -12.20200     2.00000       -0.98771     2.00000       -0.84635     2.00000       -0.84525     0.00000        2.35591     0.00000        2.76033     0.00000        2.76123     0.00000        3.49363     0.00000        7.56196     0.00000        7.98482     0.00000        8.47194     0.00000       11.93120     0.00000       11.93600     0.00000       12.15777
   3        0.1111111      0.0000000      0.1111111     2.00000    -1871.44360     2.00000    -1871.43577     2.00000     -151.36543     2.00000     -151.32495     2.00000     -102.06589     2.00000     -102.06588     2.00000     -102.06497     2.00000     -102.06131     2.00000     -102.06047     2.00000     -102.06045     2.00000      -12.05211     2.00000       -1.75250     2.00000       -1.29978     2.00000       -1.29893     0.00000        2.01628     0.00000        3.40747     0.00000        3.40875     0.00000        4.12538     0.00000        6.86966     0.00000        8.15965     0.00000        8.99568     0.00000       12.18068     0.00000       12.18525     0.00000       12.83277
   4        0.1666667      0.0000000      0.1666667     2.00000    -1871.44332     2.00000    -1871.43620     2.00000     -151.36369     2.00000     -151.32667     2.00000     -102.06720     2.00000     -102.06719     2.00000     -102.06547     2.00000     -102.06193     2.00000     -102.06001     2.00000     -102.05999     2.00000      -11.80424     2.00000       -2.66520     2.00000       -1.80880     2.00000       -1.80815     0.00000        1.59546     0.00000        4.23344     0.00000        4.23517     0.00000        4.26947     0.00000        6.70526     0.00000        8.45285     0.00000        9.85279     0.00000       12.58952     0.00000       12.59361     0.00000       13.62854
   5        0.2222222      0.0000000      0.2222222     2.00000    -1871.44274     2.00000    -1871.43648     2.00000     -151.36184     2.00000     -151.32930     2.00000     -102.06858     2.00000     -102.06857     2.00000     -102.06556     2.00000     -102.06235     2.00000     -102.05942     2.00000     -102.05941     2.00000      -11.45512     2.00000       -3.66037     2.00000       -2.30067     2.00000       -2.30016     0.00000        1.18705     0.00000        3.59059     0.00000        5.17140     0.00000        5.17365     0.00000        7.49115     0.00000        8.86609     0.00000       10.92265     0.00000       13.10765     0.00000       13.11081     0.00000       14.48441
   6        0.2777778      0.0000000      0.2777778     2.00000    -1871.44215     2.00000    -1871.43694     2.00000     -151.35935     2.00000     -151.33236     2.00000     -102.06998     2.00000     -102.06998     2.00000     -102.06574     2.00000     -102.06295     2.00000     -102.05889     2.00000     -102.05888     2.00000      -11.01338     2.00000       -4.64751     2.00000       -2.71941     2.00000       -2.71900     0.00000        0.85444     0.00000        2.72305     0.00000        6.14697     0.00000        6.14973     0.00000        8.60521     0.00000        9.39347     0.00000       12.07486     0.00000       13.55422     0.00000       13.55538     0.00000       15.40817
   7        0.3333333      0.0000000      0.3333333     2.00000    -1871.44160     2.00000    -1871.43757     2.00000     -151.35648     2.00000     -151.33562     2.00000     -102.07126     2.00000     -102.07126     2.00000     -102.06596     2.00000     -102.06373     2.00000     -102.05849     2.00000     -102.05848     2.00000      -10.47256     2.00000       -5.63605     2.00000       -3.05715     2.00000       -3.05681     0.00000        0.60747     0.00000        1.94705     0.00000        7.16406     0.00000        7.16732     0.00000        9.80056     0.00000       10.04329     0.00000       13.15142     0.00000       13.48776     0.00000       13.48990     0.00000       16.38367
   8        0.3888889      0.0000000      0.3888889     2.00000    -1871.44078     2.00000    -1871.43803     2.00000     -151.35354     2.00000     -151.33939     2.00000     -102.07216     2.00000     -102.07215     2.00000     -102.06571     2.00000     -102.06417     2.00000     -102.05811     2.00000     -102.05811     2.00000       -9.84990     2.00000       -6.57772     2.00000       -3.29872     2.00000       -3.29843     0.00000        0.47089     0.00000        1.33144     0.00000        8.19654     0.00000        8.20022     0.00000       10.80802     0.00000       10.97314     0.00000       12.73622     0.00000       12.74021     0.00000       13.82083     0.00000       15.04249
   9        0.4444444      0.0000000      0.4444444     2.00000    -1871.44029     2.00000    -1871.43889     2.00000     -151.34984     2.00000     -151.34260     2.00000     -102.07282     2.00000     -102.07282     2.00000     -102.06582     2.00000     -102.06503     2.00000     -102.05797     2.00000     -102.05797     2.00000       -9.13779     2.00000       -7.49100     2.00000       -3.44611     2.00000       -3.44585     0.00000        0.46461     0.00000        0.88519     0.00000        9.22933     0.00000        9.23310     0.00000       11.69294     0.00000       11.71833     0.00000       11.72246     0.00000       12.08574     0.00000       13.74419     0.00000       13.80959
  10        0.5000000      0.0000000      0.5000000     2.00000    -1871.43936     2.00000    -1871.43936     2.00000     -151.34664     2.00000     -151.34664     2.00000     -102.07295     2.00000     -102.07295     2.00000     -102.06513     2.00000     -102.06513     2.00000     -102.05780     2.00000     -102.05780     2.00000       -8.34843     2.00000       -8.34823     2.00000       -3.49714     2.00000       -3.49688     0.00000        0.59972     0.00000        0.60001     0.00000        9.93007     0.00000        9.93021     0.00000       11.00263     0.00000       11.00263     0.00000       12.69256     0.00000       12.69264     0.00000       13.06436     0.00000       13.06471
