   1        0.0000000      0.0000000      0.0000000     2.00000      -12.25349     2.00000       -0.51307     2.00000       -0.51307     2.00000       -0.51307     0.00000        2.63873     0.00000        2.63873     0.00000        2.63873     0.00000        3.32344     0.00000        8.19820     0.00000        8.19820     0.00000        8.49784
   2        0.0312500      0.0000000      0.0312500     2.00000      -12.23726     2.00000       -0.63111     2.00000       -0.58192     2.00000       -0.58192     0.00000        2.59332     0.00000        2.72956     0.00000        2.72956     0.00000        3.43372     0.00000        8.07207     0.00000        8.21766     0.00000        8.54820
   3        0.0625000      0.0000000      0.0625000     2.00000      -12.18884     2.00000       -0.94809     2.00000       -0.76829     2.00000       -0.76829     0.00000        2.46528     0.00000        2.98125     0.00000        2.98125     0.00000        3.72835     0.00000        7.74731     0.00000        8.27436     0.00000        8.70994
   4        0.0937500      0.0000000      0.0937500     2.00000      -12.10926     2.00000       -1.38017     2.00000       -1.02496     2.00000       -1.02496     0.00000        2.27609     0.00000        3.34346     0.00000        3.34346     0.00000        4.10605     0.00000        7.34140     0.00000        8.36596     0.00000        8.99472
   5        0.1250000      0.0000000      0.1250000     2.00000      -11.99943     2.00000       -1.86399     2.00000       -1.30900     2.00000       -1.30900     0.00000        2.05068     0.00000        3.77089     0.00000        3.77089     0.00000        4.42389     0.00000        6.99858     0.00000        8.49339     0.00000        9.39582
   6        0.1562500      0.0000000      0.1562500     2.00000      -11.85801     2.00000       -2.38826     2.00000       -1.60102     2.00000       -1.60102     0.00000        1.80841     0.00000        4.24734     0.00000        4.24734     0.00000        4.50714     0.00000        6.90796     0.00000        8.65966     0.00000        9.89602
   7        0.1875000      0.0000000      0.1875000     2.00000      -11.68358     2.00000       -2.94884     2.00000       -1.89212     2.00000       -1.89212     0.00000        1.56504     0.00000        4.26858     0.00000        4.76656     0.00000        4.76656     0.00000        7.17822     0.00000        8.86523     0.00000       10.47344
   8        0.2187500      0.0000000      0.2187500     2.00000      -11.47790     2.00000       -3.51940     2.00000       -2.16892     2.00000       -2.16892     0.00000        1.33694     0.00000        3.83171     0.00000        5.31040     0.00000        5.31040     0.00000        7.68924     0.00000        9.10758     0.00000       11.10307
   9        0.2500000      0.0000000      0.2500000     2.00000      -11.24359     2.00000       -4.08300     2.00000       -2.42098     2.00000       -2.42098     0.00000        1.13456     0.00000        3.33364     0.00000        5.86399     0.00000        5.86399     0.00000        8.30329     0.00000        9.38594     0.00000       11.76126
  10        0.2812500      0.0000000      0.2812500     2.00000      -10.97870     2.00000       -4.64632     2.00000       -2.64714     2.00000       -2.64714     0.00000        0.95922     0.00000        2.84131     0.00000        6.42875     0.00000        6.42875     0.00000        8.96260     0.00000        9.70307     0.00000       12.42575
  11        0.3125000      0.0000000      0.3125000     2.00000      -10.68111     2.00000       -5.21262     2.00000       -2.84796     2.00000       -2.84796     0.00000        0.81084     0.00000        2.38333     0.00000        7.00896     0.00000        7.00896     0.00000        9.64577     0.00000       10.06062     0.00000       13.06449
  12        0.3437500      0.0000000      0.3437500     2.00000      -10.35474     2.00000       -5.76776     2.00000       -3.01958     2.00000       -3.01958     0.00000        0.69423     0.00000        1.97318     0.00000        7.59813     0.00000        7.59813     0.00000       10.33163     0.00000       10.45665     0.00000       13.62376
  13        0.3750000      0.0000000      0.3750000     2.00000      -10.00407     2.00000       -6.30378     2.00000       -3.15901     2.00000       -3.15901     0.00000        0.61525     0.00000        1.61705     0.00000        8.18943     0.00000        8.18943     0.00000       10.88973     0.00000       11.00289     0.00000       13.31082
  14        0.4062500      0.0000000      0.4062500     2.00000       -9.62642     2.00000       -6.82899     2.00000       -3.26760     2.00000       -3.26760     0.00000        0.57722     0.00000        1.31593     0.00000        8.78364     0.00000        8.78364     0.00000       11.36191     0.00000       11.65525     0.00000       12.75793
  15        0.4375000      0.0000000      0.4375000     2.00000       -9.21760     2.00000       -7.34762     2.00000       -3.34684     2.00000       -3.34684     0.00000        0.58215     0.00000        1.06874     0.00000        9.37476     0.00000        9.37476     0.00000       11.87457     0.00000       12.16838     0.00000       12.16838
  16        0.4687500      0.0000000      0.4687500     2.00000       -8.78192     2.00000       -7.84968     2.00000       -3.39559     2.00000       -3.39559     0.00000        0.63218     0.00000        0.87383     0.00000        9.91904     0.00000        9.91904     0.00000       11.61488     0.00000       11.61488     0.00000       12.42559
  17        0.5000000      0.0000000      0.5000000     2.00000       -8.32669     2.00000       -8.32669     2.00000       -3.41209     2.00000       -3.41209     0.00000        0.72894     0.00000        0.72894     0.00000       10.20813     0.00000       10.20813     0.00000       11.31685     0.00000       11.31685     0.00000       13.01361
