   1        0.0000000      0.0000000      0.0000000     2.00000    -1871.44620     2.00000    -1871.43784     2.00000     -151.36687     2.00000     -151.32351     2.00000     -102.06483     2.00000     -102.06483     2.00000     -102.06482     2.00000     -102.06116     2.00000     -102.06116     2.00000     -102.06113     2.00000      -12.25296     2.00000       -0.64535     2.00000       -0.64416     2.00000       -0.64407     0.00000        2.49153     0.00000        2.49212     0.00000        2.49271     0.00000        3.17604     0.00000        7.92290     0.00000        7.92608     0.00000        8.31843     0.00000       11.84411     0.00000       11.84885     0.00000       11.84908
   2        0.0555556      0.0000000      0.0555556     2.00000    -1871.44631     2.00000    -1871.43816     2.00000     -151.36628     2.00000     -151.32369     2.00000     -102.06529     2.00000     -102.06528     2.00000     -102.06530     2.00000     -102.06154     2.00000     -102.06109     2.00000     -102.06107     2.00000      -12.20199     2.00000       -0.98789     2.00000       -0.84651     2.00000       -0.84542     0.00000        2.35544     0.00000        2.76019     0.00000        2.76108     0.00000        3.49458     0.00000        7.56188     0.00000        7.98484     0.00000        8.47091     0.00000       11.92959     0.00000       11.93438     0.00000       12.15617
   3        0.1111111      0.0000000      0.1111111     2.00000    -1871.44581     2.00000    -1871.43820     2.00000     -151.36571     2.00000     -151.32525     2.00000     -102.06607     2.00000     -102.06606     2.00000     -102.06515     2.00000     -102.06151     2.00000     -102.06067     2.00000     -102.06065     2.00000      -12.05212     2.00000       -1.75255     2.00000       -1.29981     2.00000       -1.29896     0.00000        2.01515     0.00000        3.40715     0.00000        3.40842     0.00000        4.12616     0.00000        6.86913     0.00000        8.15965     0.00000        8.99119     0.00000       12.17934     0.00000       12.18389     0.00000       12.83150
   4        0.1666667      0.0000000      0.1666667     2.00000    -1871.44549     2.00000    -1871.43871     2.00000     -151.36397     2.00000     -151.32696     2.00000     -102.06738     2.00000     -102.06737     2.00000     -102.06565     2.00000     -102.06213     2.00000     -102.06021     2.00000     -102.06019     2.00000      -11.80427     2.00000       -2.66517     2.00000       -1.80876     2.00000       -1.80810     0.00000        1.59408     0.00000        4.23292     0.00000        4.23465     0.00000        4.26952     0.00000        6.70429     0.00000        8.45285     0.00000        9.84662     0.00000       12.58848     0.00000       12.59257     0.00000       13.62701
   5        0.2222222      0.0000000      0.2222222     2.00000    -1871.44486     2.00000    -1871.43907     2.00000     -151.36213     2.00000     -151.32959     2.00000     -102.06876     2.00000     -102.06876     2.00000     -102.06574     2.00000     -102.06255     2.00000     -102.05962     2.00000     -102.05961     2.00000      -11.45519     2.00000       -3.66032     2.00000       -2.30060     2.00000       -2.30010     0.00000        1.18574     0.00000        3.58974     0.00000        5.17070     0.00000        5.17295     0.00000        7.49017     0.00000        8.86609     0.00000       10.91602     0.00000       13.10699     0.00000       13.11016     0.00000       14.48101
   6        0.2777778      0.0000000      0.2777778     2.00000    -1871.44423     2.00000    -1871.43955     2.00000     -151.35964     2.00000     -151.33264     2.00000     -102.07017     2.00000     -102.07017     2.00000     -102.06592     2.00000     -102.06316     2.00000     -102.05909     2.00000     -102.05908     2.00000      -11.01346     2.00000       -4.64747     2.00000       -2.71934     2.00000       -2.71893     0.00000        0.85328     0.00000        2.72217     0.00000        6.14611     0.00000        6.14887     0.00000        8.60399     0.00000        9.39351     0.00000       12.06745     0.00000       13.55375     0.00000       13.55491     0.00000       15.40260
   7        0.3333333      0.0000000      0.3333333     2.00000    -1871.44365     2.00000    -1871.44012     2.00000     -151.35677     2.00000     -151.33591     2.00000     -102.07145     2.00000     -102.07145     2.00000     -102.06614     2.00000     -102.06393     2.00000     -102.05869     2.00000     -102.05868     2.00000      -10.47264     2.00000       -5.63603     2.00000       -3.05708     2.00000       -3.05674     0.00000        0.60646     0.00000        1.94627     0.00000        7.16304     0.00000        7.16630     0.00000        9.79886     0.00000       10.04339     0.00000       13.14277     0.00000       13.48605     0.00000       13.48818     0.00000       16.38357
   8        0.3888889      0.0000000      0.3888889     2.00000    -1871.44284     2.00000    -1871.44048     2.00000     -151.35383     2.00000     -151.33967     2.00000     -102.07235     2.00000     -102.07234     2.00000     -102.06589     2.00000     -102.06437     2.00000     -102.05832     2.00000     -102.05831     2.00000       -9.84997     2.00000       -6.57772     2.00000       -3.29866     2.00000       -3.29837     0.00000        0.47000     0.00000        1.33061     0.00000        8.19524     0.00000        8.19892     0.00000       10.80817     0.00000       10.97064     0.00000       12.73318     0.00000       12.73718     0.00000       13.81195     0.00000       15.04246
   9        0.4444444      0.0000000      0.4444444     2.00000    -1871.44239     2.00000    -1871.44122     2.00000     -151.35014     2.00000     -151.34288     2.00000     -102.07301     2.00000     -102.07301     2.00000     -102.06600     2.00000     -102.06523     2.00000     -102.05817     2.00000     -102.05817     2.00000       -9.13783     2.00000       -7.49101     2.00000       -3.44605     2.00000       -3.44579     0.00000        0.46378     0.00000        0.88434     0.00000        9.22751     0.00000        9.23128     0.00000       11.69309     0.00000       11.71518     0.00000       11.71932     0.00000       12.08220     0.00000       13.73731     0.00000       13.80958
  10        0.5000000      0.0000000      0.5000000     2.00000    -1871.44156     2.00000    -1871.44156     2.00000     -151.34693     2.00000     -151.34693     2.00000     -102.07314     2.00000     -102.07314     2.00000     -102.06532     2.00000     -102.06532     2.00000     -102.05800     2.00000     -102.05800     2.00000       -8.34845     2.00000       -8.34824     2.00000       -3.49708     2.00000       -3.49683     0.00000        0.59888     0.00000        0.59917     0.00000        9.92773     0.00000        9.92787     0.00000       10.99990     0.00000       10.99991     0.00000       12.69268     0.00000       12.69277     0.00000       13.05945     0.00000       13.05980
