   1        0.5000000      0.2500000      0.7500000     2.00000       -8.16985     2.00000       -8.16985     2.00000       -4.39894     2.00000       -4.39894     0.00000        4.35975     0.00000        4.35975     0.00000        5.12144     0.00000        5.12144     0.00000       10.78522     0.00000       10.78522     0.00000       13.55171
   2        0.5000000      0.2727273      0.7272727     2.00000       -8.45700     2.00000       -7.89233     2.00000       -4.58344     2.00000       -4.14828     0.00000        4.08103     0.00000        4.40096     0.00000        5.09782     0.00000        5.46186     0.00000       10.11590     0.00000       11.21584     0.00000       13.07648
   3        0.5000000      0.2954545      0.7045455     2.00000       -8.73938     2.00000       -7.64606     2.00000       -4.67578     2.00000       -3.85124     0.00000        3.79650     0.00000        4.13966     0.00000        5.45174     0.00000        5.88907     0.00000        9.27631     0.00000       11.42691     0.00000       12.76385
   4        0.5000000      0.3181818      0.6818182     2.00000       -9.00309     2.00000       -7.46264     2.00000       -4.64992     2.00000       -3.52361     0.00000        3.55434     0.00000        3.83288     0.00000        5.92400     0.00000        6.35585     0.00000        8.36456     0.00000       11.47739     0.00000       12.54264
   5        0.5000000      0.3409091      0.6590909     2.00000       -9.24373     2.00000       -7.35743     2.00000       -4.48331     2.00000       -3.18354     0.00000        3.37089     0.00000        3.53574     0.00000        6.45374     0.00000        6.84798     0.00000        7.43335     0.00000       11.40848     0.00000       12.36862
   6        0.5000000      0.3636364      0.6363636     2.00000       -9.45649     2.00000       -7.32451     2.00000       -4.18371     2.00000       -2.84998     0.00000        3.25499     0.00000        3.25420     0.00000        6.50940     0.00000        7.04031     0.00000        7.35256     0.00000       11.23141     0.00000       12.22298
   7        0.5000000      0.3863636      0.6136364     2.00000       -9.63785     2.00000       -7.34133     2.00000       -3.78482     2.00000       -2.53989     0.00000        2.98440     0.00000        3.20713     0.00000        5.66034     0.00000        7.65101     0.00000        7.85015     0.00000       10.95578     0.00000       12.09926
   8        0.5000000      0.4090909      0.5909091     2.00000       -9.78924     2.00000       -7.38246     2.00000       -3.30673     2.00000       -2.26832     0.00000        2.70224     0.00000        3.22904     0.00000        4.89005     0.00000        8.30524     0.00000        8.30299     0.00000       10.64410     0.00000       11.99562
   9        0.5000000      0.4318182      0.5681818     2.00000       -9.90870     2.00000       -7.42979     2.00000       -2.79264     2.00000       -2.04565     0.00000        2.37763     0.00000        3.30621     0.00000        4.26600     0.00000        8.62365     0.00000        8.99668     0.00000       10.45001     0.00000       11.91281
  10        0.5000000      0.4545455      0.5454545     2.00000       -9.99419     2.00000       -7.47082     2.00000       -2.30014     2.00000       -1.87733     0.00000        2.00113     0.00000        3.40867     0.00000        3.84320     0.00000        8.72240     0.00000        9.71746     0.00000       10.52561     0.00000       11.85173
  11        0.5000000      0.4772727      0.5227273     2.00000      -10.04591     2.00000       -7.49806     2.00000       -1.90010     2.00000       -1.77247     0.00000        1.65123     0.00000        3.49884     0.00000        3.60981     0.00000        8.68193     0.00000       10.44497     0.00000       10.78799     0.00000       11.80398
  12        0.5000000      0.5000000      0.5000000     2.00000      -10.06328     2.00000       -7.50764     2.00000       -1.73747     2.00000       -1.73747     0.00000        1.50271     0.00000        3.53581     0.00000        3.53582     0.00000        8.65090     0.00000       10.94875     0.00000       10.94875     0.00000       11.63557
