   1        0.6250000      0.2500000      0.6250000     2.00000      -1807.11267     2.00000      -1807.11266     2.00000       -141.41446     2.00000       -141.41309     2.00000        -95.33493     2.00000        -95.33432     2.00000        -95.32541     2.00000        -95.32175     2.00000        -95.31323     2.00000        -95.31252     2.00000        -10.03619     2.00000         -8.91144     2.00000         -5.56374     2.00000         -3.55961     0.00000          0.94024     0.00000          4.07753     0.00000          7.71035     0.00000          8.19151     0.00000          8.49094     0.00000          8.83334
   2        0.6136364      0.2272727      0.6136364     2.00000      -1807.11267     2.00000      -1807.11266     2.00000       -141.41434     2.00000       -141.41320     2.00000        -95.33492     2.00000        -95.33438     2.00000        -95.32513     2.00000        -95.32203     2.00000        -95.31318     2.00000        -95.31255     2.00000         -9.93172     2.00000         -9.02556     2.00000         -5.46240     2.00000         -3.63936     0.00000          0.85115     0.00000          3.59031     0.00000          8.01248     0.00000          8.50516     0.00000          8.73096     0.00000          9.09398
   3        0.6022727      0.2045455      0.6022727     2.00000      -1807.11266     2.00000      -1807.11266     2.00000       -141.41423     2.00000       -141.41329     2.00000        -95.33490     2.00000        -95.33445     2.00000        -95.32486     2.00000        -95.32229     2.00000        -95.31314     2.00000        -95.31259     2.00000         -9.84376     2.00000         -9.12890     2.00000         -5.33394     2.00000         -3.71234     0.00000          0.76995     0.00000          3.11606     0.00000          8.31840     0.00000          8.82834     0.00000          8.97171     0.00000          9.36093
   4        0.5909091      0.1818182      0.5909091     2.00000      -1807.11266     2.00000      -1807.11266     2.00000       -141.41412     2.00000       -141.41338     2.00000        -95.33488     2.00000        -95.33450     2.00000        -95.32460     2.00000        -95.32253     2.00000        -95.31310     2.00000        -95.31263     2.00000         -9.77157     2.00000         -9.22142     2.00000         -5.18162     2.00000         -3.77829     0.00000          0.69687     0.00000          2.65879     0.00000          8.62658     0.00000          9.15912     0.00000          9.21096     0.00000          9.63268
   5        0.5795455      0.1590909      0.5795455     2.00000      -1807.11265     2.00000      -1807.11265     2.00000       -141.41403     2.00000       -141.41346     2.00000        -95.33486     2.00000        -95.33455     2.00000        -95.32437     2.00000        -95.32275     2.00000        -95.31306     2.00000        -95.31268     2.00000         -9.71379     2.00000         -9.30311     2.00000         -5.01016     2.00000         -3.83698     0.00000          0.63211     0.00000          2.22281     0.00000          8.93493     0.00000          9.44586     0.00000          9.49556     0.00000          9.90735
   6        0.5681818      0.1363636      0.5681818     2.00000      -1807.11265     2.00000      -1807.11265     2.00000       -141.41394     2.00000       -141.41352     2.00000        -95.33483     2.00000        -95.33460     2.00000        -95.32416     2.00000        -95.32295     2.00000        -95.31303     2.00000        -95.31273     2.00000         -9.66870     2.00000         -9.37394     2.00000         -4.82586     2.00000         -3.88821     0.00000          0.57580     0.00000          1.81333     0.00000          9.24041     0.00000          9.67273     0.00000          9.83523     0.00000         10.18240
   7        0.5568182      0.1136364      0.5568182     2.00000      -1807.11264     2.00000      -1807.11264     2.00000       -141.41387     2.00000       -141.41358     2.00000        -95.33480     2.00000        -95.33464     2.00000        -95.32398     2.00000        -95.32313     2.00000        -95.31300     2.00000        -95.31279     2.00000         -9.63440     2.00000         -9.43390     2.00000         -4.63673     2.00000         -3.93182     0.00000          0.52805     0.00000          1.43697     0.00000          9.53844     0.00000          9.88679     0.00000         10.17448     0.00000         10.45425
   8        0.5454545      0.0909091      0.5454545     2.00000      -1807.11264     2.00000      -1807.11264     2.00000       -141.41381     2.00000       -141.41362     2.00000        -95.33478     2.00000        -95.33467     2.00000        -95.32383     2.00000        -95.32327     2.00000        -95.31298     2.00000        -95.31284     2.00000         -9.60911     2.00000         -9.48297     2.00000         -4.45284     2.00000         -3.96768     0.00000          0.48894     0.00000          1.10228     0.00000          9.82194     0.00000         10.08175     0.00000         10.50727     0.00000         10.71732
   9        0.5340909      0.0681818      0.5340909     2.00000      -1807.11264     2.00000      -1807.11264     2.00000       -141.41376     2.00000       -141.41366     2.00000        -95.33476     2.00000        -95.33469     2.00000        -95.32370     2.00000        -95.32339     2.00000        -95.31296     2.00000        -95.31288     2.00000         -9.59119     2.00000         -9.52115     2.00000         -4.28645     2.00000         -3.99569     0.00000          0.45851     0.00000          0.82016     0.00000         10.07970     0.00000         10.24961     0.00000         10.82271     0.00000         10.96241
  10        0.5227273      0.0454545      0.5227273     2.00000      -1807.11264     2.00000      -1807.11263     2.00000       -141.41373     2.00000       -141.41368     2.00000        -95.33474     2.00000        -95.33471     2.00000        -95.32361     2.00000        -95.32347     2.00000        -95.31295     2.00000        -95.31291     2.00000         -9.57936     2.00000         -9.54842     2.00000         -4.15171     2.00000         -4.01574     0.00000          0.43677     0.00000          0.60362     0.00000         10.29426     0.00000         10.38073     0.00000         11.10036     0.00000         11.17357
  11        0.5113636      0.0227273      0.5113636     2.00000      -1807.11263     2.00000      -1807.11263     2.00000       -141.41371     2.00000       -141.41370     2.00000        -95.33473     2.00000        -95.33472     2.00000        -95.32356     2.00000        -95.32353     2.00000        -95.31294     2.00000        -95.31294     2.00000         -9.57265     2.00000         -9.56478     2.00000         -4.06311     2.00000         -4.02780     0.00000          0.42373     0.00000          0.46628     0.00000         10.44102     0.00000         10.46496     0.00000         11.30331     0.00000         11.32424
  12        0.5000000      0.0000000      0.5000000     2.00000      -1807.11263     2.00000      -1807.11263     2.00000       -141.41370     2.00000       -141.41370     2.00000        -95.33473     2.00000        -95.33473     2.00000        -95.32354     2.00000        -95.32354     2.00000        -95.31294     2.00000        -95.31294     2.00000         -9.57048     2.00000         -9.57024     2.00000         -4.03210     2.00000         -4.03183     0.00000          0.41908     0.00000          0.41938     0.00000         10.49397     0.00000         10.49411     0.00000         11.38045     0.00000         11.38046
