   1        0.5000000      0.0000000      0.5000000     2.00000       -8.46130     2.00000       -8.46130     2.00000       -3.61194     2.00000       -3.61193     0.00000        0.47848     0.00000        0.47848     0.00000        9.77699     0.00000        9.77699     0.00000       10.86161     0.00000       10.86161     0.00000       12.55255
   2        0.5000000      0.0357143      0.5357143     2.00000       -8.45414     2.00000       -8.45414     2.00000       -3.67638     2.00000       -3.67638     0.00000        0.60001     0.00000        0.60001     0.00000        9.58601     0.00000        9.58601     0.00000       10.63618     0.00000       10.63618     0.00000       12.66632
   3        0.5000000      0.0714286      0.5714286     2.00000       -8.43383     2.00000       -8.43383     2.00000       -3.84149     2.00000       -3.84149     0.00000        0.93855     0.00000        0.93855     0.00000        8.96085     0.00000        8.96085     0.00000       10.42905     0.00000       10.42905     0.00000       12.73800
   4        0.5000000      0.1071429      0.6071429     2.00000       -8.40413     2.00000       -8.40413     2.00000       -4.04899     2.00000       -4.04899     0.00000        1.43682     0.00000        1.43682     0.00000        8.09832     0.00000        8.09832     0.00000       10.36225     0.00000       10.36225     0.00000       12.80474
   5        0.5000000      0.1428571      0.6428571     2.00000       -8.37028     2.00000       -8.37028     2.00000       -4.25382     2.00000       -4.25382     0.00000        2.04984     0.00000        2.04984     0.00000        7.17892     0.00000        7.17892     0.00000       10.34165     0.00000       10.34165     0.00000       12.87737
   6        0.5000000      0.1785714      0.6785714     2.00000       -8.33807     2.00000       -8.33807     2.00000       -4.42771     2.00000       -4.42771     0.00000        2.75259     0.00000        2.75260     0.00000        6.25810     0.00000        6.25810     0.00000       10.33577     0.00000       10.33577     0.00000       12.94651
   7        0.5000000      0.2142857      0.7142857     2.00000       -8.31465     2.00000       -8.31465     2.00000       -4.54320     2.00000       -4.54320     0.00000        3.50170     0.00000        3.50171     0.00000        5.38048     0.00000        5.38048     0.00000       10.33518     0.00000       10.33518     0.00000       12.99819
   8        0.5000000      0.2500000      0.7500000     2.00000       -8.30614     2.00000       -8.30614     2.00000       -4.58295     2.00000       -4.58295     0.00000        4.03563     0.00000        4.03563     0.00000        4.80381     0.00000        4.80381     0.00000       10.33554     0.00000       10.33554     0.00000       13.01767
