------------------------------------------------------------
          Invoking FHI-aims ...

          When using FHI-aims, please cite the following reference:

            Volker Blum, Ralf Gehrke, Felix Hanke, Paula Havu,
            Ville Havu, Xinguo Ren, Karsten Reuter, and Matthias Scheffler,
            'Ab Initio Molecular Simulations with Numeric Atom-Centered Orbitals',
            Computer Physics Communications 180, 2175-2196 (2009)

          In addition, many other developments in FHI-aims are likely important for
          your particular application. A partial list of references is given at the end of
          this file. Thank you for giving credit to the authors of these developments.

          For any questions about FHI-aims, please visit our slack channel at

            https://fhi-aims.slack.com

          and our main development and support site at

            https://aims-git.rz-berlin.mpg.de .

          The latter site, in particular, has a wiki to collect information, as well
          as an issue tracker to log discussions, suggest improvements, and report issues
          or bugs. https://aims-git.rz-berlin.mpg.de is also the main development site
          of the project and all new and updated code versions can be obtained there.
          Please send an email to aims-coordinators@fhi-berlin.mpg.de and we will add
          you to these sites. They are for you and everyone is welcome there.

------------------------------------------------------------



  Date     :  20220308, Time     :  150655.621
  Time zero on CPU 1             :   0.196603200000000E+01  s.
  Internal wall clock time zero  :           415984015.621  s.

  FHI-aims created a unique identifier for this run for later identification
  aims_uuid : 60E46E08-1D36-4CEE-A598-6362AA188E28

  Build configuration of the current instance of FHI-aims
  -------------------------------------------------------
  FHI-aims version      : 210513
  Commit number         : 300bfe3f4
  CMake host system     : Linux-5.3.18-24.86-default
  CMake version         : 3.17.0
  Fortran compiler      : /mpcdf/soft/SLE_15/packages/x86_64/intel_parallel_studio/2020.4/compilers_and_libraries_2020.4.304/linux/mpi/intel64/bin/mpiifort (Intel) version 19.1.3.20200925
  Fortran compiler flags: -O3 -ip -fp-model precise
  C compiler            : /mpcdf/soft/SLE_15/packages/x86_64/intel/19.1.3/bin/icc (Intel) version 19.1.3.20200925
  C compiler flags      : -O3 -ip -fp-model precise
  C++ compiler          : /mpcdf/soft/SLE_15/packages/x86_64/intel/19.1.3/bin/icpc (Intel) version 19.1.3.20200925
  C++ compiler flags    : -O3 -ip -fp-model precise
  Using MPI
  Using ScaLAPACK
  Using LibXC
  Using i-PI
  Using RLSY
  Linking against: /mpcdf/soft/SLE_15/packages/x86_64/intel_parallel_studio/2020.4/mkl/lib/intel64/libmkl_intel_lp64.so
                   /mpcdf/soft/SLE_15/packages/x86_64/intel_parallel_studio/2020.4/mkl/lib/intel64/libmkl_sequential.so
                   /mpcdf/soft/SLE_15/packages/x86_64/intel_parallel_studio/2020.4/mkl/lib/intel64/libmkl_core.so
                   /mpcdf/soft/SLE_15/packages/x86_64/intel_parallel_studio/2020.4/mkl/lib/intel64/libmkl_blacs_intelmpi_lp64.so
                   /mpcdf/soft/SLE_15/packages/x86_64/intel_parallel_studio/2020.4/mkl/lib/intel64/libmkl_scalapack_lp64.so

  Using       72 parallel tasks.
  Task        0 on host ravl1067 reporting.
  Task        1 on host ravl1067 reporting.
  Task        2 on host ravl1067 reporting.
  Task        3 on host ravl1067 reporting.
  Task        4 on host ravl1067 reporting.
  Task        5 on host ravl1067 reporting.
  Task        6 on host ravl1067 reporting.
  Task        7 on host ravl1067 reporting.
  Task        8 on host ravl1067 reporting.
  Task        9 on host ravl1067 reporting.
  Task       10 on host ravl1067 reporting.
  Task       11 on host ravl1067 reporting.
  Task       12 on host ravl1067 reporting.
  Task       13 on host ravl1067 reporting.
  Task       14 on host ravl1067 reporting.
  Task       15 on host ravl1067 reporting.
  Task       16 on host ravl1067 reporting.
  Task       17 on host ravl1067 reporting.
  Task       18 on host ravl1067 reporting.
  Task       19 on host ravl1067 reporting.
  Task       20 on host ravl1067 reporting.
  Task       21 on host ravl1067 reporting.
  Task       22 on host ravl1067 reporting.
  Task       23 on host ravl1067 reporting.
  Task       24 on host ravl1067 reporting.
  Task       25 on host ravl1067 reporting.
  Task       26 on host ravl1067 reporting.
  Task       27 on host ravl1067 reporting.
  Task       28 on host ravl1067 reporting.
  Task       29 on host ravl1067 reporting.
  Task       30 on host ravl1067 reporting.
  Task       31 on host ravl1067 reporting.
  Task       32 on host ravl1067 reporting.
  Task       33 on host ravl1067 reporting.
  Task       34 on host ravl1067 reporting.
  Task       35 on host ravl1067 reporting.
  Task       36 on host ravl1067 reporting.
  Task       37 on host ravl1067 reporting.
  Task       38 on host ravl1067 reporting.
  Task       39 on host ravl1067 reporting.
  Task       40 on host ravl1067 reporting.
  Task       41 on host ravl1067 reporting.
  Task       42 on host ravl1067 reporting.
  Task       43 on host ravl1067 reporting.
  Task       44 on host ravl1067 reporting.
  Task       45 on host ravl1067 reporting.
  Task       46 on host ravl1067 reporting.
  Task       47 on host ravl1067 reporting.
  Task       48 on host ravl1067 reporting.
  Task       49 on host ravl1067 reporting.
  Task       50 on host ravl1067 reporting.
  Task       51 on host ravl1067 reporting.
  Task       52 on host ravl1067 reporting.
  Task       53 on host ravl1067 reporting.
  Task       54 on host ravl1067 reporting.
  Task       55 on host ravl1067 reporting.
  Task       56 on host ravl1067 reporting.
  Task       57 on host ravl1067 reporting.
  Task       58 on host ravl1067 reporting.
  Task       59 on host ravl1067 reporting.
  Task       60 on host ravl1067 reporting.
  Task       61 on host ravl1067 reporting.
  Task       62 on host ravl1067 reporting.
  Task       63 on host ravl1067 reporting.
  Task       64 on host ravl1067 reporting.
  Task       65 on host ravl1067 reporting.
  Task       66 on host ravl1067 reporting.
  Task       67 on host ravl1067 reporting.
  Task       68 on host ravl1067 reporting.
  Task       69 on host ravl1067 reporting.
  Task       70 on host ravl1067 reporting.
  Task       71 on host ravl1067 reporting.

  Performing system and environment tests:
  | Environment variable OMP_NUM_THREADS correctly set to 1.
  | Checking for ScaLAPACK...
  | Testing pdtran()...
  | All pdtran() tests passed.

  Obtaining array dimensions for all initial allocations:
  
  -----------------------------------------------------------------------
  Parsing control.in (first pass over file, find array dimensions only).
  The contents of control.in will be repeated verbatim below
  unless switched off by setting 'verbatim_writeout .false.' .
  in the first line of control.in .
  -----------------------------------------------------------------------
  
  #===============================================================================
  # FHI-aims file: ./control.in
  # Created using the Atomic Simulation Environment (ASE)
  # Tue Mar  8 15:06:46 2022
  #===============================================================================
  xc                                 pw-lda
  k_grid                             8 8 8
  sc_accuracy_rho                    1e-06
  relativistic                       atomic_zora scalar
  output_level                       MD_light
  use_pimd_wrapper                   localhost 12346
  #===============================================================================
  
  ################################################################################
  #
  #  FHI-aims code project
  #  VB, Fritz-Haber Institut, 2009
  #
  #  Suggested "light" defaults for Si atom (to be pasted into control.in file)
  #  Be sure to double-check any results obtained with these settings for post-processing,
  #  e.g., with the "tight" defaults and larger basis sets.
  #
  ################################################################################
    species        Si
  #     global species definitions
      nucleus             14
      mass                28.0855
  #
      l_hartree           4
  #
      cut_pot             3.5          1.5  1.0
      basis_dep_cutoff    1e-4
  #
      radial_base         42 5.0
      radial_multiplier   1
      angular_grids       specified
        division   0.5866   50
        division   0.9616  110
        division   1.2249  194
        division   1.3795  302
  #      division   1.4810  434
  #      division   1.5529  590
  #      division   1.6284  770
  #      division   1.7077  974
  #      division   2.4068 1202
  #      outer_grid   974
        outer_grid 302
  ################################################################################
  #
  #  Definition of "minimal" basis
  #
  ################################################################################
  #     valence basis states
      valence      3  s   2.
      valence      3  p   2.
  #     ion occupancy
      ion_occ      3  s   1.
      ion_occ      3  p   1.
  ################################################################################
  #
  #  Suggested additional basis functions. For production calculations,
  #  uncomment them one after another (the most important basis functions are
  #  listed first).
  #
  #  Constructed for dimers: 1.75 A, 2.0 A, 2.25 A, 2.75 A, 3.75 A
  #
  ################################################################################
  #  "First tier" - improvements: -571.96 meV to -37.03 meV
       hydro 3 d 4.2
       hydro 2 p 1.4
  #     hydro 4 f 6.2
       ionic 3 s auto
  #  "Second tier" - improvements: -16.76 meV to -3.03 meV
  #     hydro 3 d 9
  #     hydro 5 g 9.4
  #     hydro 4 p 4
  #     hydro 1 s 0.65
  #  "Third tier" - improvements: -3.89 meV to -0.60 meV
  #     ionic 3 d auto
  #     hydro 3 s 2.6
  #     hydro 4 f 8.4
  #     hydro 3 d 3.4
  #     hydro 3 p 7.8
  #  "Fourth tier" - improvements: -0.33 meV to -0.11 meV
  #     hydro 2 p 1.6
  #     hydro 5 g 10.8
  #     hydro 5 f 11.2
  #     hydro 3 d 1
  #     hydro 4 s 4.5
  #  Further basis functions that fell out of the optimization - noise
  #  level... < -0.08 meV
  #     hydro 4 d 6.6
  #     hydro 5 g 16.4
  #     hydro 4 d 9
  
  -----------------------------------------------------------------------
  Completed first pass over input file control.in .
  -----------------------------------------------------------------------
  
  
  -----------------------------------------------------------------------
  Parsing geometry.in (first pass over file, find array dimensions only).
  The contents of geometry.in will be repeated verbatim below
  unless switched off by setting 'verbatim_writeout .false.' .
  in the first line of geometry.in .
  -----------------------------------------------------------------------
  
  #=======================================================
  # FHI-aims file: ./geometry.in
  # Created using the Atomic Simulation Environment (ASE)
  # Tue Mar  8 15:06:46 2022
  #=======================================================
  lattice_vector 0.0000000000000000 2.6045124123935999 2.6045124123935999
  lattice_vector 2.6045124123935999 0.0000000000000000 2.6045124123935999
  lattice_vector 2.6045124123935999 2.6045124123935999 0.0000000000000000
  atom_frac 0.0000000000000000 0.0000000000000000 -0.0000000000000000 Si
  atom_frac 0.2500000000000000 0.2500000000000000 0.2500000000000000 Si
  
  -----------------------------------------------------------------------
  Completed first pass over input file geometry.in .
  -----------------------------------------------------------------------
  

  Basic array size parameters:
  | Number of species                 :        1
  | Number of atoms                   :        2
  | Number of lattice vectors         :        3
  | Max. basis fn. angular momentum   :        2
  | Max. atomic/ionic basis occupied n:        3
  | Max. number of basis fn. types    :        3
  | Max. radial fns per species/type  :        5
  | Max. logarithmic grid size        :     1346
  | Max. radial integration grid size :       42
  | Max. angular integration grid size:      302
  | Max. angular grid division number :        8
  | Radial grid for Hartree potential :     1346
  | Number of spin channels           :        1

------------------------------------------------------------
          Reading file control.in.
------------------------------------------------------------
  XC: Using Perdew-Wang parametrisation of Ceperley-Alder LDA.
  Found k-point grid:         8         8         8
  Convergence accuracy of self-consistent charge density:  0.1000E-05
  Scalar relativistic treatment of kinetic energy: on-site free-atom approximation to ZORA.
  Requested output level: MD_light
  Using external wrapper (i-PI) for performing (path integral) molecular dynamics
  **Attention: initial geometry.in file will be ignored!
 
  Reading configuration options for species Si                  .
  | Found nuclear charge :  14.0000
  | Found atomic mass :    28.0855000000000      amu
  | Found l_max for Hartree potential  :   4
  | Found cutoff potl. onset [A], width [A], scale factor :    3.50000    1.50000    1.00000
  | Threshold for basis-dependent cutoff potential is   0.100000E-03
  | Found data for basic radial integration grid :    42 points, outermost radius =    5.000 A
  | Found multiplier for basic radial grid :   1
  | Found angular grid specification: user-specified.
  | Specified grid contains     5 separate shells.
  | Check grid settings after all constraints further below.
  | Found free-atom valence shell :  3 s   2.000
  | Found free-atom valence shell :  3 p   2.000
  | Found free-ion valence shell :  3 s   1.000
  | Found free-ion valence shell :  3 p   1.000
  | Found hydrogenic basis function :  3 d   4.200
  | Found hydrogenic basis function :  2 p   1.400
  | Found ionic basis function :  3 s , default cutoff radius.
  Species Si                  : Missing cutoff potential type.
  Defaulting to exp(1/x)/(1-x)^2 type cutoff potential.
  Species Si: No 'logarithmic' tag. Using default grid for free atom:
  | Default logarithmic grid data [bohr] : 0.1000E-03 0.1000E+03 0.1012E+01
  | Will include ionic basis functions of  2.0-fold positive Si                   ion.
  Species Si: On-site basis accuracy parameter (for Gram-Schmidt orthonormalisation) not specified.
  Using default value basis_acc =  0.1000000E-03.
  Species Si                  : Using default innermost maximum threshold i_radial=  2 for radial functions.
  Species Si                  : Default cutoff onset for free atom density etc. : 0.35000000E+01 AA.
  Species Si                  : Basic radial grid will be enhanced according to radial_multiplier =   1, to contain    42 grid points.
 
  Finished reading input file 'control.in'.
 
------------------------------------------------------------


------------------------------------------------------------
          Reading geometry description geometry.in.
------------------------------------------------------------
  | The smallest distance between any two atoms is         2.25557391 AA.
  | The first atom of this pair is atom number                      1 .
  | The second atom of this pair is atom number                     2 .
  | Wigner-Seitz cell of the first atom image           0     1     0 .
  | (The Wigner-Seitz cell of the second atom is 0 0 0  by definition.)

  Symmetry information by spglib:
  | Precision set to  0.1E-04
  | Number of Operations  : 48
  | Space group           : 227
  | International         : Fd-3m
  | Schoenflies           : Oh^7
  Input structure read successfully.
  The structure contains        2 atoms,  and a total of         28.000 electrons.

  Input geometry:
  | Unit cell:
  |        0.00000000        2.60451241        2.60451241
  |        2.60451241        0.00000000        2.60451241
  |        2.60451241        2.60451241        0.00000000
  | Atomic structure:
  |       Atom                x [A]            y [A]            z [A]
  |    1: Species Si            0.00000000        0.00000000        0.00000000
  |    2: Species Si            1.30225621        1.30225621        1.30225621

  Lattice parameters for 3D lattice (in Angstroms) :     3.683337    3.683337    3.683337
  Angle(s) between unit vectors (in degrees)       :    60.000000   60.000000   60.000000


  Quantities derived from the lattice vectors:
  | Reciprocal lattice vector 1: -1.206211  1.206211  1.206211
  | Reciprocal lattice vector 2:  1.206211 -1.206211  1.206211
  | Reciprocal lattice vector 3:  1.206211  1.206211 -1.206211
  | Unit cell volume                               :   0.353353E+02  A^3

 
  Finished reading input file 'control.in'.
 

------------------------------------------------------------
          Reading geometry description geometry.in.
------------------------------------------------------------
 
  Consistency checks for stacksize environment parameter are next.
 
  | Maximum stacksize for task 0: unlimited
  | Maximum stacksize for task 1: unlimited
  | Maximum stacksize for task 2: unlimited
  | Maximum stacksize for task 3: unlimited
  | Maximum stacksize for task 4: unlimited
  | Maximum stacksize for task 5: unlimited
  | Maximum stacksize for task 6: unlimited
  | Maximum stacksize for task 7: unlimited
  | Maximum stacksize for task 8: unlimited
  | Maximum stacksize for task 9: unlimited
  | Maximum stacksize for task 10: unlimited
  | Maximum stacksize for task 11: unlimited
  | Maximum stacksize for task 12: unlimited
  | Maximum stacksize for task 13: unlimited
  | Maximum stacksize for task 14: unlimited
  | Maximum stacksize for task 15: unlimited
  | Maximum stacksize for task 16: unlimited
  | Maximum stacksize for task 17: unlimited
  | Maximum stacksize for task 18: unlimited
  | Maximum stacksize for task 19: unlimited
  | Maximum stacksize for task 20: unlimited
  | Maximum stacksize for task 21: unlimited
  | Maximum stacksize for task 22: unlimited
  | Maximum stacksize for task 23: unlimited
  | Maximum stacksize for task 24: unlimited
  | Maximum stacksize for task 25: unlimited
  | Maximum stacksize for task 26: unlimited
  | Maximum stacksize for task 27: unlimited
  | Maximum stacksize for task 28: unlimited
  | Maximum stacksize for task 29: unlimited
  | Maximum stacksize for task 30: unlimited
  | Maximum stacksize for task 31: unlimited
  | Maximum stacksize for task 32: unlimited
  | Maximum stacksize for task 33: unlimited
  | Maximum stacksize for task 34: unlimited
  | Maximum stacksize for task 35: unlimited
  | Maximum stacksize for task 36: unlimited
  | Maximum stacksize for task 37: unlimited
  | Maximum stacksize for task 38: unlimited
  | Maximum stacksize for task 39: unlimited
  | Maximum stacksize for task 40: unlimited
  | Maximum stacksize for task 41: unlimited
  | Maximum stacksize for task 42: unlimited
  | Maximum stacksize for task 43: unlimited
  | Maximum stacksize for task 44: unlimited
  | Maximum stacksize for task 45: unlimited
  | Maximum stacksize for task 46: unlimited
  | Maximum stacksize for task 47: unlimited
  | Maximum stacksize for task 48: unlimited
  | Maximum stacksize for task 49: unlimited
  | Maximum stacksize for task 50: unlimited
  | Maximum stacksize for task 51: unlimited
  | Maximum stacksize for task 52: unlimited
  | Maximum stacksize for task 53: unlimited
  | Maximum stacksize for task 54: unlimited
  | Maximum stacksize for task 55: unlimited
  | Maximum stacksize for task 56: unlimited
  | Maximum stacksize for task 57: unlimited
  | Maximum stacksize for task 58: unlimited
  | Maximum stacksize for task 59: unlimited
  | Maximum stacksize for task 60: unlimited
  | Maximum stacksize for task 61: unlimited
  | Maximum stacksize for task 62: unlimited
  | Maximum stacksize for task 63: unlimited
  | Maximum stacksize for task 64: unlimited
  | Maximum stacksize for task 65: unlimited
  | Maximum stacksize for task 66: unlimited
  | Maximum stacksize for task 67: unlimited
  | Maximum stacksize for task 68: unlimited
  | Maximum stacksize for task 69: unlimited
  | Maximum stacksize for task 70: unlimited
  | Maximum stacksize for task 71: unlimited
  | Current stacksize for task 0: unlimited
  | Current stacksize for task 1: unlimited
  | Current stacksize for task 2: unlimited
  | Current stacksize for task 3: unlimited
  | Current stacksize for task 4: unlimited
  | Current stacksize for task 5: unlimited
  | Current stacksize for task 6: unlimited
  | Current stacksize for task 7: unlimited
  | Current stacksize for task 8: unlimited
  | Current stacksize for task 9: unlimited
  | Current stacksize for task 10: unlimited
  | Current stacksize for task 11: unlimited
  | Current stacksize for task 12: unlimited
  | Current stacksize for task 13: unlimited
  | Current stacksize for task 14: unlimited
  | Current stacksize for task 15: unlimited
  | Current stacksize for task 16: unlimited
  | Current stacksize for task 17: unlimited
  | Current stacksize for task 18: unlimited
  | Current stacksize for task 19: unlimited
  | Current stacksize for task 20: unlimited
  | Current stacksize for task 21: unlimited
  | Current stacksize for task 22: unlimited
  | Current stacksize for task 23: unlimited
  | Current stacksize for task 24: unlimited
  | Current stacksize for task 25: unlimited
  | Current stacksize for task 26: unlimited
  | Current stacksize for task 27: unlimited
  | Current stacksize for task 28: unlimited
  | Current stacksize for task 29: unlimited
  | Current stacksize for task 30: unlimited
  | Current stacksize for task 31: unlimited
  | Current stacksize for task 32: unlimited
  | Current stacksize for task 33: unlimited
  | Current stacksize for task 34: unlimited
  | Current stacksize for task 35: unlimited
  | Current stacksize for task 36: unlimited
  | Current stacksize for task 37: unlimited
  | Current stacksize for task 38: unlimited
  | Current stacksize for task 39: unlimited
  | Current stacksize for task 40: unlimited
  | Current stacksize for task 41: unlimited
  | Current stacksize for task 42: unlimited
  | Current stacksize for task 43: unlimited
  | Current stacksize for task 44: unlimited
  | Current stacksize for task 45: unlimited
  | Current stacksize for task 46: unlimited
  | Current stacksize for task 47: unlimited
  | Current stacksize for task 48: unlimited
  | Current stacksize for task 49: unlimited
  | Current stacksize for task 50: unlimited
  | Current stacksize for task 51: unlimited
  | Current stacksize for task 52: unlimited
  | Current stacksize for task 53: unlimited
  | Current stacksize for task 54: unlimited
  | Current stacksize for task 55: unlimited
  | Current stacksize for task 56: unlimited
  | Current stacksize for task 57: unlimited
  | Current stacksize for task 58: unlimited
  | Current stacksize for task 59: unlimited
  | Current stacksize for task 60: unlimited
  | Current stacksize for task 61: unlimited
  | Current stacksize for task 62: unlimited
  | Current stacksize for task 63: unlimited
  | Current stacksize for task 64: unlimited
  | Current stacksize for task 65: unlimited
  | Current stacksize for task 66: unlimited
  | Current stacksize for task 67: unlimited
  | Current stacksize for task 68: unlimited
  | Current stacksize for task 69: unlimited
  | Current stacksize for task 70: unlimited
  | Current stacksize for task 71: unlimited
 
  Consistency checks for the contents of control.in are next.
 
  MPI_IN_PLACE appears to work with this MPI implementation.
  | Keeping use_mpi_in_place .true. (see manual).
  Target number of points in a grid batch is not set. Defaulting to  100
  Method for grid partitioning is not set. Defaulting to parallel hash+maxmin partitioning.
  Batch size limit is not set. Defaulting to    200
  By default, will store active basis functions for each batch.
  If in need of memory, prune_basis_once .false. can be used to disable this option.
  communication_type for Hartree potential was not specified.
  Defaulting to calc_hartree .
  Defaulting to Pulay charge density mixer.
  Pulay mixer: Number of relevant iterations not set.
  Defaulting to    8 iterations.
  Pulay mixer: Number of initial linear mixing iterations not set.
  Defaulting to    0 iterations.
  Work space size for distributed Hartree potential not set.
  Defaulting to   0.200000E+03 MB.
  Mixing parameter for charge density mixing has not been set.
  Using default: charge_mix_param =     0.0500.
  The mixing parameter will be adjusted in iteration number     2 of the first full s.c.f. cycle only.
  Algorithm-dependent basis array size parameters:
  | n_max_pulay                         :        8
  Maximum number of self-consistency iterations not provided.
  Presetting  1000 iterations.
  Presetting      1001 iterations before the initial mixing cycle
  is restarted anyway using the sc_init_iter criterion / keyword.
  Presetting a factor      1.000 between actual scf density residual
  and density convergence criterion sc_accuracy_rho below which sc_init_iter
  takes no effect.
  Calculation of forces was not defined in control.in. No forces will be calculated.
  Geometry relaxation not requested: no relaxation will be performed.
  Force calculation: scf convergence accuracy of forces not set.
  Defaulting to 'sc_accuracy_forces not_checked'.
  Handling of forces: Unphysical translation and rotation will be removed from forces.
  No accuracy limit for integral partition fn. given. Defaulting to  0.1000E-14.
  No threshold value for u(r) in integrations given. Defaulting to  0.1000E-05.
  No occupation type (smearing scheme) given. Defaulting to Gaussian broadening, width =  0.1000E-01 eV.
  The width will be adjusted in iteration number     2 of the first full s.c.f. cycle only.
  S.C.F. convergence parameters will be adjusted in iteration number     2 of the first full s.c.f. cycle only.
  No accuracy for occupation numbers given. Defaulting to  0.1000E-12.
  No threshold value for occupation numbers given. Defaulting to  0.0000E+00.
  No accuracy for fermi level given. Defaulting to  0.1000E-19.
  Maximum # of iterations to find E_F not set. Defaulting to  200.
  Preferred method for the eigenvalue solver ('KS_method') not specified in 'control.in'.
  Defaulting to serial version, LAPACK (via ELSI), since more k-points than CPUs available.
  Will not use alltoall communication since running on < 1024 CPUs.
  Threshold for basis singularities not set.
  Default threshold for basis singularities:  0.1000E-04
  partition_type (choice of integration weights) for integrals was not specified.
  | Using a version of the partition function of Stratmann and coworkers ('stratmann_sparse').
  | At each grid point, the set of atoms used to build the partition table is smoothly restricted to
  | only those atoms whose free-atom density would be non-zero at that grid point.
  Partitioning for Hartree potential was not defined. Using partition_type for integrals.
  | Adjusted default value of keyword multip_moments_threshold to:       0.10000000E-11
  | This value may affect high angular momentum components of the Hartree potential in periodic systems.
  Spin handling was not defined in control.in. Defaulting to unpolarized case.
  Angular momentum expansion for Kerker preconditioner not set explicitly.
  | Using default value of   0
  No explicit requirement for turning off preconditioner.
  | By default, it will be turned off when the charge convergence reaches
  | sc_accuracy_rho  =   0.100000E-05
  No special mixing parameter while Kerker preconditioner is on.
  Using default: charge_mix_param =     0.0500.
  No q(lm)/r^(l+1) cutoff set for long-range Hartree potential.
  | Using default value of  0.100000E-09 .
  | Verify using the multipole_threshold keyword.
  Defaulting to new monopole extrapolation.
  Density update method: automatic selection selected.
  Using density matrix based charge density update.
  Using density matrix based charge density update.
  Using packed matrix style: index .
  Defaulting to use time-reversal symmetry for k-point grid.
  Charge integration errors on the 3D integration grid will be compensated
  by explicit normalization and distribution of residual charges.
  Use the "compensate_multipole_errors" flag to change this behaviour.
  Set 'collect_eigenvectors' to be '.true.' for all serial calculations. This is mandatory.
  Set 'collect_eigenvectors' to be '.true.' for KS_method lapack_fast and serial.
 
  Consistency checks for the contents of geometry.in are next.
 

  Range separation radius for Ewald summation (hartree_convergence_parameter):      3.71298181 bohr.
  Number of empty states per atom not set in control.in - providing a guess from actual geometry.
  | Total number of empty states used during s.c.f. cycle:        6
  If you use a very high smearing, use empty_states (per atom!) in control.in to increase this value.

  Structure-dependent array size parameters: 
  | Maximum number of distinct radial functions  :        8
  | Maximum number of basis functions            :       36
  | Number of Kohn-Sham states (occupied + empty):       20
------------------------------------------------------------

************************** W A R N I N G *******************************
* You are using the PIMD wrapper. Specifications and positions         *
* in geometry.in will be IGNORED - all is received from the wrapper.   *
* Please make sure species are declared in the same order in           *
* geometry.in and wrapper input.                                       *
************************************************************************


------------------------------------------------------------
          Preparing all fixed parts of the calculation.
------------------------------------------------------------
  Determining machine precision:
    2.225073858507201E-308
  Setting up grids for atomic and cluster calculations.

  Creating wave function, potential, and density for free atoms.

  Species: Si

  List of occupied orbitals and eigenvalues:
    n    l              occ      energy [Ha]    energy [eV]
    1    0           2.0000       -65.491668     -1782.1190
    2    0           2.0000        -5.087967      -138.4506
    3    0           2.0000        -0.391471       -10.6525
    2    1           6.0000        -3.502246       -95.3010
    3    1           2.0000        -0.143943        -3.9169


  Adding cutoff potential to free-atom effective potential.
  Creating fixed part of basis set: Ionic, confined, hydrogenic.
 
  Si                   ion:

  List of free ionic orbitals and eigenvalues:
    n    l      energy [Ha]    energy [eV]
    1    0       -66.364436     -1805.8682
    2    0        -5.935799      -161.5213
    3    0        -1.078166       -29.3384
    2    1        -4.351123      -118.4001
    3    1        -0.781733       -21.2720


  List of ionic basis orbitals and eigenvalues:
    n    l      energy [Ha]    energy [eV]    outer radius [A]
    3    0        -1.078146       -29.3378       4.214062

 
  Si                   hydrogenic:
 
  List of hydrogenic basis orbitals: 
    n    l      effective z      eigenvalue [eV]  inner max. [A]     outer max. [A]     outer radius [A]   
    3    2         4.200000       -26.6624           1.139231           1.139231           4.534782
    2    1         1.400000        -6.4613           1.472672           1.472672           4.590560
 
  Creating atomic-like basis functions for current effective potential.

  Species Si                  :

  List of atomic basis orbitals and eigenvalues:
    n    l      energy [Ha]    energy [eV]    outer radius [A]
    1    0       -65.491668     -1782.1190       0.789468
    2    0        -5.087967      -138.4506       2.815114
    3    0        -0.391471       -10.6525       4.534782
    2    1        -3.502246       -95.3010       3.259919
    3    1        -0.143943        -3.9169       4.590560

  Assembling full basis from fixed parts.
  | Species Si :   atomic orbital   1 s accepted.
  | Species Si :   atomic orbital   2 s accepted.
  | Species Si :    ionic orbital   3 s accepted.
  | Species Si :   atomic orbital   3 s accepted.
  | Species Si :   atomic orbital   2 p accepted.
  | Species Si :   atomic orbital   3 p accepted.
  | Species Si :    hydro orbital   2 p accepted.
  | Species Si :    hydro orbital   3 d accepted.
 
  Basis size parameters after reduction:
  | Total number of radial functions:        8
  | Total number of basis functions :       36
 
  Per-task memory consumption for arrays in subroutine allocate_ext:
  |           2.757868MB.
  Testing on-site integration grid accuracy.
  |  Species  Function  <phi|h_atom|phi> (log., in eV)  <phi|h_atom|phi> (rad., in eV)
           1        1              -1782.1189727076              -1782.1182429251
           1        2               -138.4506350693               -138.4506310079
           1        3                -10.3030408815                -10.3029120678
           1        4                  5.0238999146                  4.9457540310 ***
           1        5                -95.3009689499                -95.3009689315
           1        6                 -3.9266496564                 -3.9420918374
           1        7                  6.3453628447                  6.1632372158 ***
           1        8                  6.2883050744                  6.2861881409
 * Note: Onsite integrals marked "***" above are less accurate than
 * onsite_accuracy_threshold =    0.03000 eV. Usually, this is harmless.
 * When in doubt, tighten the "radial" and/or "radial_multiplier" flags to check.

  Preparing densities etc. for the partition functions (integrals / Hartree potential).

  Preparations completed.
  max(cpu_time)          :      0.148 s.
  Wall clock time (cpu1) :      0.192 s.
------------------------------------------------------------

************************** W A R N I N G *******************************
* Skipping the SCF initialization for now - done inside wrapper      *
************************************************************************

  @ DRIVER MODE: Connecting to host:port localhost       12346
  @ DRIVER MODE: Message from server: STATUS      
  @ DRIVER MODE: Message from server: POSDATA     
  @ DRIVER MODE: Received positions 

------------------------------------------------------------
          Begin self-consistency loop: Initialization.

          Date     :  20220308, Time     :  150656.651
------------------------------------------------------------

  Initializing index lists of integration centers etc. from given atomic structure:
  Mapping all atomic coordinates to central unit cell.

  Initializing the k-points
  Using symmetry for reducing the k-points
  | k-points reduced from:      512 to      260
  | Number of k-points                             :       260
  The eigenvectors in the calculations are COMPLEX.
  | K-points in task   0:         3
  | K-points in task   1:         4
  | K-points in task   2:         4
  | K-points in task   3:         4
  | K-points in task   4:         4
  | K-points in task   5:         4
  | K-points in task   6:         4
  | K-points in task   7:         4
  | K-points in task   8:         4
  | K-points in task   9:         4
  | K-points in task  10:         4
  | K-points in task  11:         4
  | K-points in task  12:         4
  | K-points in task  13:         4
  | K-points in task  14:         4
  | K-points in task  15:         4
  | K-points in task  16:         4
  | K-points in task  17:         4
  | K-points in task  18:         4
  | K-points in task  19:         4
  | K-points in task  20:         4
  | K-points in task  21:         4
  | K-points in task  22:         4
  | K-points in task  23:         4
  | K-points in task  24:         4
  | K-points in task  25:         4
  | K-points in task  26:         4
  | K-points in task  27:         4
  | K-points in task  28:         4
  | K-points in task  29:         4
  | K-points in task  30:         4
  | K-points in task  31:         4
  | K-points in task  32:         4
  | K-points in task  33:         4
  | K-points in task  34:         4
  | K-points in task  35:         4
  | K-points in task  36:         4
  | K-points in task  37:         4
  | K-points in task  38:         4
  | K-points in task  39:         4
  | K-points in task  40:         4
  | K-points in task  41:         4
  | K-points in task  42:         4
  | K-points in task  43:         4
  | K-points in task  44:         4
  | K-points in task  45:         3
  | K-points in task  46:         3
  | K-points in task  47:         3
  | K-points in task  48:         3
  | K-points in task  49:         3
  | K-points in task  50:         3
  | K-points in task  51:         3
  | K-points in task  52:         3
  | K-points in task  53:         3
  | K-points in task  54:         3
  | K-points in task  55:         3
  | K-points in task  56:         3
  | K-points in task  57:         3
  | K-points in task  58:         3
  | K-points in task  59:         3
  | K-points in task  60:         3
  | K-points in task  61:         3
  | K-points in task  62:         3
  | K-points in task  63:         3
  | K-points in task  64:         3
  | K-points in task  65:         3
  | K-points in task  66:         3
  | K-points in task  67:         3
  | K-points in task  68:         3
  | K-points in task  69:         3
  | K-points in task  70:         3
  | K-points in task  71:         3
  | Number of basis functions in the Hamiltonian integrals :      1472
  | Number of basis functions in a single unit cell        :        36
  | Number of centers in hartree potential         :       732
  | Number of centers in hartree multipole         :       336
  | Number of centers in electron density summation:       228
  | Number of centers in basis integrals           :       288
  | Number of centers in integrals                 :       101
  | Number of centers in hamiltonian               :       228
  | Consuming        576 KiB for k_phase.
  | Number of super-cells (origin) [n_cells]                     :        2197
  | Number of super-cells (after PM_index) [n_cells]             :         142
  | Number of super-cells in hamiltonian [n_cells_in_hamiltonian]:         142
  | Size of matrix packed + index [n_hamiltonian_matrix_size] :       48927
  | Estimated reciprocal-space cutoff momentum G_max:         2.51981341 bohr^-1 .
  | Reciprocal lattice points for long-range Hartree potential:      58
  Partitioning the integration grid into batches with parallel hashing+maxmin method.
  | Number of batches:      157
  | Maximal batch size:     105
  | Minimal batch size:       4
  | Average batch size:      71.389
  | Standard deviation of batch sizes:      23.561

  Integration load balanced across    72 MPI tasks.
  Work distribution over tasks is as follows:
  Task     0 has        184 integration points.
  Task     1 has        153 integration points.
  Task     2 has        148 integration points.
  Task     3 has        160 integration points.
  Task     4 has        146 integration points.
  Task     5 has        143 integration points.
  Task     6 has        150 integration points.
  Task     7 has        151 integration points.
  Task     8 has        159 integration points.
  Task     9 has        134 integration points.
  Task    10 has        148 integration points.
  Task    11 has        128 integration points.
  Task    12 has        140 integration points.
  Task    13 has        181 integration points.
  Task    14 has        186 integration points.
  Task    15 has        185 integration points.
  Task    16 has        153 integration points.
  Task    17 has        181 integration points.
  Task    18 has        150 integration points.
  Task    19 has        168 integration points.
  Task    20 has        176 integration points.
  Task    21 has        181 integration points.
  Task    22 has        184 integration points.
  Task    23 has        151 integration points.
  Task    24 has        171 integration points.
  Task    25 has        146 integration points.
  Task    26 has        137 integration points.
  Task    27 has        132 integration points.
  Task    28 has        166 integration points.
  Task    29 has        152 integration points.
  Task    30 has        155 integration points.
  Task    31 has        129 integration points.
  Task    32 has        171 integration points.
  Task    33 has        156 integration points.
  Task    34 has        159 integration points.
  Task    35 has        154 integration points.
  Task    36 has        159 integration points.
  Task    37 has        163 integration points.
  Task    38 has        154 integration points.
  Task    39 has        123 integration points.
  Task    40 has        174 integration points.
  Task    41 has        173 integration points.
  Task    42 has        161 integration points.
  Task    43 has        169 integration points.
  Task    44 has        151 integration points.
  Task    45 has        126 integration points.
  Task    46 has        147 integration points.
  Task    47 has        172 integration points.
  Task    48 has        129 integration points.
  Task    49 has        146 integration points.
  Task    50 has        149 integration points.
  Task    51 has        149 integration points.
  Task    52 has        144 integration points.
  Task    53 has        129 integration points.
  Task    54 has        148 integration points.
  Task    55 has        156 integration points.
  Task    56 has        132 integration points.
  Task    57 has        132 integration points.
  Task    58 has        131 integration points.
  Task    59 has        159 integration points.
  Task    60 has        147 integration points.
  Task    61 has        175 integration points.
  Task    62 has        164 integration points.
  Task    63 has        165 integration points.
  Task    64 has        164 integration points.
  Task    65 has        165 integration points.
  Task    66 has        160 integration points.
  Task    67 has        167 integration points.
  Task    68 has        162 integration points.
  Task    69 has        194 integration points.
  Task    70 has        123 integration points.
  Task    71 has        178 integration points.
  Initializing partition tables, free-atom densities, potentials, etc. across the integration grid (initialize_grid_storage).
  | initialize_grid_storage: Actual outermost partition radius vs. multipole_radius_free
  | (-- VB: in principle, multipole_radius_free should be larger, hence this output)
  | Species        1: Confinement radius =              4.999999999999999 AA, multipole_radius_free =              5.000694715736543 AA.
  | Species        1: outer_partition_radius set to              5.000694715736543 AA .
  | The sparse table of interatomic distances needs        405.65 kbyte instead of       663.55 kbyte of memory.
  | Net number of integration points:    11208
  | of which are non-zero points    :     9628
  | Numerical average free-atom electrostatic potential    :    -14.89356654 eV
  Renormalizing the initial density to the exact electron count on the 3D integration grid.
  | Initial density: Formal number of electrons (from input files) :      28.0000000000
  | Integrated number of electrons on 3D grid     :      28.0062162948
  | Charge integration error                      :       0.0062162948
  | Normalization factor for density and gradient :       0.9997780387
  Renormalizing the free-atom superposition density to the exact electron count on the 3D integration grid.
  | Formal number of electrons (from input files) :      28.0000000000
  | Integrated number of electrons on 3D grid     :      28.0062162948
  | Charge integration error                      :       0.0062162948
  | Normalization factor for density and gradient :       0.9997780387
  Obtaining max. number of non-zero basis functions in each batch (get_n_compute_maxes).
  | Maximal number of non-zero basis functions:      508 in task     0
  | Maximal number of non-zero basis functions:      489 in task     1
  | Maximal number of non-zero basis functions:      487 in task     2
  | Maximal number of non-zero basis functions:      480 in task     3
  | Maximal number of non-zero basis functions:      450 in task     4
  | Maximal number of non-zero basis functions:      465 in task     5
  | Maximal number of non-zero basis functions:      448 in task     6
  | Maximal number of non-zero basis functions:      501 in task     7
  | Maximal number of non-zero basis functions:      453 in task     8
  | Maximal number of non-zero basis functions:      488 in task     9
  | Maximal number of non-zero basis functions:      480 in task    10
  | Maximal number of non-zero basis functions:      430 in task    11
  | Maximal number of non-zero basis functions:      480 in task    12
  | Maximal number of non-zero basis functions:      523 in task    13
  | Maximal number of non-zero basis functions:      507 in task    14
  | Maximal number of non-zero basis functions:      487 in task    15
  | Maximal number of non-zero basis functions:      466 in task    16
  | Maximal number of non-zero basis functions:      510 in task    17
  | Maximal number of non-zero basis functions:      454 in task    18
  | Maximal number of non-zero basis functions:      476 in task    19
  | Maximal number of non-zero basis functions:      494 in task    20
  | Maximal number of non-zero basis functions:      490 in task    21
  | Maximal number of non-zero basis functions:      462 in task    22
  | Maximal number of non-zero basis functions:      495 in task    23
  | Maximal number of non-zero basis functions:      462 in task    24
  | Maximal number of non-zero basis functions:      474 in task    25
  | Maximal number of non-zero basis functions:      477 in task    26
  | Maximal number of non-zero basis functions:      444 in task    27
  | Maximal number of non-zero basis functions:      477 in task    28
  | Maximal number of non-zero basis functions:      505 in task    29
  | Maximal number of non-zero basis functions:      501 in task    30
  | Maximal number of non-zero basis functions:      467 in task    31
  | Maximal number of non-zero basis functions:      508 in task    32
  | Maximal number of non-zero basis functions:      489 in task    33
  | Maximal number of non-zero basis functions:      478 in task    34
  | Maximal number of non-zero basis functions:      481 in task    35
  | Maximal number of non-zero basis functions:      471 in task    36
  | Maximal number of non-zero basis functions:      460 in task    37
  | Maximal number of non-zero basis functions:      506 in task    38
  | Maximal number of non-zero basis functions:      460 in task    39
  | Maximal number of non-zero basis functions:      496 in task    40
  | Maximal number of non-zero basis functions:      503 in task    41
  | Maximal number of non-zero basis functions:      469 in task    42
  | Maximal number of non-zero basis functions:      469 in task    43
  | Maximal number of non-zero basis functions:      508 in task    44
  | Maximal number of non-zero basis functions:      489 in task    45
  | Maximal number of non-zero basis functions:      477 in task    46
  | Maximal number of non-zero basis functions:      471 in task    47
  | Maximal number of non-zero basis functions:      470 in task    48
  | Maximal number of non-zero basis functions:      478 in task    49
  | Maximal number of non-zero basis functions:      466 in task    50
  | Maximal number of non-zero basis functions:      476 in task    51
  | Maximal number of non-zero basis functions:      451 in task    52
  | Maximal number of non-zero basis functions:      444 in task    53
  | Maximal number of non-zero basis functions:      465 in task    54
  | Maximal number of non-zero basis functions:      474 in task    55
  | Maximal number of non-zero basis functions:      485 in task    56
  | Maximal number of non-zero basis functions:      479 in task    57
  | Maximal number of non-zero basis functions:      476 in task    58
  | Maximal number of non-zero basis functions:      481 in task    59
  | Maximal number of non-zero basis functions:      468 in task    60
  | Maximal number of non-zero basis functions:      474 in task    61
  | Maximal number of non-zero basis functions:      473 in task    62
  | Maximal number of non-zero basis functions:      467 in task    63
  | Maximal number of non-zero basis functions:      489 in task    64
  | Maximal number of non-zero basis functions:      459 in task    65
  | Maximal number of non-zero basis functions:      398 in task    66
  | Maximal number of non-zero basis functions:      450 in task    67
  | Maximal number of non-zero basis functions:      471 in task    68
  | Maximal number of non-zero basis functions:      485 in task    69
  | Maximal number of non-zero basis functions:      501 in task    70
  | Maximal number of non-zero basis functions:      547 in task    71
  Allocating        0.033 MB for KS_eigenvector_complex
  Integrating Hamiltonian matrix: batch-based integration.
  Time summed over all CPUs for integration: real work        0.557 s, elapsed        0.762 s => Consider using load balancing!
  Integrating overlap matrix.
  Time summed over all CPUs for integration: real work        0.351 s, elapsed        0.458 s
  Decreasing sparse matrix size:
  | Tolerance:  0.1000E-12
  Hamiltonian matrix
  | Array has    40525 nonzero elements out of    48927 elements
  | Sparsity factor is 0.172
  Overlap matrix
  | Array has    39296 nonzero elements out of    48927 elements
  | Sparsity factor is 0.197
  New size of hamiltonian matrix:       40783

  Updating Kohn-Sham eigenvalues and eigenvectors using ELSI and the (modified) LAPACK eigensolver.

  Obtaining occupation numbers and chemical potential using ELSI.
  | Chemical potential (Fermi level):    -6.34400437 eV
  Writing Kohn-Sham eigenvalues.
  K-point:       1 at    0.000000    0.000000    0.000000 (in units of recip. lattice)

  State    Occupation    Eigenvalue [Ha]    Eigenvalue [eV]
      1       2.00000         -65.521851        -1782.94028
      2       2.00000         -65.521851        -1782.94028
      3       2.00000          -5.124946         -139.45687
      4       2.00000          -5.124399         -139.44198
      5       2.00000          -3.539250          -96.30790
      6       2.00000          -3.539250          -96.30790
      7       2.00000          -3.539250          -96.30790
      8       2.00000          -3.538204          -96.27943
      9       2.00000          -3.538204          -96.27943
     10       2.00000          -3.538204          -96.27943
     11       2.00000          -0.709710          -19.31219
     12       2.00000          -0.244062           -6.64126
     13       2.00000          -0.244062           -6.64126
     14       2.00000          -0.244062           -6.64126
     15       0.00000          -0.136350           -3.71027
     16       0.00000          -0.136350           -3.71027
     17       0.00000          -0.136350           -3.71027
     18       0.00000          -0.063321           -1.72306
     19       0.00000           0.057201            1.55653
     20       0.00000           0.057201            1.55653

  What follows are estimated values for band gap, HOMO, LUMO, etc.
  | They are estimated on a discrete k-point grid and not necessarily exact.
  | For converged numbers, create a DOS and/or band structure plot on a denser k-grid.

  Highest occupied state (VBM) at     -6.64125734 eV (relative to internal zero)
  | Occupation number:      2.00000000
  | K-point:       1 at    0.000000    0.000000    0.000000 (in units of recip. lattice)

  Lowest unoccupied state (CBM) at    -5.87872750 eV (relative to internal zero)
  | Occupation number:      0.00000000
  | K-point:      30 at    0.000000    0.625000    0.625000 (in units of recip. lattice)

  ESTIMATED overall HOMO-LUMO gap:      0.76252984 eV between HOMO at k-point 1 and LUMO at k-point 30
  | This appears to be an indirect band gap.
  | Smallest direct gap :      2.93098392 eV for k_point 1 at    0.000000    0.000000    0.000000 (in units of recip. lattice)
  The gap value is above 0.2 eV. Unless you are using a very sparse k-point grid,
  this system is most likely an insulator or a semiconductor.
  Calculating total energy contributions from superposition of free atom densities.

  Total energy components:
  | Sum of eigenvalues            :        -328.56368660 Ha       -8940.67280875 eV
  | XC energy correction          :         -39.73210305 Ha       -1081.16553315 eV
  | XC potential correction       :          52.49200088 Ha        1428.38001920 eV
  | Free-atom electrostatic energy:        -262.93539102 Ha       -7154.83602363 eV
  | Hartree energy correction     :           0.00000000 Ha           0.00000000 eV
  | Entropy correction            :           0.00000000 Ha           0.00000000 eV
  | ---------------------------
  | Total energy                  :        -578.73917978 Ha      -15748.29434633 eV
  | Total energy, T -> 0          :        -578.73917978 Ha      -15748.29434633 eV  <-- do not rely on this value for anything but (periodic) metals
  | Electronic free energy        :        -578.73917978 Ha      -15748.29434633 eV

  Derived energy quantities:
  | Kinetic energy                :         579.90715630 Ha       15780.07660435 eV
  | Electrostatic energy          :       -1118.91423303 Ha      -30447.20541753 eV
  | Energy correction for multipole
  | error in Hartree potential    :           0.00000000 Ha           0.00000000 eV
  | Sum of eigenvalues per atom                           :       -4470.33640437 eV
  | Total energy (T->0) per atom                          :       -7874.14717317 eV  <-- do not rely on this value for anything but (periodic) metals
  | Electronic free energy per atom                       :       -7874.14717317 eV
  Initialize hartree_potential_storage
  Max. number of atoms included in rho_multipole:            2

  End scf initialization - timings             :  max(cpu_time)    wall_clock(cpu1)
  | Time for scf. initialization               :        0.106 s           0.253 s
  | Boundary condition initialization          :        0.055 s           0.056 s
  | Integration                                :        0.022 s           0.025 s
  | Solution of K.-S. eqns.                    :        0.007 s           0.087 s
  | Grid partitioning                          :        0.009 s           0.016 s
  | Preloading free-atom quantities on grid    :        0.010 s           0.025 s
  | Free-atom superposition energy             :        0.001 s           0.004 s
  | Total energy evaluation                    :        0.000 s           0.006 s

  Partial memory accounting:
  | Current value for overall tracked memory usage:
  |   Minimum:        0.811 MB (on task  0)
  |   Maximum:        0.822 MB (on task  1)
  |   Average:        0.818 MB
  | Peak value for overall tracked memory usage:
  |   Minimum:        3.131 MB (on task 66 after allocating wave)
  |   Maximum:        4.564 MB (on task 71 after allocating wave)
  |   Average:        3.866 MB
  | Largest tracked array allocation so far:
  |   Minimum:        1.209 MB (hamiltonian_shell on task 66)
  |   Maximum:        2.283 MB (hamiltonian_shell on task 71)
  |   Average:        1.745 MB
  Note:  These values currently only include a subset of arrays which are explicitly tracked.
  The "true" memory usage will be greater.
------------------------------------------------------------
  Time for density update prior                :  max(cpu_time)    wall_clock(cpu1)
  | self-consistency iterative process         :        0.012 s           0.023 s
------------------------------------------------------------
Convergence:    q app. |  density  | eigen (eV) | Etot (eV) | forces (eV/A) |       CPU time |     Clock time
  SCF    1 :  0.00E+00 |  0.12E+00 |   0.17E+01 |  0.28E-01 |             . |        0.038 s |        0.050 s
  SCF    2 :  0.00E+00 |  0.11E+00 |   0.28E+02 |  0.21E+00 |             . |        0.038 s |        0.037 s
  SCF    3 :  0.00E+00 |  0.19E-01 |  -0.86E+01 |  0.98E-02 |             . |        0.040 s |        0.036 s
  SCF    4 :  0.00E+00 |  0.93E-02 |   0.22E+01 |  0.62E-03 |             . |        0.040 s |        0.037 s
  SCF    5 :  0.00E+00 |  0.34E-02 |  -0.11E+01 |  0.16E-02 |             . |        0.044 s |        0.041 s
  SCF    6 :  0.00E+00 |  0.31E-03 |  -0.14E+00 |  0.73E-04 |             . |        0.039 s |        0.037 s
  SCF    7 :  0.00E+00 |  0.17E-03 |   0.39E-01 | -0.47E-04 |             . |        0.042 s |        0.039 s
  SCF    8 :  0.00E+00 |  0.99E-05 |  -0.27E-02 |  0.59E-06 |             . |        0.043 s |        0.038 s
  SCF    9 :  0.00E+00 |  0.14E-05 |  -0.76E-04 | -0.28E-06 |             . |        0.042 s |        0.036 s
  SCF   10 :  0.00E+00 |  0.50E-06 |   0.17E-03 | -0.13E-07 |             . |        0.043 s |        0.038 s
  SCF   11 :  0.00E+00 |  0.24E-07 |   0.55E-05 | -0.17E-08 |      0.50E-08 |        0.182 s |        0.177 s

  Total energy components:
  | Sum of eigenvalues            :        -327.76723028 Ha       -8919.00012974 eV
  | XC energy correction          :         -39.79377769 Ha       -1082.84378556 eV
  | XC potential correction       :          52.57330651 Ha        1430.59245789 eV
  | Free-atom electrostatic energy:        -262.93539102 Ha       -7154.83602363 eV
  | Hartree energy correction     :          -0.80703704 Ha         -21.96059515 eV
  | Entropy correction            :          -0.00000000 Ha          -0.00000000 eV
  | ---------------------------
  | Total energy                  :        -578.73012952 Ha      -15748.04807620 eV
  | Total energy, T -> 0          :        -578.73012952 Ha      -15748.04807620 eV  <-- do not rely on this value for anything but (periodic) metals
  | Electronic free energy        :        -578.73012952 Ha      -15748.04807620 eV

  Derived energy quantities:
  | Kinetic energy                :         580.14672207 Ha       15786.59552070 eV
  | Electrostatic energy          :       -1119.08307390 Ha      -30451.79981133 eV
  | Energy correction for multipole
  | error in Hartree potential    :           0.01796377 Ha           0.48881897 eV
  | Sum of eigenvalues per atom                           :       -4459.50006487 eV
  | Total energy (T->0) per atom                          :       -7874.02403810 eV  <-- do not rely on this value for anything but (periodic) metals
  | Electronic free energy per atom                       :       -7874.02403810 eV
  What follows are estimated values for band gap, HOMO, LUMO, etc.
  | They are estimated on a discrete k-point grid and not necessarily exact.
  | For converged numbers, create a DOS and/or band structure plot on a denser k-grid.

  Highest occupied state (VBM) at     -6.05584669 eV (relative to internal zero)
  | Occupation number:      2.00000000
  | K-point:       1 at    0.000000    0.000000    0.000000 (in units of recip. lattice)

  Lowest unoccupied state (CBM) at    -5.71239561 eV (relative to internal zero)
  | Occupation number:      0.00000000
  | K-point:      30 at    0.000000    0.625000    0.625000 (in units of recip. lattice)

  ESTIMATED overall HOMO-LUMO gap:      0.34345108 eV between HOMO at k-point 1 and LUMO at k-point 30
  | This appears to be an indirect band gap.
  | Smallest direct gap :      2.62348021 eV for k_point 1 at    0.000000    0.000000    0.000000 (in units of recip. lattice)
  The gap value is above 0.2 eV. Unless you are using a very sparse k-point grid,
  this system is most likely an insulator or a semiconductor.
  | Chemical Potential                          :    -5.94909953 eV

  Self-consistency cycle converged.

  Removing unitary transformations (pure translations, rotations) from forces on atoms.
  Atomic forces before filtering:
  | Net force on center of mass :  -0.575657E-08 -0.445328E-09  0.494117E-08 eV/A
  Atomic forces after filtering:
  | Net force on center of mass :  -0.664615E-24  0.000000E+00  0.664615E-24 eV/A

  Energy and forces in a compact form:
  | Total energy uncorrected      :         -0.157480480762010E+05 eV
  | Total energy corrected        :         -0.157480480762010E+05 eV  <-- do not rely on this value for anything but (periodic) metals
  | Electronic free energy        :         -0.157480480762010E+05 eV
  Total atomic forces (unitary forces cleaned) [eV/Ang]:
  |    1         -0.139955407336453E-08          0.216220637229299E-08         -0.203201859168708E-08
  |    2          0.139955407336453E-08         -0.216220637229299E-08          0.203201859168708E-08

  Removing unitary transformations (pure translations, rotations) from forces on atoms.
  Atomic forces before filtering:
  | Net force on center of mass :  -0.664615E-24  0.000000E+00  0.664615E-24 eV/A
  Atomic forces after filtering:
  | Net force on center of mass :   0.000000E+00  0.000000E+00  0.000000E+00 eV/A
  @ DRIVER - WARNING: the stress tensor will not be computed
 ------------------------------------------------------------------------
 Atomic structure that was used in the preceding time step of the wrapper
                         x [A]             y [A]             z [A]
  lattice_vector         0.00000000        2.60451241        2.60451241
  lattice_vector         2.60451241        0.00000000        2.60451241
  lattice_vector         2.60451241        2.60451241        0.00000000

            atom         0.00000000        0.00000000        0.00000000  Si
            atom         1.30225620        1.30225620        1.30225620  Si
 ------------------------------------------------------------------------
  @ DRIVER MODE: Message from server: STATUS      
  @ DRIVER MODE: Message from server: GETFORCE    
  @ DRIVER MODE: Returning v,forces,stress 

------------------------------------------------------------------------------
  Final output of selected total energy values:

  The following output summarizes some interesting total energy values
  at the end of a run (AFTER all relaxation, molecular dynamics, etc.).

  | Total energy of the DFT / Hartree-Fock s.c.f. calculation      :         -15748.048076201 eV
  | Final zero-broadening corrected energy (caution - metals only) :         -15748.048076201 eV
  | For reference only, the value of 1 Hartree used in FHI-aims is :             27.211384500 eV
  | For reference only, the overall average (free atom contribution
  | + realspace contribution) of the electrostatic potential after
  | s.c.f. convergence is                                          :            -14.494708298 eV

  Before relying on these values, please be sure to understand exactly which
  total energy value is referred to by a given number. Different objects may
  all carry the same name 'total energy'. Definitions:

  Total energy of the DFT / Hartree-Fock s.c.f. calculation:
  | Note that this energy does not include ANY quantities calculated after the
  | s.c.f. cycle, in particular not ANY RPA, MP2, etc. many-body perturbation terms.

  Final zero-broadening corrected energy:
  | For metallic systems only, a broadening of the occupation numbers at the Fermi
  | level can be extrapolated back to zero broadening by an electron-gas inspired
  | formula. For all systems that are not real metals, this value can be
  | meaningless and should be avoided.

------------------------------------------------------------------------------
  Methods described in the following list of references were used in this FHI-aims run.
  If you publish the results, please make sure to cite these reference if they apply.
  FHI-aims is an academic code, and for our developers (often, Ph.D. students
  and postdocs), scientific credit in the community is essential.
  Thank you for helping us!

  For any use of FHI-aims, please cite:

    Volker Blum, Ralf Gehrke, Felix Hanke, Paula Havu, Ville Havu,
    Xinguo Ren, Karsten Reuter, and Matthias Scheffler
    'Ab initio molecular simulations with numeric atom-centered orbitals'
    Computer Physics Communications 180, 2175-2196 (2009)
    http://dx.doi.org/10.1016/j.cpc.2009.06.022


  The provided symmetry information was generated with SPGlib:

    Atsushi Togo, Yusuke Seto, Dimitar Pashov
    SPGlib 1.7.3 obtained from http://spglib.sourceforge.net
    Copyright (C) 2008 Atsushi Togo


  The ELSI infrastructure was used in your run to solve the Kohn-Sham electronic structure.
  Please check out http://elsi-interchange.org to learn more.
  If scalability is important for your project, please acknowledge ELSI by citing:

    V. W-z. Yu, F. Corsetti, A. Garcia, W. P. Huhn, M. Jacquelin, W. Jia,
    B. Lange, L. Lin, J. Lu, W. Mi, A. Seifitokaldani, A. Vazquez-Mayagoitia,
    C. Yang, H. Yang, and V. Blum
    'ELSI: A unified software interface for Kohn-Sham electronic structure solvers'
    Computer Physics Communications 222, 267-285 (2018).
    http://dx.doi.org/10.1016/j.cpc.2017.09.007


  For the real-space grid partitioning and parallelization used in this calculation, please cite:

    Ville Havu, Volker Blum, Paula Havu, and Matthias Scheffler,
    'Efficient O(N) integration for all-electron electronic structure calculation'
    'using numerically tabulated basis functions'
    Journal of Computational Physics 228, 8367-8379 (2009).
    http://dx.doi.org/10.1016/j.jcp.2009.08.008

  Of course, there are many other important community references, e.g., those cited in the
  above references. Our list is limited to references that describe implementations in the
  FHI-aims code. The reason is purely practical (length of this list) - please credit others as well.

------------------------------------------------------------
          Leaving FHI-aims.
          Date     :  20220308, Time     :  150657.584

          Computational steps:
          | Number of self-consistency cycles          :           11
          | Number of SCF (re)initializations          :            1

          Detailed time accounting                     :  max(cpu_time)    wall_clock(cpu1)
          | Total time                                 :        0.962 s           1.963 s
          | Preparation time                           :        0.148 s           0.192 s
          | Boundary condition initalization           :        0.055 s           0.056 s
          | Grid partitioning                          :        0.009 s           0.016 s
          | Preloading free-atom quantities on grid    :        0.010 s           0.025 s
          | Free-atom superposition energy             :        0.001 s           0.004 s
          | Total time for integrations                :        0.119 s           0.121 s
          | Total time for solution of K.-S. equations :        0.051 s           0.131 s
          | Total time for density & force components  :        0.195 s           0.206 s
          | Total time for mixing & preconditioning    :        0.070 s           0.032 s
          | Total time for Hartree multipole update    :        0.009 s           0.011 s
          | Total time for Hartree multipole sum       :        0.156 s           0.161 s
          | Total time for total energy evaluation     :        0.003 s           0.015 s
          | Total time NSC force correction            :        0.024 s           0.024 s
          | Total time for scaled ZORA corrections     :        0.000 s           0.000 s

          Partial memory accounting:
          | Residual value for overall tracked memory usage across tasks:     0.000000 MB (should be 0.000000 MB)
          | Peak values for overall tracked memory usage:
          |   Minimum:        6.484 MB (on task 66 after allocating d_wave)
          |   Maximum:        9.229 MB (on task 71 after allocating d_wave)
          |   Average:        7.920 MB
          | Largest tracked array allocation:
          |   Minimum:        1.209 MB (hamiltonian_shell on task 66)
          |   Maximum:        2.283 MB (hamiltonian_shell on task 71)
          |   Average:        1.745 MB
          Note:  These values currently only include a subset of arrays which are explicitly tracked.
          The "true" memory usage will be greater.

          Have a nice day.
------------------------------------------------------------
