64
#2x2x2 cub supercell
Cu 0.000000000000 0.000000000000 0.000000000000
Cu 0.000000000000 2.609159026746 2.609159026746
Cu 0.000000000000 5.218318053492 5.218318053492
Cu 0.000000000000 7.827477080238 7.827477080238
Cu 2.609159026746 0.000000000000 2.609159026746
Cu 2.609159026746 2.609159026746 5.218318053492
Cu 2.609159026746 5.218318053492 7.827477080238
Cu 2.609159026746 7.827477080238 0.000000000000
Cu 5.218318053492 0.000000000000 5.218318053492
Cu 5.218318053492 2.609159026746 7.827477080238
Cu 5.218318053492 5.218318053492 0.000000000000
Cu 5.218318053492 7.827477080238 2.609159026746
Cu 7.827477080238 0.000000000000 7.827477080238
Cu 7.827477080238 2.609159026746 0.000000000000
Cu 7.827477080238 5.218318053492 2.609159026746
Cu 7.827477080238 7.827477080238 5.218318053492
Cu 2.609159026746 2.609159026746 0.000000000000
Cu 2.609159026746 5.218318053492 2.609159026746
Cu 2.609159026746 7.827477080238 5.218318053492
Cu 2.609159026746 0.000000000000 7.827477080238
Cu 5.218318053492 2.609159026746 2.609159026746
Cu 5.218318053492 5.218318053492 5.218318053492
Cu 5.218318053492 7.827477080238 7.827477080238
Cu 5.218318053492 0.000000000000 0.000000000000
Cu 7.827477080238 2.609159026746 5.218318053492
Cu 7.827477080238 5.218318053492 7.827477080238
Cu 7.827477080238 7.827477080238 0.000000000000
Cu 7.827477080238 0.000000000000 2.609159026746
Cu 0.000000000000 2.609159026746 7.827477080238
Cu 0.000000000000 5.218318053492 0.000000000000
Cu 0.000000000000 7.827477080238 2.609159026746
Cu 0.000000000000 0.000000000000 5.218318053492
Cl 1.304579513373 1.304579513373 1.304579513373
Cl 1.304579513373 3.913738540119 3.913738540119
Cl 1.304579513373 6.522897566865 6.522897566865
Cl 1.304579513373 9.132056593611 9.132056593611
Cl 3.913738540119 1.304579513373 3.913738540119
Cl 3.913738540119 3.913738540119 6.522897566865
Cl 3.913738540119 6.522897566865 9.132056593611
Cl 3.913738540119 9.132056593611 1.304579513373
Cl 6.522897566865 1.304579513373 6.522897566865
Cl 6.522897566865 3.913738540119 9.132056593611
Cl 6.522897566865 6.522897566865 1.304579513373
Cl 6.522897566865 9.132056593611 3.913738540119
Cl 9.132056593611 1.304579513373 9.132056593611
Cl 9.132056593611 3.913738540119 1.304579513373
Cl 9.132056593611 6.522897566865 3.913738540119
Cl 9.132056593611 9.132056593611 6.522897566865
Cl 3.913738540119 3.913738540119 1.304579513373
Cl 3.913738540119 6.522897566865 3.913738540119
Cl 3.913738540119 9.132056593611 6.522897566865
Cl 3.913738540119 1.304579513373 9.132056593611
Cl 6.522897566865 3.913738540119 3.913738540119
Cl 6.522897566865 6.522897566865 6.522897566865
Cl 6.522897566865 9.132056593611 9.132056593611
Cl 6.522897566865 1.304579513373 1.304579513373
Cl 9.132056593611 3.913738540119 6.522897566865
Cl 9.132056593611 6.522897566865 9.132056593611
Cl 9.132056593611 9.132056593611 1.304579513373
Cl 9.132056593611 1.304579513373 3.913738540119
Cl 1.304579513373 3.913738540119 9.132056593611
Cl 1.304579513373 6.522897566865 1.304579513373
Cl 1.304579513373 9.132056593611 3.913738540119
Cl 1.304579513373 1.304579513373 6.522897566865
