7
# CELL(abcABC):  100.0   100.0   100.0    90.0    90.0    90.0   x_centroid{angstrom}  cell{angstrom}
O  5.98946e-01 -5.94778e-01  1.58050e-01
O  2.87613e+00 -1.20957e+00 -2.64453e-01
H  2.86063e-01  4.28426e-02 -5.47392e-01
H  1.79205e+00 -9.98601e-01 -4.85095e-02
H  3.49169e+00 -6.89475e-01  2.72013e-01
H  3.15490e+00 -2.03745e+00 -7.07430e-01
H -8.31742e-02 -1.03564e+00  6.85807e-01