# column   1     --> step : The current simulation time step.
# column   2     --> time{picosecond} : The elapsed simulation time.
# column   3     --> conserved : The value of the conserved energy quantity per bead.
# column   4     --> temperature{kelvin} : The current temperature, as obtained from the MD kinetic energy.
# column   5     --> potential{electronvolt} : The physical system potential energy.
    0.00000000e+00     0.00000000e+00    -1.52120079e+02     4.54590438e+04    -4.13971300e+03   
    2.00000000e+00     2.00000000e-03    -1.52120460e+02     4.56495462e+04    -4.13989576e+03   
    4.00000000e+00     4.00000000e-03    -1.52120389e+02     4.56824891e+04    -4.13992364e+03   
    6.00000000e+00     6.00000000e-03    -1.52120531e+02     4.55900600e+04    -4.13984385e+03   
    8.00000000e+00     8.00000000e-03    -1.52120235e+02     4.53515919e+04    -4.13962002e+03   
    1.00000000e+01     1.00000000e-02    -1.52120237e+02     4.53156183e+04    -4.13958754e+03   
    1.20000000e+01     1.20000000e-02    -1.52120465e+02     4.55135935e+04    -4.13977287e+03   
    1.40000000e+01     1.40000000e-02    -1.52120310e+02     4.56733923e+04    -4.13991323e+03   
    1.60000000e+01     1.60000000e-02    -1.52120637e+02     4.58088482e+04    -4.14004472e+03   
    1.80000000e+01     1.80000000e-02    -1.52120289e+02     4.56295690e+04    -4.13987303e+03   
    2.00000000e+01     2.00000000e-02    -1.52120459e+02     4.55078605e+04    -4.13976753e+03   
    2.20000000e+01     2.20000000e-02    -1.52120179e+02     4.53316295e+04    -4.13960045e+03   
    2.40000000e+01     2.40000000e-02    -1.52120550e+02     4.54249473e+04    -4.13969497e+03   
    2.60000000e+01     2.60000000e-02    -1.52120292e+02     4.54869051e+04    -4.13974401e+03   
    2.80000000e+01     2.80000000e-02    -1.52120450e+02     4.56092986e+04    -4.13985907e+03   
    3.00000000e+01     3.00000000e-02    -1.52120469e+02     4.56329665e+04    -4.13988100e+03   
    3.20000000e+01     3.20000000e-02    -1.52120364e+02     4.55947076e+04    -4.13984353e+03   
    3.40000000e+01     3.40000000e-02    -1.52120433e+02     4.56228979e+04    -4.13987090e+03   
    3.60000000e+01     3.60000000e-02    -1.52120426e+02     4.56452334e+04    -4.13989092e+03   
    3.80000000e+01     3.80000000e-02    -1.52120573e+02     4.56586320e+04    -4.13990705e+03   
    4.00000000e+01     4.00000000e-02    -1.52120230e+02     4.54765291e+04    -4.13973295e+03   
    4.20000000e+01     4.20000000e-02    -1.52120430e+02     4.54788611e+04    -4.13974050e+03   
    4.40000000e+01     4.40000000e-02    -1.52120276e+02     4.55646088e+04    -4.13981389e+03   
    4.60000000e+01     4.60000000e-02    -1.52120468e+02     4.57347974e+04    -4.13997312e+03   
    4.80000000e+01     4.80000000e-02    -1.52120371e+02     4.57256269e+04    -4.13996218e+03   
    5.00000000e+01     5.00000000e-02    -1.52120383e+02     4.56308931e+04    -4.13987678e+03   
    5.20000000e+01     5.20000000e-02    -1.52120229e+02     4.54953172e+04    -4.13974992e+03   
    5.40000000e+01     5.40000000e-02    -1.52120356e+02     4.54768813e+04    -4.13973669e+03   
    5.60000000e+01     5.60000000e-02    -1.52120351e+02     4.54984925e+04    -4.13975612e+03   
    5.80000000e+01     5.80000000e-02    -1.52120220e+02     4.55336849e+04    -4.13978438e+03   
    6.00000000e+01     6.00000000e-02    -1.52120428e+02     4.56429619e+04    -4.13988893e+03   
    6.20000000e+01     6.20000000e-02    -1.52120417e+02     4.56383914e+04    -4.13988448e+03   
    6.40000000e+01     6.40000000e-02    -1.52120295e+02     4.54979323e+04    -4.13975408e+03   
    6.60000000e+01     6.60000000e-02    -1.52120080e+02     4.53114137e+04    -4.13957946e+03   
    6.80000000e+01     6.80000000e-02    -1.52120260e+02     4.53320438e+04    -4.13960303e+03   
    7.00000000e+01     7.00000000e-02    -1.52120141e+02     4.54613806e+04    -4.13971681e+03   
    7.20000000e+01     7.20000000e-02    -1.52120447e+02     4.56970238e+04    -4.13993836e+03   
    7.40000000e+01     7.40000000e-02    -1.52120312e+02     4.57564682e+04    -4.13998848e+03   
    7.60000000e+01     7.60000000e-02    -1.52120439e+02     4.57862742e+04    -4.14001889e+03   
    7.80000000e+01     7.80000000e-02    -1.52120264e+02     4.56508369e+04    -4.13989159e+03   
    8.00000000e+01     8.00000000e-02    -1.52120366e+02     4.55491679e+04    -4.13980236e+03   
    8.20000000e+01     8.20000000e-02    -1.52120224e+02     4.54698586e+04    -4.13972675e+03   
    8.40000000e+01     8.40000000e-02    -1.52120268e+02     4.54916064e+04    -4.13974763e+03   
    8.60000000e+01     8.60000000e-02    -1.52120485e+02     4.55533829e+04    -4.13980943e+03   
    8.80000000e+01     8.80000000e-02    -1.52120349e+02     4.55396433e+04    -4.13979329e+03   
    9.00000000e+01     9.00000000e-02    -1.52120519e+02     4.55506334e+04    -4.13980785e+03   
    9.20000000e+01     9.20000000e-02    -1.52120305e+02     4.54453000e+04    -4.13970673e+03   
    9.40000000e+01     9.40000000e-02    -1.52120541e+02     4.54860534e+04    -4.13975002e+03   
    9.60000000e+01     9.60000000e-02    -1.52120255e+02     4.54446663e+04    -4.13970481e+03   
    9.80000000e+01     9.80000000e-02    -1.52120560e+02     4.55140598e+04    -4.13977589e+03   
    1.00000000e+02     1.00000000e-01    -1.52120217e+02     4.54889708e+04    -4.13974386e+03   
    1.02000000e+02     1.02000000e-01    -1.52120387e+02     4.56774797e+04    -4.13991903e+03   
    1.04000000e+02     1.04000000e-01    -1.52120495e+02     4.58193907e+04    -4.14005039e+03   
    1.06000000e+02     1.06000000e-01    -1.52120422e+02     4.58039103e+04    -4.14003439e+03   
    1.08000000e+02     1.08000000e-01    -1.52120367e+02     4.57024583e+04    -4.13994110e+03   
    1.10000000e+02     1.10000000e-01    -1.52120170e+02     4.55511676e+04    -4.13979884e+03   
    1.12000000e+02     1.12000000e-01    -1.52120449e+02     4.56179296e+04    -4.13986684e+03   
    1.14000000e+02     1.14000000e-01    -1.52120225e+02     4.56161768e+04    -4.13985917e+03   
    1.16000000e+02     1.16000000e-01    -1.52120585e+02     4.56517049e+04    -4.13990111e+03   
    1.18000000e+02     1.18000000e-01    -1.52120146e+02     4.54136151e+04    -4.13967373e+03   
    1.20000000e+02     1.20000000e-01    -1.52120120e+02     4.52955073e+04    -4.13956615e+03   
    1.22000000e+02     1.22000000e-01    -1.52120327e+02     4.53431703e+04    -4.13961493e+03   
    1.24000000e+02     1.24000000e-01    -1.52120431e+02     4.54664930e+04    -4.13972934e+03   
    1.26000000e+02     1.26000000e-01    -1.52120461e+02     4.54953739e+04    -4.13975627e+03   
    1.28000000e+02     1.28000000e-01    -1.52120162e+02     4.53616193e+04    -4.13962713e+03   
    1.30000000e+02     1.30000000e-01    -1.52120494e+02     4.54552889e+04    -4.13972091e+03   
    1.32000000e+02     1.32000000e-01    -1.52120079e+02     4.54608529e+04    -4.13971464e+03   
    1.34000000e+02     1.34000000e-01    -1.52120507e+02     4.56656430e+04    -4.13991161e+03   
    1.36000000e+02     1.36000000e-01    -1.52120310e+02     4.57085571e+04    -4.13994506e+03   
    1.38000000e+02     1.38000000e-01    -1.52120532e+02     4.57222088e+04    -4.13996347e+03   
    1.40000000e+02     1.40000000e-01    -1.52120254e+02     4.55771789e+04    -4.13982467e+03   
    1.42000000e+02     1.42000000e-01    -1.52120609e+02     4.56772753e+04    -4.13992489e+03   
    1.44000000e+02     1.44000000e-01    -1.52120379e+02     4.56927173e+04    -4.13993261e+03   
    1.46000000e+02     1.46000000e-01    -1.52120329e+02     4.56508604e+04    -4.13989337e+03   
    1.48000000e+02     1.48000000e-01    -1.52120644e+02     4.56444374e+04    -4.13989614e+03   
    1.50000000e+02     1.50000000e-01    -1.52120211e+02     4.55294728e+04    -4.13978033e+03   
    1.52000000e+02     1.52000000e-01    -1.52120741e+02     4.56524515e+04    -4.13990604e+03   
    1.54000000e+02     1.54000000e-01    -1.52120273e+02     4.55006592e+04    -4.13975596e+03   
    1.56000000e+02     1.56000000e-01    -1.52120509e+02     4.55081285e+04    -4.13976912e+03   
    1.58000000e+02     1.58000000e-01    -1.52120350e+02     4.54854940e+04    -4.13974433e+03   
    1.60000000e+02     1.60000000e-01    -1.52120833e+02     4.56210594e+04    -4.13988014e+03   
    1.62000000e+02     1.62000000e-01    -1.52120451e+02     4.54999902e+04    -4.13976020e+03   
    1.64000000e+02     1.64000000e-01    -1.52120253e+02     4.53730580e+04    -4.13963994e+03   
    1.66000000e+02     1.66000000e-01    -1.52120635e+02     4.55189570e+04    -4.13978235e+03   
    1.68000000e+02     1.68000000e-01    -1.52120363e+02     4.56223822e+04    -4.13986853e+03   
    1.70000000e+02     1.70000000e-01    -1.52120679e+02     4.57028949e+04    -4.13994997e+03   
    1.72000000e+02     1.72000000e-01    -1.52120181e+02     4.54615287e+04    -4.13971803e+03   
    1.74000000e+02     1.74000000e-01    -1.52120388e+02     4.54841234e+04    -4.13974412e+03   
    1.76000000e+02     1.76000000e-01    -1.52120304e+02     4.55411800e+04    -4.13979345e+03   
    1.78000000e+02     1.78000000e-01    -1.52120703e+02     4.57193167e+04    -4.13996548e+03   
    1.80000000e+02     1.80000000e-01    -1.52120363e+02     4.56720621e+04    -4.13991348e+03   
    1.82000000e+02     1.82000000e-01    -1.52120236e+02     4.55551850e+04    -4.13980428e+03   
    1.84000000e+02     1.84000000e-01    -1.52120560e+02     4.55793723e+04    -4.13983499e+03   
    1.86000000e+02     1.86000000e-01    -1.52120229e+02     4.55702805e+04    -4.13981775e+03   
    1.88000000e+02     1.88000000e-01    -1.52120665e+02     4.57205628e+04    -4.13996559e+03   
    1.90000000e+02     1.90000000e-01    -1.52120355e+02     4.55913847e+04    -4.13984026e+03   
    1.92000000e+02     1.92000000e-01    -1.52120386e+02     4.55052016e+04    -4.13976314e+03   
    1.94000000e+02     1.94000000e-01    -1.52120341e+02     4.54105945e+04    -4.13967630e+03   
    1.96000000e+02     1.96000000e-01    -1.52120553e+02     4.54960671e+04    -4.13975940e+03   
    1.98000000e+02     1.98000000e-01    -1.52120427e+02     4.56001333e+04    -4.13985014e+03   
    2.00000000e+02     2.00000000e-01    -1.52120308e+02     4.55909914e+04    -4.13983864e+03   
    2.02000000e+02     2.02000000e-01    -1.52120499e+02     4.56023934e+04    -4.13985415e+03   
    2.04000000e+02     2.04000000e-01    -1.52120309e+02     4.55406554e+04    -4.13979310e+03   
    2.06000000e+02     2.06000000e-01    -1.52120501e+02     4.55890084e+04    -4.13984210e+03   
    2.08000000e+02     2.08000000e-01    -1.52120512e+02     4.55872091e+04    -4.13984075e+03   
    2.10000000e+02     2.10000000e-01    -1.52120404e+02     4.55652612e+04    -4.13981797e+03   
    2.12000000e+02     2.12000000e-01    -1.52120542e+02     4.56006204e+04    -4.13985371e+03   
    2.14000000e+02     2.14000000e-01    -1.52120729e+02     4.56121551e+04    -4.13986924e+03   
    2.16000000e+02     2.16000000e-01    -1.52120415e+02     4.54944920e+04    -4.13975424e+03   
    2.18000000e+02     2.18000000e-01    -1.52120351e+02     4.54727259e+04    -4.13973280e+03   
    2.20000000e+02     2.20000000e-01    -1.52120506e+02     4.55839220e+04    -4.13983762e+03   
    2.22000000e+02     2.22000000e-01    -1.52120530e+02     4.56770533e+04    -4.13992255e+03   
    2.24000000e+02     2.24000000e-01    -1.52120389e+02     4.57100216e+04    -4.13994855e+03   
    2.26000000e+02     2.26000000e-01    -1.52120530e+02     4.57263684e+04    -4.13996717e+03   
    2.28000000e+02     2.28000000e-01    -1.52120361e+02     4.56519431e+04    -4.13989522e+03   
    2.30000000e+02     2.30000000e-01    -1.52120352e+02     4.56137189e+04    -4.13986039e+03   
    2.32000000e+02     2.32000000e-01    -1.52120417e+02     4.56163627e+04    -4.13986456e+03   
    2.34000000e+02     2.34000000e-01    -1.52120517e+02     4.56522414e+04    -4.13989974e+03   
    2.36000000e+02     2.36000000e-01    -1.52120229e+02     4.55310517e+04    -4.13978225e+03   
    2.38000000e+02     2.38000000e-01    -1.52120282e+02     4.54453442e+04    -4.13970614e+03   
    2.40000000e+02     2.40000000e-01    -1.52120474e+02     4.54354867e+04    -4.13970244e+03   
    2.42000000e+02     2.42000000e-01    -1.52120130e+02     4.54127338e+04    -4.13967250e+03   
    2.44000000e+02     2.44000000e-01    -1.52120548e+02     4.55288644e+04    -4.13978895e+03   
    2.46000000e+02     2.46000000e-01    -1.52120198e+02     4.54083346e+04    -4.13967038e+03   
    2.48000000e+02     2.48000000e-01    -1.52120438e+02     4.54770502e+04    -4.13973909e+03   
    2.50000000e+02     2.50000000e-01    -1.52120497e+02     4.55026457e+04    -4.13976383e+03   
    2.52000000e+02     2.52000000e-01    -1.52120430e+02     4.55179703e+04    -4.13977589e+03   
    2.54000000e+02     2.54000000e-01    -1.52120234e+02     4.55423501e+04    -4.13979261e+03   
    2.56000000e+02     2.56000000e-01    -1.52120311e+02     4.55889973e+04    -4.13983692e+03   
    2.58000000e+02     2.58000000e-01    -1.52120674e+02     4.56415756e+04    -4.13989436e+03   
    2.60000000e+02     2.60000000e-01    -1.52120044e+02     4.54179734e+04    -4.13967489e+03   
    2.62000000e+02     2.62000000e-01    -1.52120553e+02     4.55042259e+04    -4.13976678e+03   
    2.64000000e+02     2.64000000e-01    -1.52120181e+02     4.55229774e+04    -4.13977363e+03   
    2.66000000e+02     2.66000000e-01    -1.52120564e+02     4.56840076e+04    -4.13992976e+03   
    2.68000000e+02     2.68000000e-01    -1.52120564e+02     4.55338454e+04    -4.13979389e+03   
    2.70000000e+02     2.70000000e-01    -1.52120460e+02     4.54961202e+04    -4.13975693e+03   
    2.72000000e+02     2.72000000e-01    -1.52120650e+02     4.57138472e+04    -4.13995911e+03   
    2.74000000e+02     2.74000000e-01    -1.52120448e+02     4.55992668e+04    -4.13984993e+03   
    2.76000000e+02     2.76000000e-01    -1.52120524e+02     4.54787372e+04    -4.13974295e+03   
    2.78000000e+02     2.78000000e-01    -1.52120270e+02     4.55141663e+04    -4.13976809e+03   
    2.80000000e+02     2.80000000e-01    -1.52120779e+02     4.57179188e+04    -4.13996630e+03   
    2.82000000e+02     2.82000000e-01    -1.52120168e+02     4.54849356e+04    -4.13973886e+03   
    2.84000000e+02     2.84000000e-01    -1.52120392e+02     4.54191686e+04    -4.13968545e+03   
    2.86000000e+02     2.86000000e-01    -1.52120374e+02     4.53983993e+04    -4.13966617e+03   
    2.88000000e+02     2.88000000e-01    -1.52120627e+02     4.56123801e+04    -4.13986668e+03   
    2.90000000e+02     2.90000000e-01    -1.52120384e+02     4.56817554e+04    -4.13992283e+03   
    2.92000000e+02     2.92000000e-01    -1.52120209e+02     4.55751529e+04    -4.13982160e+03   
    2.94000000e+02     2.94000000e-01    -1.52120681e+02     4.55796905e+04    -4.13983855e+03   
    2.96000000e+02     2.96000000e-01    -1.52119945e+02     4.54372444e+04    -4.13968964e+03   
    2.98000000e+02     2.98000000e-01    -1.52120785e+02     4.56717349e+04    -4.13992468e+03   
    3.00000000e+02     3.00000000e-01    -1.52120052e+02     4.54942972e+04    -4.13974417e+03   
    3.02000000e+02     3.02000000e-01    -1.52120414e+02     4.55489236e+04    -4.13980344e+03   
    3.04000000e+02     3.04000000e-01    -1.52120187e+02     4.54346638e+04    -4.13969390e+03   
    3.06000000e+02     3.06000000e-01    -1.52120513e+02     4.54870248e+04    -4.13975013e+03   
    3.08000000e+02     3.08000000e-01    -1.52120220e+02     4.54819810e+04    -4.13973759e+03   
    3.10000000e+02     3.10000000e-01    -1.52120127e+02     4.54995768e+04    -4.13975099e+03   
    3.12000000e+02     3.12000000e-01    -1.52120742e+02     4.56494731e+04    -4.13990335e+03   
    3.14000000e+02     3.14000000e-01    -1.52119954e+02     4.54698975e+04    -4.13971945e+03   
    3.16000000e+02     3.16000000e-01    -1.52120568e+02     4.56061412e+04    -4.13985941e+03   
    3.18000000e+02     3.18000000e-01    -1.52120066e+02     4.55686676e+04    -4.13981184e+03   
    3.20000000e+02     3.20000000e-01    -1.52120526e+02     4.58042933e+04    -4.14003757e+03   
    3.22000000e+02     3.22000000e-01    -1.52120277e+02     4.57749584e+04    -4.14000424e+03   
    3.24000000e+02     3.24000000e-01    -1.52120621e+02     4.57377235e+04    -4.13997992e+03   
    3.26000000e+02     3.26000000e-01    -1.52120196e+02     4.55373862e+04    -4.13978708e+03   
    3.28000000e+02     3.28000000e-01    -1.52120115e+02     4.54864526e+04    -4.13973881e+03   
    3.30000000e+02     3.30000000e-01    -1.52120647e+02     4.56955994e+04    -4.13994251e+03   
    3.32000000e+02     3.32000000e-01    -1.52120387e+02     4.57292803e+04    -4.13996591e+03   
    3.34000000e+02     3.34000000e-01    -1.52120625e+02     4.56854925e+04    -4.13993278e+03   
    3.36000000e+02     3.36000000e-01    -1.52120059e+02     4.53878499e+04    -4.13964806e+03   
    3.38000000e+02     3.38000000e-01    -1.52120427e+02     4.54934752e+04    -4.13975365e+03   
    3.40000000e+02     3.40000000e-01    -1.52120293e+02     4.55919620e+04    -4.13983911e+03   
    3.42000000e+02     3.42000000e-01    -1.52120741e+02     4.57474675e+04    -4.13999201e+03   
    3.44000000e+02     3.44000000e-01    -1.52120306e+02     4.56164109e+04    -4.13986159e+03   
    3.46000000e+02     3.46000000e-01    -1.52120233e+02     4.54984938e+04    -4.13975290e+03   
    3.48000000e+02     3.48000000e-01    -1.52120510e+02     4.54718713e+04    -4.13973634e+03   
    3.50000000e+02     3.50000000e-01    -1.52120189e+02     4.54183522e+04    -4.13967918e+03   
    3.52000000e+02     3.52000000e-01    -1.52120539e+02     4.55786396e+04    -4.13983374e+03   
    3.54000000e+02     3.54000000e-01    -1.52120244e+02     4.55478387e+04    -4.13979786e+03   
    3.56000000e+02     3.56000000e-01    -1.52120496e+02     4.56077054e+04    -4.13985888e+03   
    3.58000000e+02     3.58000000e-01    -1.52120172e+02     4.55075758e+04    -4.13975946e+03   
    3.60000000e+02     3.60000000e-01    -1.52120527e+02     4.56145632e+04    -4.13986592e+03   
    3.62000000e+02     3.62000000e-01    -1.52120290e+02     4.56451466e+04    -4.13988714e+03   
    3.64000000e+02     3.64000000e-01    -1.52120299e+02     4.56352711e+04    -4.13987847e+03   
    3.66000000e+02     3.66000000e-01    -1.52120563e+02     4.55855192e+04    -4.13984062e+03   
    3.68000000e+02     3.68000000e-01    -1.52120172e+02     4.54260482e+04    -4.13968568e+03   
    3.70000000e+02     3.70000000e-01    -1.52120481e+02     4.55205778e+04    -4.13977964e+03   
    3.72000000e+02     3.72000000e-01    -1.52120211e+02     4.55017547e+04    -4.13975524e+03   
    3.74000000e+02     3.74000000e-01    -1.52120401e+02     4.55991171e+04    -4.13984852e+03   
    3.76000000e+02     3.76000000e-01    -1.52120344e+02     4.55599422e+04    -4.13981153e+03   
    3.78000000e+02     3.78000000e-01    -1.52120490e+02     4.54740273e+04    -4.13973776e+03   
    3.80000000e+02     3.80000000e-01    -1.52120310e+02     4.54192907e+04    -4.13968334e+03   
    3.82000000e+02     3.82000000e-01    -1.52120373e+02     4.55267088e+04    -4.13978224e+03   
    3.84000000e+02     3.84000000e-01    -1.52120495e+02     4.56167421e+04    -4.13986703e+03   
    3.86000000e+02     3.86000000e-01    -1.52120458e+02     4.55837244e+04    -4.13983614e+03   
    3.88000000e+02     3.88000000e-01    -1.52120367e+02     4.55316910e+04    -4.13978658e+03   
    3.90000000e+02     3.90000000e-01    -1.52120313e+02     4.55079895e+04    -4.13976367e+03   
    3.92000000e+02     3.92000000e-01    -1.52120376e+02     4.55760444e+04    -4.13982697e+03   
    3.94000000e+02     3.94000000e-01    -1.52120422e+02     4.56282751e+04    -4.13987546e+03   
    3.96000000e+02     3.96000000e-01    -1.52120472e+02     4.55610820e+04    -4.13981605e+03   
    3.98000000e+02     3.98000000e-01    -1.52120406e+02     4.54747679e+04    -4.13973614e+03   
    4.00000000e+02     4.00000000e-01    -1.52120342e+02     4.54784424e+04    -4.13973773e+03   
