   1        0.5000000      0.5000000      0.5000000     2.00000      -1807.19260     2.00000      -1807.19255     2.00000       -141.54881     2.00000       -141.54415     2.00000        -95.46425     2.00000        -95.46425     2.00000        -95.46150     2.00000        -95.44795     2.00000        -95.44481     2.00000        -95.44481     2.00000        -11.82800     2.00000         -8.82594     2.00000         -2.47362     2.00000         -2.47362     0.00000          1.04666     0.00000          3.02368     0.00000          3.02368     0.00000          8.51384     0.00000         10.81640     0.00000         10.81640     0.00000         11.49618     0.00000         11.66446     0.00000         11.66446     0.00000         13.48721     0.00000         20.25325
   2        0.4937500      0.4937500      0.5125000     2.00000      -1807.19260     2.00000      -1807.19255     2.00000       -141.54881     2.00000       -141.54416     2.00000        -95.46428     2.00000        -95.46426     2.00000        -95.46146     2.00000        -95.44798     2.00000        -95.44481     2.00000        -95.44479     2.00000        -11.82346     2.00000         -8.82360     2.00000         -2.51279     2.00000         -2.48166     0.00000          1.08281     0.00000          3.01608     0.00000          3.04091     0.00000          8.52522     0.00000         10.64342     0.00000         10.76595     0.00000         11.57867     0.00000         11.72056     0.00000         11.74830     0.00000         13.51824     0.00000         20.24909
   3        0.4875000      0.4875000      0.5250000     2.00000      -1807.19260     2.00000      -1807.19255     2.00000       -141.54879     2.00000       -141.54418     2.00000        -95.46434     2.00000        -95.46427     2.00000        -95.46137     2.00000        -95.44806     2.00000        -95.44480     2.00000        -95.44474     2.00000        -11.80984     2.00000         -8.81666     2.00000         -2.62491     2.00000         -2.50546     0.00000          1.18430     0.00000          2.99596     0.00000          3.09224     0.00000          8.55619     0.00000         10.31967     0.00000         10.64218     0.00000         11.58257     0.00000         11.86119     0.00000         12.05121     0.00000         13.61055     0.00000         20.23633
   4        0.4812500      0.4812500      0.5375000     2.00000      -1807.19260     2.00000      -1807.19255     2.00000       -141.54877     2.00000       -141.54420     2.00000        -95.46443     2.00000        -95.46429     2.00000        -95.46122     2.00000        -95.44819     2.00000        -95.44478     2.00000        -95.44467     2.00000        -11.78717     2.00000         -8.80532     2.00000         -2.79669     2.00000         -2.54399     0.00000          1.33238     0.00000          2.97179     0.00000          3.17664     0.00000          8.59571     0.00000          9.97694     0.00000         10.48478     0.00000         11.55974     0.00000         12.04639     0.00000         12.39942     0.00000         13.76261     0.00000         20.21412
   5        0.4750000      0.4750000      0.5500000     2.00000      -1807.19260     2.00000      -1807.19255     2.00000       -141.54874     2.00000       -141.54424     2.00000        -95.46455     2.00000        -95.46433     2.00000        -95.46102     2.00000        -95.44837     2.00000        -95.44476     2.00000        -95.44457     2.00000        -11.75546     2.00000         -8.78994     2.00000         -3.01243     2.00000         -2.59572     0.00000          1.49992     0.00000          2.95950     0.00000          3.29253     0.00000          8.61874     0.00000          9.65891     0.00000         10.31505     0.00000         11.54110     0.00000         12.25442     0.00000         12.74054     0.00000         13.97325     0.00000         20.18089
   6        0.4687500      0.4687500      0.5625000     2.00000      -1807.19260     2.00000      -1807.19255     2.00000       -141.54869     2.00000       -141.54429     2.00000        -95.46468     2.00000        -95.46436     2.00000        -95.46079     2.00000        -95.44857     2.00000        -95.44474     2.00000        -95.44446     2.00000        -11.71477     2.00000         -8.77105     2.00000         -3.25797     2.00000         -2.65877     0.00000          1.65281     0.00000          2.98426     0.00000          3.43793     0.00000          8.57378     0.00000          9.41396     0.00000         10.14241     0.00000         11.54310     0.00000         12.47520     0.00000         13.05845     0.00000         14.24059     0.00000         20.13419
   7        0.4625000      0.4625000      0.5750000     2.00000      -1807.19260     2.00000      -1807.19255     2.00000       -141.54864     2.00000       -141.54435     2.00000        -95.46482     2.00000        -95.46441     2.00000        -95.46053     2.00000        -95.44880     2.00000        -95.44471     2.00000        -95.44434     2.00000        -11.66515     2.00000         -8.74941     2.00000         -3.52193     2.00000         -2.73106     0.00000          1.75526     0.00000          3.07595     0.00000          3.61064     0.00000          8.40341     0.00000          9.28962     0.00000          9.97130     0.00000         11.58149     0.00000         12.70352     0.00000         13.34786     0.00000         14.55899     0.00000         20.07052
   8        0.4562500      0.4562500      0.5875000     2.00000      -1807.19260     2.00000      -1807.19256     2.00000       -141.54857     2.00000       -141.54443     2.00000        -95.46496     2.00000        -95.46446     2.00000        -95.46026     2.00000        -95.44906     2.00000        -95.44467     2.00000        -95.44423     2.00000        -11.60667     2.00000         -8.72600     2.00000         -3.79550     2.00000         -2.81047     0.00000          1.78811     0.00000          3.25025     0.00000          3.80840     0.00000          8.12794     0.00000          9.25427     0.00000          9.80401     0.00000         11.67061     0.00000         12.93617     0.00000         13.61097     0.00000         14.91829     0.00000         19.98546
   9        0.4500000      0.4500000      0.6000000     2.00000      -1807.19259     2.00000      -1807.19256     2.00000       -141.54850     2.00000       -141.54451     2.00000        -95.46509     2.00000        -95.46452     2.00000        -95.45996     2.00000        -95.44933     2.00000        -95.44463     2.00000        -95.44411     2.00000        -11.53945     2.00000         -8.70212     2.00000         -4.07170     2.00000         -2.89497     0.00000          1.76014     0.00000          3.49640     0.00000          4.02898     0.00000          7.80502     0.00000          9.24170     0.00000          9.64184     0.00000         11.82048     0.00000         13.17079     0.00000         13.85322     0.00000         15.30677     0.00000         19.87459
  10        0.4437500      0.4437500      0.6125000     2.00000      -1807.19259     2.00000      -1807.19256     2.00000       -141.54841     2.00000       -141.54460     2.00000        -95.46522     2.00000        -95.46458     2.00000        -95.45966     2.00000        -95.44962     2.00000        -95.44460     2.00000        -95.44401     2.00000        -11.46361     2.00000         -8.67946     2.00000         -4.34471     2.00000         -2.98269     0.00000          1.69242     0.00000          3.79214     0.00000          4.27022     0.00000          7.46593     0.00000          9.21804     0.00000          9.48564     0.00000         12.03445     0.00000         13.40542     0.00000         14.07941     0.00000         15.71431     0.00000         19.73511
  11        0.4375000      0.4375000      0.6250000     2.00000      -1807.19259     2.00000      -1807.19256     2.00000       -141.54832     2.00000       -141.54469     2.00000        -95.46534     2.00000        -95.46465     2.00000        -95.45934     2.00000        -95.44992     2.00000        -95.44455     2.00000        -95.44391     2.00000        -11.37934     2.00000         -8.66017     2.00000         -4.60930     2.00000         -3.07194     0.00000          1.60251     0.00000          4.11877     0.00000          4.53011     0.00000          7.12408     0.00000          9.17345     0.00000          9.33602     0.00000         12.30952     0.00000         13.63835     0.00000         14.29234     0.00000         16.13329     0.00000         19.56754
  12        0.4312500      0.4312500      0.6375000     2.00000      -1807.19259     2.00000      -1807.19256     2.00000       -141.54821     2.00000       -141.54480     2.00000        -95.46545     2.00000        -95.46472     2.00000        -95.45902     2.00000        -95.45022     2.00000        -95.44451     2.00000        -95.44382     2.00000        -11.28688     2.00000         -8.64690     2.00000         -4.86041     2.00000         -3.16122     0.00000          1.50166     0.00000          4.46303     0.00000          4.80672     0.00000          6.78701     0.00000          9.10853     0.00000          9.19348     0.00000         12.63885     0.00000         13.86798     0.00000         14.49292     0.00000         16.55796     0.00000         19.37598
  13        0.4250000      0.4250000      0.6500000     2.00000      -1807.19259     2.00000      -1807.19256     2.00000       -141.54810     2.00000       -141.54491     2.00000        -95.46555     2.00000        -95.46478     2.00000        -95.45869     2.00000        -95.45053     2.00000        -95.44447     2.00000        -95.44374     2.00000        -11.18656     2.00000         -8.64285     2.00000         -5.09293     2.00000         -3.24924     0.00000          1.39679     0.00000          4.81271     0.00000          5.09824     0.00000          6.46300     0.00000          9.02735     0.00000          9.05853     0.00000         13.01448     0.00000         14.09287     0.00000         14.68068     0.00000         16.98305     0.00000         19.16717
  14        0.4187500      0.4187500      0.6625000     2.00000      -1807.19258     2.00000      -1807.19257     2.00000       -141.54799     2.00000       -141.54503     2.00000        -95.46563     2.00000        -95.46485     2.00000        -95.45837     2.00000        -95.45085     2.00000        -95.44443     2.00000        -95.44367     2.00000        -11.07884     2.00000         -8.65160     2.00000         -5.30162     2.00000         -3.33489     0.00000          1.29225     0.00000          5.14384     0.00000          5.40281     0.00000          6.17349     0.00000          8.93178     0.00000          8.93447     0.00000         13.42874     0.00000         14.31161     0.00000         14.85414     0.00000         17.40127     0.00000         18.95064
  15        0.4125000      0.4125000      0.6750000     2.00000      -1807.19258     2.00000      -1807.19257     2.00000       -141.54786     2.00000       -141.54515     2.00000        -95.46571     2.00000        -95.46492     2.00000        -95.45804     2.00000        -95.45116     2.00000        -95.44438     2.00000        -95.44362     2.00000        -10.96439     2.00000         -8.67678     2.00000         -5.48127     2.00000         -3.41721     0.00000          1.19092     0.00000          5.35583     0.00000          5.71848     0.00000          6.01739     0.00000          8.81410     0.00000          8.83382     0.00000         13.87450     0.00000         14.52288     0.00000         15.01122     0.00000         17.79325     0.00000         18.67297
  16        0.4062500      0.4062500      0.6875000     2.00000      -1807.19258     2.00000      -1807.19257     2.00000       -141.54774     2.00000       -141.54527     2.00000        -95.46577     2.00000        -95.46499     2.00000        -95.45772     2.00000        -95.45148     2.00000        -95.44434     2.00000        -95.44357     2.00000        -10.84422     2.00000         -8.72138     2.00000         -5.62724     2.00000         -3.49540     0.00000          1.09475     0.00000          5.25710     0.00000          6.04283     0.00000          6.18514     0.00000          8.70688     0.00000          8.72858     0.00000         14.34414     0.00000         14.72533     0.00000         15.14999     0.00000         18.06439     0.00000         18.18487
  17        0.4000000      0.4000000      0.7000000     2.00000      -1807.19258     2.00000      -1807.19257     2.00000       -141.54761     2.00000       -141.54540     2.00000        -95.46582     2.00000        -95.46505     2.00000        -95.45741     2.00000        -95.45178     2.00000        -95.44430     2.00000        -95.44354     2.00000        -10.71995     2.00000         -8.78673     2.00000         -5.73611     2.00000         -3.56877     0.00000          1.00513     0.00000          4.99998     0.00000          6.37250     0.00000          6.52342     0.00000          8.61258     0.00000          8.62130     0.00000         14.82362     0.00000         14.91737     0.00000         15.27381     0.00000         17.69454     0.00000         18.01128
  18        0.3937500      0.3937500      0.7125000     2.00000      -1807.19257     2.00000      -1807.19257     2.00000       -141.54748     2.00000       -141.54552     2.00000        -95.46586     2.00000        -95.46511     2.00000        -95.45712     2.00000        -95.45207     2.00000        -95.44426     2.00000        -95.44352     2.00000        -10.59424     2.00000         -8.87129     2.00000         -5.80643     2.00000         -3.63675     0.00000          0.92305     0.00000          4.71321     0.00000          6.70189     0.00000          6.90222     0.00000          8.51445     0.00000          8.53595     0.00000         15.09661     0.00000         15.21753     0.00000         15.46471     0.00000         17.20689     0.00000         17.79008
  19        0.3875000      0.3875000      0.7250000     2.00000      -1807.19257     2.00000      -1807.19257     2.00000       -141.54736     2.00000       -141.54563     2.00000        -95.46589     2.00000        -95.46517     2.00000        -95.45684     2.00000        -95.45233     2.00000        -95.44422     2.00000        -95.44351     2.00000        -10.47184     2.00000         -8.96939     2.00000         -5.83898     2.00000         -3.69883     0.00000          0.84921     0.00000          4.42372     0.00000          7.02030     0.00000          7.29189     0.00000          8.41159     0.00000          8.48688     0.00000         15.25774     0.00000         15.32232     0.00000         15.90699     0.00000         16.72927     0.00000         17.53007
  20        0.3812500      0.3812500      0.7375000     2.00000      -1807.19257     2.00000      -1807.19257     2.00000       -141.54725     2.00000       -141.54573     2.00000        -95.46590     2.00000        -95.46522     2.00000        -95.45661     2.00000        -95.45256     2.00000        -95.44419     2.00000        -95.44351     2.00000        -10.36137     2.00000         -9.06965     2.00000         -5.83647     2.00000         -3.75463     0.00000          0.78411     0.00000          4.13895     0.00000          7.30589     0.00000          7.67471     0.00000          8.32360     0.00000          8.48641     0.00000         15.31821     0.00000         15.38264     0.00000         16.28155     0.00000         16.38540     0.00000         17.26818
  21        0.3750000      0.3750000      0.7500000     2.00000      -1807.19257     2.00000      -1807.19257     2.00000       -141.54717     2.00000       -141.54581     2.00000        -95.46590     2.00000        -95.46526     2.00000        -95.45642     2.00000        -95.45274     2.00000        -95.44416     2.00000        -95.44352     2.00000        -10.27831     2.00000         -9.15271     2.00000         -5.80281     2.00000         -3.80378     0.00000          0.72806     0.00000          3.86203     0.00000          7.52048     0.00000          7.97336     0.00000          8.32500     0.00000          8.57191     0.00000         15.24377     0.00000         15.38133     0.00000         15.95531     0.00000         16.74518     0.00000         17.08424
