   1        0.5000000      0.2500000      0.7500000     2.00000      -1806.63243     2.00000      -1806.63243     2.00000       -140.98636     2.00000       -140.98636     2.00000        -94.90556     2.00000        -94.90556     2.00000        -94.89442     2.00000        -94.89442     2.00000        -94.88354     2.00000        -94.88354     2.00000         -9.07493     2.00000         -9.07493     2.00000         -4.74889     2.00000         -4.74889     0.00000          4.56326     0.00000          4.56326     0.00000          5.38433     0.00000          5.38434     0.00000         11.31007     0.00000         11.31008     0.00000         14.00854     0.00000         14.00854     0.00000         18.35196     0.00000         18.35196     0.00000         20.23561
   2        0.4886364      0.2613636      0.7500000     2.00000      -1806.63243     2.00000      -1806.63243     2.00000       -140.98647     2.00000       -140.98625     2.00000        -94.90559     2.00000        -94.90552     2.00000        -94.89470     2.00000        -94.89415     2.00000        -94.88358     2.00000        -94.88350     2.00000         -9.18615     2.00000         -8.96700     2.00000         -4.83166     2.00000         -4.64886     0.00000          4.31168     0.00000          4.61659     0.00000          5.46760     0.00000          5.51903     0.00000         11.09460     0.00000         11.48751     0.00000         13.81318     0.00000         14.23428     0.00000         18.14856     0.00000         18.53324     0.00000         19.98994
   3        0.4772727      0.2727273      0.7500000     2.00000      -1806.63243     2.00000      -1806.63243     2.00000       -140.98657     2.00000       -140.98614     2.00000        -94.90562     2.00000        -94.90547     2.00000        -94.89496     2.00000        -94.89389     2.00000        -94.88363     2.00000        -94.88347     2.00000         -9.28694     2.00000         -8.87599     2.00000         -4.90766     2.00000         -4.52216     0.00000          3.90535     0.00000          4.62115     0.00000          5.71734     0.00000          5.73111     0.00000         10.86103     0.00000         11.58584     0.00000         13.68475     0.00000         14.47624     0.00000         17.94268     0.00000         18.67383     0.00000         19.65340
   4        0.4659091      0.2840909      0.7500000     2.00000      -1806.63243     2.00000      -1806.63242     2.00000       -140.98667     2.00000       -140.98604     2.00000        -94.90565     2.00000        -94.90542     2.00000        -94.89520     2.00000        -94.89364     2.00000        -94.88369     2.00000        -94.88345     2.00000         -9.37725     2.00000         -8.80120     2.00000         -4.97654     2.00000         -4.37197     0.00000          3.47506     0.00000          4.60011     0.00000          5.95538     0.00000          6.04657     0.00000         10.61329     0.00000         11.56883     0.00000         13.66246     0.00000         14.72956     0.00000         17.74601     0.00000         18.75485     0.00000         19.28231
   5        0.4545455      0.2954545      0.7500000     2.00000      -1806.63243     2.00000      -1806.63242     2.00000       -140.98675     2.00000       -140.98596     2.00000        -94.90568     2.00000        -94.90537     2.00000        -94.89544     2.00000        -94.89342     2.00000        -94.88375     2.00000        -94.88343     2.00000         -9.45702     2.00000         -8.74129     2.00000         -5.03797     2.00000         -4.20296     0.00000          3.05362     0.00000          4.56874     0.00000          6.21704     0.00000          6.38439     0.00000         10.35399     0.00000         11.42695     0.00000         13.75898     0.00000         14.99055     0.00000         17.56312     0.00000         18.75964     0.00000         18.90044
   6        0.4431818      0.3068182      0.7500000     2.00000      -1806.63243     2.00000      -1806.63243     2.00000       -140.98683     2.00000       -140.98588     2.00000        -94.90570     2.00000        -94.90531     2.00000        -94.89564     2.00000        -94.89322     2.00000        -94.88381     2.00000        -94.88341     2.00000         -9.52622     2.00000         -8.69451     2.00000         -5.09169     2.00000         -4.02142     0.00000          2.65389     0.00000          4.53501     0.00000          6.49341     0.00000          6.73594     0.00000         10.08508     0.00000         11.18600     0.00000         13.95150     0.00000         15.25603     0.00000         17.39310     0.00000         18.52122     0.00000         18.67872
   7        0.4318182      0.3181818      0.7500000     2.00000      -1806.63243     2.00000      -1806.63243     2.00000       -140.98689     2.00000       -140.98582     2.00000        -94.90572     2.00000        -94.90526     2.00000        -94.89583     2.00000        -94.89304     2.00000        -94.88386     2.00000        -94.88340     2.00000         -9.58483     2.00000         -8.65892     2.00000         -5.13748     2.00000         -3.83538     0.00000          2.28514     0.00000          4.50304     0.00000          6.77927     0.00000          7.09759     0.00000          9.80827     0.00000         10.88083     0.00000         14.20790     0.00000         15.52262     0.00000         17.22855     0.00000         18.15830     0.00000         18.51991
   8        0.4204545      0.3295455      0.7500000     2.00000      -1806.63243     2.00000      -1806.63243     2.00000       -140.98694     2.00000       -140.98577     2.00000        -94.90573     2.00000        -94.90522     2.00000        -94.89599     2.00000        -94.89288     2.00000        -94.88391     2.00000        -94.88340     2.00000         -9.63281     2.00000         -8.63267     2.00000         -5.17518     2.00000         -3.65483     0.00000          1.95693     0.00000          4.47506     0.00000          7.07091     0.00000          7.46720     0.00000          9.52541     0.00000         10.53730     0.00000         14.50458     0.00000         15.78596     0.00000         17.05152     0.00000         17.83325     0.00000         18.31349
   9        0.4090909      0.3409091      0.7500000     2.00000      -1806.63243     2.00000      -1806.63243     2.00000       -140.98698     2.00000       -140.98572     2.00000        -94.90575     2.00000        -94.90518     2.00000        -94.89611     2.00000        -94.89276     2.00000        -94.88396     2.00000        -94.88339     2.00000         -9.67015     2.00000         -8.61408     2.00000         -5.20463     2.00000         -3.49184     0.00000          1.68044     0.00000          4.45237     0.00000          7.36481     0.00000          7.84297     0.00000          9.23901     0.00000         10.17172     0.00000         14.82695     0.00000         16.03903     0.00000         16.83204     0.00000         17.57861     0.00000         18.09131
  10        0.3977273      0.3522727      0.7500000     2.00000      -1806.63243     2.00000      -1806.63243     2.00000       -140.98701     2.00000       -140.98569     2.00000        -94.90576     2.00000        -94.90515     2.00000        -94.89621     2.00000        -94.89268     2.00000        -94.88399     2.00000        -94.88339     2.00000         -9.69683     2.00000         -8.60179     2.00000         -5.22574     2.00000         -3.36020     0.00000          1.46851     0.00000          4.43573     0.00000          7.65553     0.00000          8.22263     0.00000          8.95394     0.00000          9.79479     0.00000         15.16563     0.00000         16.26825     0.00000         16.55168     0.00000         17.41543     0.00000         17.87952
  11        0.3863636      0.3636364      0.7500000     2.00000      -1806.63243     2.00000      -1806.63243     2.00000       -140.98702     2.00000       -140.98568     2.00000        -94.90576     2.00000        -94.90513     2.00000        -94.89626     2.00000        -94.89262     2.00000        -94.88401     2.00000        -94.88339     2.00000         -9.71284     2.00000         -8.59482     2.00000         -5.23843     2.00000         -3.27383     0.00000          1.33428     0.00000          4.42558     0.00000          7.92670     0.00000          8.60019     0.00000          8.68624     0.00000          9.41724     0.00000         15.51234     0.00000         16.22770     0.00000         16.44461     0.00000         17.33103     0.00000         17.71233
  12        0.3750000      0.3750000      0.7500000     2.00000      -1806.63243     2.00000      -1806.63243     2.00000       -140.98703     2.00000       -140.98567     2.00000        -94.90576     2.00000        -94.90512     2.00000        -94.89628     2.00000        -94.89260     2.00000        -94.88402     2.00000        -94.88339     2.00000         -9.71818     2.00000         -8.59257     2.00000         -5.24267     2.00000         -3.24364     0.00000          1.28820     0.00000          4.42217     0.00000          8.08062     0.00000          8.53350     0.00000          8.88514     0.00000          9.13205     0.00000         15.80391     0.00000         15.94147     0.00000         16.51545     0.00000         17.30532     0.00000         17.64438
