   1        0.0000000      0.0000000      0.0000000     2.00000      -1806.63246     2.00000      -1806.63240     2.00000       -140.99072     2.00000       -140.98182     2.00000        -94.90266     2.00000        -94.90266     2.00000        -94.90266     2.00000        -94.88598     2.00000        -94.88598     2.00000        -94.88598     2.00000        -13.82316     2.00000         -0.60234     2.00000         -0.60234     2.00000         -0.60233     0.00000          2.73239     0.00000          2.73239     0.00000          2.73239     0.00000          3.60307     0.00000          8.35379     0.00000          8.35379     0.00000          8.92632     0.00000         12.57488     0.00000         12.57488     0.00000         12.57488     0.00000         22.91183
   2        0.0147059      0.0000000      0.0147059     2.00000      -1806.63246     2.00000      -1806.63240     2.00000       -140.99071     2.00000       -140.98182     2.00000        -94.90267     2.00000        -94.90267     2.00000        -94.90265     2.00000        -94.88599     2.00000        -94.88598     2.00000        -94.88598     2.00000        -13.81903     2.00000         -0.62891     2.00000         -0.61859     2.00000         -0.61859     0.00000          2.72197     0.00000          2.75359     0.00000          2.75359     0.00000          3.62883     0.00000          8.32451     0.00000          8.35815     0.00000          8.93871     0.00000         12.58242     0.00000         12.58243     0.00000         12.60279     0.00000         22.93132
   3        0.0294118      0.0000000      0.0294118     2.00000      -1806.63246     2.00000      -1806.63240     2.00000       -140.99071     2.00000       -140.98184     2.00000        -94.90269     2.00000        -94.90269     2.00000        -94.90263     2.00000        -94.88601     2.00000        -94.88596     2.00000        -94.88596     2.00000        -13.80664     2.00000         -0.70663     2.00000         -0.66608     2.00000         -0.66608     0.00000          2.69116     0.00000          2.81591     0.00000          2.81592     0.00000          3.70374     0.00000          8.23983     0.00000          8.37124     0.00000          8.97622     0.00000         12.60502     0.00000         12.60502     0.00000         12.68395     0.00000         22.98860
   4        0.0441176      0.0000000      0.0441176     2.00000      -1806.63246     2.00000      -1806.63240     2.00000       -140.99069     2.00000       -140.98187     2.00000        -94.90273     2.00000        -94.90273     2.00000        -94.90259     2.00000        -94.88605     2.00000        -94.88593     2.00000        -94.88593     2.00000        -13.78598     2.00000         -0.83014     2.00000         -0.74135     2.00000         -0.74134     0.00000          2.64127     0.00000          2.91587     0.00000          2.91587     0.00000          3.82130     0.00000          8.10834     0.00000          8.39306     0.00000          9.03973     0.00000         12.64255     0.00000         12.64256     0.00000         12.81155     0.00000         23.08036
   5        0.0588235      0.0000000      0.0588235     2.00000      -1806.63246     2.00000      -1806.63240     2.00000       -140.99067     2.00000       -140.98190     2.00000        -94.90277     2.00000        -94.90277     2.00000        -94.90253     2.00000        -94.88611     2.00000        -94.88589     2.00000        -94.88589     2.00000        -13.75705     2.00000         -0.99230     2.00000         -0.83966     2.00000         -0.83966     0.00000          2.57429     0.00000          3.04868     0.00000          3.04868     0.00000          3.97219     0.00000          7.94196     0.00000          8.42360     0.00000          9.13013     0.00000         12.69486     0.00000         12.69486     0.00000         12.97689     0.00000         23.20182
   6        0.0735294      0.0000000      0.0735294     2.00000      -1806.63246     2.00000      -1806.63240     2.00000       -140.99064     2.00000       -140.98195     2.00000        -94.90284     2.00000        -94.90284     2.00000        -94.90246     2.00000        -94.88618     2.00000        -94.88584     2.00000        -94.88584     2.00000        -13.71985     2.00000         -1.18570     2.00000         -0.95599     2.00000         -0.95598     0.00000          2.49266     0.00000          3.20922     0.00000          3.20923     0.00000          4.14534     0.00000          7.75419     0.00000          8.46289     0.00000          9.24785     0.00000         12.76169     0.00000         12.76170     0.00000         13.17134     0.00000         23.34768
   7        0.0882353      0.0000000      0.0882353     2.00000      -1806.63246     2.00000      -1806.63240     2.00000       -140.99060     2.00000       -140.98200     2.00000        -94.90291     2.00000        -94.90291     2.00000        -94.90237     2.00000        -94.88628     2.00000        -94.88579     2.00000        -94.88579     2.00000        -13.67438     2.00000         -1.40369     2.00000         -1.08560     2.00000         -1.08560     0.00000          2.39903     0.00000          3.39272     0.00000          3.39272     0.00000          4.32812     0.00000          7.55964     0.00000          8.51091     0.00000          9.39263     0.00000         12.84276     0.00000         12.84276     0.00000         13.38759     0.00000         23.51298
   8        0.1029412      0.0000000      0.1029412     2.00000      -1806.63246     2.00000      -1806.63240     2.00000       -140.99055     2.00000       -140.98207     2.00000        -94.90299     2.00000        -94.90299     2.00000        -94.90227     2.00000        -94.88639     2.00000        -94.88572     2.00000        -94.88572     2.00000        -13.62066     2.00000         -1.64075     2.00000         -1.22447     2.00000         -1.22447     0.00000          2.29606     0.00000          3.59501     0.00000          3.59501     0.00000          4.50535     0.00000          7.37484     0.00000          8.56768     0.00000          9.56344     0.00000         12.93771     0.00000         12.93772     0.00000         13.61992     0.00000         23.16390
   9        0.1176471      0.0000000      0.1176471     2.00000      -1806.63246     2.00000      -1806.63240     2.00000       -140.99048     2.00000       -140.98214     2.00000        -94.90309     2.00000        -94.90309     2.00000        -94.90214     2.00000        -94.88652     2.00000        -94.88564     2.00000        -94.88564     2.00000        -13.55870     2.00000         -1.89249     2.00000         -1.36925     2.00000         -1.36925     0.00000          2.18627     0.00000          3.81266     0.00000          3.81266     0.00000          4.65777     0.00000          7.21980     0.00000          8.63320     0.00000          9.75866     0.00000         13.04614     0.00000         13.04614     0.00000         13.86393     0.00000         22.69765
  10        0.1323529      0.0000000      0.1323529     2.00000      -1806.63246     2.00000      -1806.63241     2.00000       -140.99041     2.00000       -140.98222     2.00000        -94.90319     2.00000        -94.90319     2.00000        -94.90201     2.00000        -94.88666     2.00000        -94.88556     2.00000        -94.88556     2.00000        -13.48852     2.00000         -2.15552     2.00000         -1.51728     2.00000         -1.51728     0.00000          2.07194     0.00000          4.04290     0.00000          4.04291     0.00000          4.76149     0.00000          7.11866     0.00000          8.70749     0.00000          9.97631     0.00000         13.16751     0.00000         13.16752     0.00000         14.11627     0.00000         22.23656
  11        0.1470588      0.0000000      0.1470588     2.00000      -1806.63246     2.00000      -1806.63241     2.00000       -140.99033     2.00000       -140.98230     2.00000        -94.90330     2.00000        -94.90330     2.00000        -94.90185     2.00000        -94.88683     2.00000        -94.88547     2.00000        -94.88547     2.00000        -13.41016     2.00000         -2.42724     2.00000         -1.66645     2.00000         -1.66645     0.00000          1.95509     0.00000          4.28351     0.00000          4.28351     0.00000          4.79289     0.00000          7.09493     0.00000          8.79054     0.00000         10.21421     0.00000         13.30119     0.00000         13.30120     0.00000         14.37417     0.00000         21.78313
  12        0.1617647      0.0000000      0.1617647     2.00000      -1806.63246     2.00000      -1806.63241     2.00000       -140.99024     2.00000       -140.98240     2.00000        -94.90342     2.00000        -94.90342     2.00000        -94.90167     2.00000        -94.88701     2.00000        -94.88537     2.00000        -94.88537     2.00000        -13.32365     2.00000         -2.70566     2.00000         -1.81508     2.00000         -1.81508     0.00000          1.83747     0.00000          4.53271     0.00000          4.53272     0.00000          4.74029     0.00000          7.16011     0.00000          8.88236     0.00000         10.47014     0.00000         13.44632     0.00000         13.44632     0.00000         14.63533     0.00000         21.33947
  13        0.1764706      0.0000000      0.1764706     2.00000      -1806.63245     2.00000      -1806.63241     2.00000       -140.99013     2.00000       -140.98249     2.00000        -94.90354     2.00000        -94.90354     2.00000        -94.90148     2.00000        -94.88721     2.00000        -94.88527     2.00000        -94.88527     2.00000        -13.22903     2.00000         -2.98924     2.00000         -1.96185     2.00000         -1.96185     0.00000          1.72056     0.00000          4.61135     0.00000          4.78909     0.00000          4.78909     0.00000          7.30663     0.00000          8.98297     0.00000         10.74187     0.00000         13.60170     0.00000         13.60170     0.00000         14.89788     0.00000         20.90759
  14        0.1911765      0.0000000      0.1911765     2.00000      -1806.63244     2.00000      -1806.63241     2.00000       -140.99002     2.00000       -140.98260     2.00000        -94.90367     2.00000        -94.90367     2.00000        -94.90127     2.00000        -94.88742     2.00000        -94.88517     2.00000        -94.88517     2.00000        -13.12635     2.00000         -3.27679     2.00000         -2.10570     2.00000         -2.10570     0.00000          1.60566     0.00000          4.42577     0.00000          5.05150     0.00000          5.05150     0.00000          7.51539     0.00000          9.09236     0.00000         11.02722     0.00000         13.76568     0.00000         13.76568     0.00000         15.16053     0.00000         20.48973
  15        0.2058824      0.0000000      0.2058824     2.00000      -1806.63244     2.00000      -1806.63241     2.00000       -140.98990     2.00000       -140.98271     2.00000        -94.90380     2.00000        -94.90380     2.00000        -94.90104     2.00000        -94.88765     2.00000        -94.88507     2.00000        -94.88507     2.00000        -13.01565     2.00000         -3.56736     2.00000         -2.24579     2.00000         -2.24579     0.00000          1.49384     0.00000          4.20381     0.00000          5.31902     0.00000          5.31903     0.00000          7.76729     0.00000          9.21055     0.00000         11.32404     0.00000         13.93587     0.00000         13.93587     0.00000         15.42268     0.00000         20.08866
  16        0.2205882      0.0000000      0.2205882     2.00000      -1806.63243     2.00000      -1806.63241     2.00000       -140.98977     2.00000       -140.98283     2.00000        -94.90393     2.00000        -94.90393     2.00000        -94.90080     2.00000        -94.88790     2.00000        -94.88496     2.00000        -94.88496     2.00000        -12.89700     2.00000         -3.86017     2.00000         -2.38144     2.00000         -2.38144     0.00000          1.38602     0.00000          3.96137     0.00000          5.59092     0.00000          5.59093     0.00000          8.04812     0.00000          9.33753     0.00000         11.63014     0.00000         14.10883     0.00000         14.10883     0.00000         15.68454     0.00000         19.70809
  17        0.2352941      0.0000000      0.2352941     2.00000      -1806.63242     2.00000      -1806.63241     2.00000       -140.98964     2.00000       -140.98296     2.00000        -94.90406     2.00000        -94.90406     2.00000        -94.90055     2.00000        -94.88815     2.00000        -94.88485     2.00000        -94.88485     2.00000        -12.77045     2.00000         -4.15460     2.00000         -2.51208     2.00000         -2.51208     0.00000          1.28301     0.00000          3.70971     0.00000          5.86661     0.00000          5.86661     0.00000          8.34832     0.00000          9.47331     0.00000         11.94325     0.00000         14.27955     0.00000         14.27955     0.00000         15.94695     0.00000         19.35320
  18        0.2500000      0.0000000      0.2500000     2.00000      -1806.63242     2.00000      -1806.63241     2.00000       -140.98950     2.00000       -140.98309     2.00000        -94.90420     2.00000        -94.90420     2.00000        -94.90028     2.00000        -94.88843     2.00000        -94.88475     2.00000        -94.88475     2.00000        -12.63606     2.00000         -4.45009     2.00000         -2.63725     2.00000         -2.63725     0.00000          1.18546     0.00000          3.45665     0.00000          6.14559     0.00000          6.14560     0.00000          8.66162     0.00000          9.61790     0.00000         12.26092     0.00000         14.44083     0.00000         14.44083     0.00000         16.21121     0.00000         19.03126
  19        0.2647059      0.0000000      0.2647059     2.00000      -1806.63241     2.00000      -1806.63241     2.00000       -140.98934     2.00000       -140.98324     2.00000        -94.90433     2.00000        -94.90433     2.00000        -94.90000     2.00000        -94.88871     2.00000        -94.88464     2.00000        -94.88464     2.00000        -12.49391     2.00000         -4.74617     2.00000         -2.75658     2.00000         -2.75657     0.00000          1.09399     0.00000          3.20745     0.00000          6.42751     0.00000          6.42751     0.00000          8.98377     0.00000          9.77130     0.00000         12.58040     0.00000         14.58249     0.00000         14.58250     0.00000         16.47878     0.00000         18.75243
  20        0.2794118      0.0000000      0.2794118     2.00000      -1806.63241     2.00000      -1806.63241     2.00000       -140.98919     2.00000       -140.98339     2.00000        -94.90446     2.00000        -94.90446     2.00000        -94.89971     2.00000        -94.88901     2.00000        -94.88454     2.00000        -94.88454     2.00000        -12.34408     2.00000         -5.04239     2.00000         -2.86974     2.00000         -2.86974     0.00000          1.00910     0.00000          2.96562     0.00000          6.71205     0.00000          6.71206     0.00000          9.31175     0.00000          9.93350     0.00000         12.89850     0.00000         14.69112     0.00000         14.69112     0.00000         16.75109     0.00000         18.53003
  21        0.2941176      0.0000000      0.2941176     2.00000      -1806.63241     2.00000      -1806.63241     2.00000       -140.98902     2.00000       -140.98355     2.00000        -94.90458     2.00000        -94.90458     2.00000        -94.89941     2.00000        -94.88932     2.00000        -94.88445     2.00000        -94.88445     2.00000        -12.18664     2.00000         -5.33835     2.00000         -2.97647     2.00000         -2.97647     0.00000          0.93124     0.00000          2.73341     0.00000          6.99900     0.00000          6.99900     0.00000          9.64336     0.00000         10.10451     0.00000         13.21142     0.00000         14.75106     0.00000         14.75106     0.00000         17.02935     0.00000         18.37954
  22        0.3088235      0.0000000      0.3088235     2.00000      -1806.63241     2.00000      -1806.63241     2.00000       -140.98885     2.00000       -140.98372     2.00000        -94.90470     2.00000        -94.90470     2.00000        -94.89910     2.00000        -94.88964     2.00000        -94.88435     2.00000        -94.88435     2.00000        -12.02170     2.00000         -5.63365     2.00000         -3.07655     2.00000         -3.07655     0.00000          0.86082     0.00000          2.51224     0.00000          7.28817     0.00000          7.28817     0.00000          9.97685     0.00000         10.28434     0.00000         13.51457     0.00000         14.74815     0.00000         14.74815     0.00000         17.31453     0.00000         18.01610
  23        0.3235294      0.0000000      0.3235294     2.00000      -1806.63241     2.00000      -1806.63240     2.00000       -140.98868     2.00000       -140.98389     2.00000        -94.90482     2.00000        -94.90482     2.00000        -94.89878     2.00000        -94.88997     2.00000        -94.88427     2.00000        -94.88427     2.00000        -11.84934     2.00000         -5.92792     2.00000         -3.16980     2.00000         -3.16979     0.00000          0.79821     0.00000          2.30295     0.00000          7.57943     0.00000          7.57943     0.00000         10.31082     0.00000         10.47297     0.00000         13.80231     0.00000         14.67532     0.00000         14.67532     0.00000         17.60727     0.00000         17.61456
  24        0.3382353      0.0000000      0.3382353     2.00000      -1806.63240     2.00000      -1806.63240     2.00000       -140.98850     2.00000       -140.98407     2.00000        -94.90492     2.00000        -94.90492     2.00000        -94.89845     2.00000        -94.89030     2.00000        -94.88419     2.00000        -94.88419     2.00000        -11.66969     2.00000         -6.22080     2.00000         -3.25604     2.00000         -3.25604     0.00000          0.74373     0.00000          2.10601     0.00000          7.87266     0.00000          7.87266     0.00000         10.64407     0.00000         10.67041     0.00000         14.06787     0.00000         14.53575     0.00000         14.53575     0.00000         17.22049     0.00000         17.90790
  25        0.3529412      0.0000000      0.3529412     2.00000      -1806.63240     2.00000      -1806.63240     2.00000       -140.98831     2.00000       -140.98426     2.00000        -94.90503     2.00000        -94.90503     2.00000        -94.89811     2.00000        -94.89065     2.00000        -94.88411     2.00000        -94.88411     2.00000        -11.48285     2.00000         -6.51192     2.00000         -3.33516     2.00000         -3.33516     0.00000          0.69770     0.00000          1.92166     0.00000          8.16775     0.00000          8.16775     0.00000         10.87667     0.00000         10.97555     0.00000         14.30330     0.00000         14.34060     0.00000         14.34060     0.00000         16.83410     0.00000         18.21641
  26        0.3676471      0.0000000      0.3676471     2.00000      -1806.63240     2.00000      -1806.63240     2.00000       -140.98812     2.00000       -140.98445     2.00000        -94.90512     2.00000        -94.90512     2.00000        -94.89776     2.00000        -94.89101     2.00000        -94.88404     2.00000        -94.88404     2.00000        -11.28894     2.00000         -6.80092     2.00000         -3.40703     2.00000         -3.40702     0.00000          0.66038     0.00000          1.74999     0.00000          8.46459     0.00000          8.46459     0.00000         11.09173     0.00000         11.30431     0.00000         14.10368     0.00000         14.10368     0.00000         14.49985     0.00000         16.45558     0.00000         18.53238
  27        0.3823529      0.0000000      0.3823529     2.00000      -1806.63240     2.00000      -1806.63240     2.00000       -140.98793     2.00000       -140.98464     2.00000        -94.90521     2.00000        -94.90521     2.00000        -94.89741     2.00000        -94.89137     2.00000        -94.88398     2.00000        -94.88398     2.00000        -11.08811     2.00000         -7.08746     2.00000         -3.47155     2.00000         -3.47155     0.00000          0.63206     0.00000          1.59097     0.00000          8.76301     0.00000          8.76301     0.00000         11.31560     0.00000         11.62942     0.00000         13.83750     0.00000         13.83750     0.00000         14.64884     0.00000         16.08508     0.00000         18.85492
  28        0.3970588      0.0000000      0.3970588     2.00000      -1806.63240     2.00000      -1806.63240     2.00000       -140.98773     2.00000       -140.98484     2.00000        -94.90528     2.00000        -94.90528     2.00000        -94.89705     2.00000        -94.89173     2.00000        -94.88393     2.00000        -94.88393     2.00000        -10.88050     2.00000         -7.37120     2.00000         -3.52866     2.00000         -3.52866     0.00000          0.61298     0.00000          1.44453     0.00000          9.06272     0.00000          9.06272     0.00000         11.54827     0.00000         11.94996     0.00000         13.55193     0.00000         13.55193     0.00000         14.74313     0.00000         15.72275     0.00000         19.18237
  29        0.4117647      0.0000000      0.4117647     2.00000      -1806.63240     2.00000      -1806.63240     2.00000       -140.98753     2.00000       -140.98504     2.00000        -94.90535     2.00000        -94.90535     2.00000        -94.89669     2.00000        -94.89211     2.00000        -94.88388     2.00000        -94.88388     2.00000        -10.66626     2.00000         -7.65180     2.00000         -3.57828     2.00000         -3.57828     0.00000          0.60338     0.00000          1.31054     0.00000          9.36327     0.00000          9.36327     0.00000         11.78974     0.00000         12.26496     0.00000         13.25438     0.00000         13.25438     0.00000         14.77865     0.00000         15.36871     0.00000         19.51203
  30        0.4264706      0.0000000      0.4264706     2.00000      -1806.63240     2.00000      -1806.63240     2.00000       -140.98733     2.00000       -140.98524     2.00000        -94.90541     2.00000        -94.90541     2.00000        -94.89631     2.00000        -94.89248     2.00000        -94.88385     2.00000        -94.88384     2.00000        -10.44555     2.00000         -7.92893     2.00000         -3.62035     2.00000         -3.62035     0.00000          0.60351     0.00000          1.18883     0.00000          9.66380     0.00000          9.66380     0.00000         12.04000     0.00000         12.57332     0.00000         12.95056     0.00000         12.95056     0.00000         14.75548     0.00000         15.02305     0.00000         19.83950
  31        0.4411765      0.0000000      0.4411765     2.00000      -1806.63240     2.00000      -1806.63240     2.00000       -140.98712     2.00000       -140.98545     2.00000        -94.90546     2.00000        -94.90546     2.00000        -94.89594     2.00000        -94.89286     2.00000        -94.88381     2.00000        -94.88381     2.00000        -10.21857     2.00000         -8.20227     2.00000         -3.65483     2.00000         -3.65483     0.00000          0.61359     0.00000          1.07923     0.00000          9.96264     0.00000          9.96264     0.00000         12.29905     0.00000         12.64552     0.00000         12.64552     0.00000         12.87376     0.00000         14.67753     0.00000         14.68584     0.00000         20.15756
  32        0.4558824      0.0000000      0.4558824     2.00000      -1806.63240     2.00000      -1806.63240     2.00000       -140.98691     2.00000       -140.98566     2.00000        -94.90549     2.00000        -94.90549     2.00000        -94.89556     2.00000        -94.89325     2.00000        -94.88379     2.00000        -94.88379     2.00000         -9.98550     2.00000         -8.47153     2.00000         -3.68168     2.00000         -3.68168     0.00000          0.63385     0.00000          0.98155     0.00000         10.25620     0.00000         10.25620     0.00000         12.34518     0.00000         12.34518     0.00000         12.56687     0.00000         13.16472     0.00000         14.35717     0.00000         14.55138     0.00000         20.45442
  33        0.4705882      0.0000000      0.4705882     2.00000      -1806.63240     2.00000      -1806.63240     2.00000       -140.98671     2.00000       -140.98587     2.00000        -94.90552     2.00000        -94.90552     2.00000        -94.89518     2.00000        -94.89363     2.00000        -94.88377     2.00000        -94.88377     2.00000         -9.74655     2.00000         -8.73639     2.00000         -3.70088     2.00000         -3.70088     0.00000          0.66450     0.00000          0.89558     0.00000         10.53535     0.00000         10.53535     0.00000         12.06019     0.00000         12.06020     0.00000         12.84346     0.00000         13.44421     0.00000         14.03709     0.00000         14.38464     0.00000         20.71122
  34        0.4852941      0.0000000      0.4852941     2.00000      -1806.63240     2.00000      -1806.63240     2.00000       -140.98650     2.00000       -140.98608     2.00000        -94.90554     2.00000        -94.90554     2.00000        -94.89479     2.00000        -94.89402     2.00000        -94.88376     2.00000        -94.88376     2.00000         -9.50192     2.00000         -8.99659     2.00000         -3.71241     2.00000         -3.71241     0.00000          0.70579     0.00000          0.82110     0.00000         10.77224     0.00000         10.77224     0.00000         11.81944     0.00000         11.81944     0.00000         13.12880     0.00000         13.70970     0.00000         13.72564     0.00000         14.18467     0.00000         20.90059
  35        0.5000000      0.0000000      0.5000000     2.00000      -1806.63240     2.00000      -1806.63240     2.00000       -140.98629     2.00000       -140.98629     2.00000        -94.90554     2.00000        -94.90554     2.00000        -94.89441     2.00000        -94.89441     2.00000        -94.88376     2.00000        -94.88376     2.00000         -9.25186     2.00000         -9.25185     2.00000         -3.71625     2.00000         -3.71625     0.00000          0.75791     0.00000          0.75791     0.00000         10.88095     0.00000         10.88095     0.00000         11.70938     0.00000         11.70938     0.00000         13.42287     0.00000         13.42287     0.00000         13.95792     0.00000         13.95793     0.00000         20.99309
