   1        0.3750000      0.3750000      0.7500000     2.00000      -1806.63243     2.00000      -1806.63243     2.00000       -140.98703     2.00000       -140.98567     2.00000        -94.90576     2.00000        -94.90512     2.00000        -94.89628     2.00000        -94.89260     2.00000        -94.88402     2.00000        -94.88339     2.00000         -9.71818     2.00000         -8.59257     2.00000         -5.24267     2.00000         -3.24364     0.00000          1.28820     0.00000          4.42217     0.00000          8.08062     0.00000          8.53350     0.00000          8.88514     0.00000          9.13205     0.00000         15.80391     0.00000         15.94147     0.00000         16.51545     0.00000         17.30532     0.00000         17.64438
   2        0.3645833      0.3645833      0.7291667     2.00000      -1806.63243     2.00000      -1806.63243     2.00000       -140.98715     2.00000       -140.98557     2.00000        -94.90577     2.00000        -94.90505     2.00000        -94.89655     2.00000        -94.89234     2.00000        -94.88407     2.00000        -94.88336     2.00000         -9.82845     2.00000         -8.47846     2.00000         -5.30998     2.00000         -3.16474     0.00000          1.37703     0.00000          4.87916     0.00000          7.80716     0.00000          8.25620     0.00000          8.66555     0.00000          8.89905     0.00000         15.97552     0.00000         16.17108     0.00000         16.83104     0.00000         17.03724     0.00000         17.59847
   3        0.3541667      0.3541667      0.7083333     2.00000      -1806.63243     2.00000      -1806.63243     2.00000       -140.98727     2.00000       -140.98546     2.00000        -94.90576     2.00000        -94.90498     2.00000        -94.89683     2.00000        -94.89208     2.00000        -94.88412     2.00000        -94.88335     2.00000         -9.95198     2.00000         -8.35534     2.00000         -5.35247     2.00000         -3.08066     0.00000          1.47176     0.00000          5.33865     0.00000          7.53838     0.00000          7.99277     0.00000          8.44889     0.00000          8.67366     0.00000         16.09109     0.00000         16.39540     0.00000         16.83251     0.00000         17.14368     0.00000         17.40406
   4        0.3437500      0.3437500      0.6875000     2.00000      -1806.63244     2.00000      -1806.63243     2.00000       -140.98740     2.00000       -140.98534     2.00000        -94.90575     2.00000        -94.90490     2.00000        -94.89711     2.00000        -94.89180     2.00000        -94.88418     2.00000        -94.88335     2.00000        -10.08766     2.00000         -8.22326     2.00000         -5.37039     2.00000         -2.99168     0.00000          1.57202     0.00000          5.79089     0.00000          7.27479     0.00000          7.75166     0.00000          8.23625     0.00000          8.45667     0.00000         16.07123     0.00000         16.61415     0.00000         16.76819     0.00000         17.15336     0.00000         17.45297
   5        0.3333333      0.3333333      0.6666667     2.00000      -1806.63244     2.00000      -1806.63244     2.00000       -140.98753     2.00000       -140.98522     2.00000        -94.90572     2.00000        -94.90482     2.00000        -94.89740     2.00000        -94.89153     2.00000        -94.88424     2.00000        -94.88335     2.00000        -10.23400     2.00000         -8.08223     2.00000         -5.36457     2.00000         -2.89816     0.00000          1.67741     0.00000          6.21001     0.00000          7.01679     0.00000          7.55745     0.00000          8.02866     0.00000          8.24884     0.00000         15.90700     0.00000         16.82698     0.00000         16.84728     0.00000         16.88516     0.00000         17.75873
   6        0.3229167      0.3229167      0.6458333     2.00000      -1806.63244     2.00000      -1806.63244     2.00000       -140.98766     2.00000       -140.98509     2.00000        -94.90569     2.00000        -94.90474     2.00000        -94.89769     2.00000        -94.89124     2.00000        -94.88430     2.00000        -94.88337     2.00000        -10.38924     2.00000         -7.93231     2.00000         -5.33628     2.00000         -2.80046     0.00000          1.78743     0.00000          6.51318     0.00000          6.76472     0.00000          7.49162     0.00000          7.82706     0.00000          8.05092     0.00000         15.68420     0.00000         16.61417     0.00000         16.96408     0.00000         17.03339     0.00000         18.06094
   7        0.3125000      0.3125000      0.6250000     2.00000      -1806.63244     2.00000      -1806.63244     2.00000       -140.98780     2.00000       -140.98496     2.00000        -94.90565     2.00000        -94.90466     2.00000        -94.89798     2.00000        -94.89096     2.00000        -94.88437     2.00000        -94.88339     2.00000        -10.55153     2.00000         -7.77354     2.00000         -5.28700     2.00000         -2.69898     0.00000          1.90149     0.00000          6.51887     0.00000          6.56534     0.00000          7.63238     0.00000          7.68768     0.00000          7.86363     0.00000         15.44709     0.00000         16.34700     0.00000         16.98756     0.00000         17.23266     0.00000         17.78486
   8        0.3020833      0.3020833      0.6041667     2.00000      -1806.63244     2.00000      -1806.63244     2.00000       -140.98793     2.00000       -140.98482     2.00000        -94.90559     2.00000        -94.90457     2.00000        -94.89826     2.00000        -94.89067     2.00000        -94.88444     2.00000        -94.88343     2.00000        -10.71901     2.00000         -7.60595     2.00000         -5.21831     2.00000         -2.59420     0.00000          2.01890     0.00000          6.27950     0.00000          6.43340     0.00000          7.44556     0.00000          7.68768     0.00000          8.07692     0.00000         15.20963     0.00000         16.08744     0.00000         16.71428     0.00000         17.42371     0.00000         17.70166
   9        0.2916667      0.2916667      0.5833333     2.00000      -1806.63244     2.00000      -1806.63244     2.00000       -140.98807     2.00000       -140.98468     2.00000        -94.90553     2.00000        -94.90448     2.00000        -94.89855     2.00000        -94.89039     2.00000        -94.88451     2.00000        -94.88348     2.00000        -10.88995     2.00000         -7.42962     2.00000         -5.13179     2.00000         -2.48661     0.00000          2.13886     0.00000          6.04681     0.00000          6.24191     0.00000          7.26753     0.00000          7.52382     0.00000          8.53250     0.00000         14.97648     0.00000         15.83840     0.00000         16.24240     0.00000         17.60502     0.00000         17.82755
  10        0.2812500      0.2812500      0.5625000     2.00000      -1806.63244     2.00000      -1806.63244     2.00000       -140.98821     2.00000       -140.98454     2.00000        -94.90545     2.00000        -94.90439     2.00000        -94.89883     2.00000        -94.89010     2.00000        -94.88458     2.00000        -94.88354     2.00000        -11.06273     2.00000         -7.24460     2.00000         -5.02895     2.00000         -2.37677     0.00000          2.26038     0.00000          5.82101     0.00000          6.03425     0.00000          7.09931     0.00000          7.37277     0.00000          9.00797     0.00000         14.74874     0.00000         15.60278     0.00000         15.72279     0.00000         17.77445     0.00000         18.01183
  11        0.2708333      0.2708333      0.5416667     2.00000      -1806.63244     2.00000      -1806.63244     2.00000       -140.98835     2.00000       -140.98439     2.00000        -94.90537     2.00000        -94.90430     2.00000        -94.89911     2.00000        -94.88982     2.00000        -94.88465     2.00000        -94.88361     2.00000        -11.23591     2.00000         -7.05095     2.00000         -4.91119     2.00000         -2.26526     0.00000          2.38231     0.00000          5.60228     0.00000          5.82377     0.00000          6.94196     0.00000          7.23526     0.00000          9.48566     0.00000         14.52410     0.00000         15.19711     0.00000         15.38422     0.00000         17.92910     0.00000         18.21632
  12        0.2604167      0.2604167      0.5208333     2.00000      -1806.63244     2.00000      -1806.63243     2.00000       -140.98849     2.00000       -140.98425     2.00000        -94.90528     2.00000        -94.90420     2.00000        -94.89937     2.00000        -94.88955     2.00000        -94.88473     2.00000        -94.88369     2.00000        -11.40824     2.00000         -6.84876     2.00000         -4.77981     2.00000         -2.15273     0.00000          2.50331     0.00000          5.39078     0.00000          5.61551     0.00000          6.79662     0.00000          7.11204     0.00000          9.95427     0.00000         14.28881     0.00000         14.69040     0.00000         15.18774     0.00000         18.06518     0.00000         18.43094
  13        0.2500000      0.2500000      0.5000000     2.00000      -1806.63244     2.00000      -1806.63243     2.00000       -140.98863     2.00000       -140.98410     2.00000        -94.90517     2.00000        -94.90411     2.00000        -94.89964     2.00000        -94.88927     2.00000        -94.88480     2.00000        -94.88377     2.00000        -11.57862     2.00000         -6.63810     2.00000         -4.63599     2.00000         -2.03987     0.00000          2.62177     0.00000          5.18667     0.00000          5.41173     0.00000          6.66449     0.00000          7.00381     0.00000         10.40226     0.00000         13.97049     0.00000         14.27968     0.00000         15.02061     0.00000         18.17782     0.00000         18.34431
  14        0.2395833      0.2395833      0.4791667     2.00000      -1806.63244     2.00000      -1806.63243     2.00000       -140.98877     2.00000       -140.98395     2.00000        -94.90506     2.00000        -94.90402     2.00000        -94.89989     2.00000        -94.88901     2.00000        -94.88488     2.00000        -94.88387     2.00000        -11.74610     2.00000         -6.41907     2.00000         -4.48084     2.00000         -1.92740     0.00000          2.73590     0.00000          4.99009     0.00000          5.21361     0.00000          6.54684     0.00000          6.91125     0.00000         10.81491     0.00000         13.50879     0.00000         14.02793     0.00000         14.89319     0.00000         17.94167     0.00000         18.26105
  15        0.2291667      0.2291667      0.4583333     2.00000      -1806.63244     2.00000      -1806.63243     2.00000       -140.98891     2.00000       -140.98380     2.00000        -94.90495     2.00000        -94.90392     2.00000        -94.90013     2.00000        -94.88875     2.00000        -94.88495     2.00000        -94.88397     2.00000        -11.90987     2.00000         -6.19179     2.00000         -4.31537     2.00000         -1.81607     0.00000          2.84367     0.00000          4.80116     0.00000          5.02182     0.00000          6.44486     0.00000          6.83499     0.00000         11.17276     0.00000         13.00432     0.00000         13.83646     0.00000         14.81874     0.00000         17.55152     0.00000         18.30791
  16        0.2187500      0.2187500      0.4375000     2.00000      -1806.63245     2.00000      -1806.63242     2.00000       -140.98905     2.00000       -140.98366     2.00000        -94.90482     2.00000        -94.90383     2.00000        -94.90037     2.00000        -94.88850     2.00000        -94.88503     2.00000        -94.88409     2.00000        -12.06925     2.00000         -5.95638     2.00000         -4.14054     2.00000         -1.70666     0.00000          2.94296     0.00000          4.62002     0.00000          4.83677     0.00000          6.35959     0.00000          6.77554     0.00000         11.45294     0.00000         12.49666     0.00000         13.66737     0.00000         14.80945     0.00000         17.18850     0.00000         18.31090
  17        0.2083333      0.2083333      0.4166667     2.00000      -1806.63245     2.00000      -1806.63242     2.00000       -140.98919     2.00000       -140.98351     2.00000        -94.90469     2.00000        -94.90374     2.00000        -94.90059     2.00000        -94.88827     2.00000        -94.88510     2.00000        -94.88421     2.00000        -12.22363     2.00000         -5.71298     2.00000         -3.95729     2.00000         -1.59994     0.00000          3.03161     0.00000          4.44676     0.00000          4.65873     0.00000          6.29163     0.00000          6.73332     0.00000         11.63590     0.00000         11.99476     0.00000         13.51344     0.00000         14.86358     0.00000         16.87706     0.00000         18.26283
  18        0.1979167      0.1979167      0.3958333     2.00000      -1806.63245     2.00000      -1806.63242     2.00000       -140.98933     2.00000       -140.98337     2.00000        -94.90455     2.00000        -94.90365     2.00000        -94.90081     2.00000        -94.88804     2.00000        -94.88517     2.00000        -94.88433     2.00000        -12.37253     2.00000         -5.46178     2.00000         -3.76653     2.00000         -1.49667     0.00000          3.10769     0.00000          4.28149     0.00000          4.48788     0.00000          6.24084     0.00000          6.70856     0.00000         11.50257     0.00000         11.71550     0.00000         13.37270     0.00000         14.94299     0.00000         16.66403     0.00000         18.15812
  19        0.1875000      0.1875000      0.3750000     2.00000      -1806.63245     2.00000      -1806.63242     2.00000       -140.98946     2.00000       -140.98323     2.00000        -94.90441     2.00000        -94.90357     2.00000        -94.90101     2.00000        -94.88782     2.00000        -94.88524     2.00000        -94.88446     2.00000        -12.51549     2.00000         -5.20298     2.00000         -3.56917     2.00000         -1.39757     0.00000          3.16970     0.00000          4.12429     0.00000          4.32435     0.00000          6.20591     0.00000          6.70132     0.00000         11.02320     0.00000         11.70245     0.00000         13.24448     0.00000         14.96426     0.00000         16.62437     0.00000         17.99411
  20        0.1770833      0.1770833      0.3541667     2.00000      -1806.63245     2.00000      -1806.63242     2.00000       -140.98959     2.00000       -140.98310     2.00000        -94.90427     2.00000        -94.90348     2.00000        -94.90120     2.00000        -94.88762     2.00000        -94.88531     2.00000        -94.88459     2.00000        -12.65217     2.00000         -4.93682     2.00000         -3.36618     2.00000         -1.30332     0.00000          3.21678     0.00000          3.97524     0.00000          4.16823     0.00000          6.18385     0.00000          6.71149     0.00000         10.56016     0.00000         11.61674     0.00000         13.12846     0.00000         14.86497     0.00000         16.80244     0.00000         17.77194
  21        0.1666667      0.1666667      0.3333333     2.00000      -1806.63245     2.00000      -1806.63242     2.00000       -140.98971     2.00000       -140.98296     2.00000        -94.90413     2.00000        -94.90340     2.00000        -94.90138     2.00000        -94.88742     2.00000        -94.88538     2.00000        -94.88472     2.00000        -12.78223     2.00000         -4.66362     2.00000         -3.15854     2.00000         -1.21449     0.00000          3.24890     0.00000          3.83440     0.00000          4.01957     0.00000          6.16949     0.00000          6.73876     0.00000         10.11794     0.00000         11.47826     0.00000         13.02442     0.00000         14.67228     0.00000         17.15298     0.00000         17.49653
  22        0.1562500      0.1562500      0.3125000     2.00000      -1806.63245     2.00000      -1806.63241     2.00000       -140.98983     2.00000       -140.98284     2.00000        -94.90398     2.00000        -94.90332     2.00000        -94.90154     2.00000        -94.88724     2.00000        -94.88545     2.00000        -94.88485     2.00000        -12.90540     2.00000         -4.38373     2.00000         -2.94733     2.00000         -1.13156     0.00000          3.26679     0.00000          3.70185     0.00000          3.87840     0.00000          6.15501     0.00000          6.78271     0.00000          9.70269     0.00000         11.30270     0.00000         12.93217     0.00000         14.43973     0.00000         17.17560     0.00000         17.60848
  23        0.1458333      0.1458333      0.2916667     2.00000      -1806.63245     2.00000      -1806.63241     2.00000       -140.98995     2.00000       -140.98272     2.00000        -94.90384     2.00000        -94.90325     2.00000        -94.90170     2.00000        -94.88707     2.00000        -94.88551     2.00000        -94.88498     2.00000        -13.02145     2.00000         -4.09760     2.00000         -2.73372     2.00000         -1.05492     0.00000          3.27186     0.00000          3.57762     0.00000          3.74474     0.00000          6.12962     0.00000          6.84277     0.00000          9.32273     0.00000         11.10160     0.00000         12.85145     0.00000         14.19977     0.00000         16.81849     0.00000         18.12654
  24        0.1354167      0.1354167      0.2708333     2.00000      -1806.63246     2.00000      -1806.63241     2.00000       -140.99006     2.00000       -140.98260     2.00000        -94.90370     2.00000        -94.90317     2.00000        -94.90184     2.00000        -94.88691     2.00000        -94.88557     2.00000        -94.88510     2.00000        -13.13018     2.00000         -3.80581     2.00000         -2.51901     2.00000         -0.98479     0.00000          3.26590     0.00000          3.46178     0.00000          3.61861     0.00000          6.07981     0.00000          6.91830     0.00000          8.98869     0.00000         10.88364     0.00000         12.78194     0.00000         13.96796     0.00000         16.43496     0.00000         18.68448
  25        0.1250000      0.1250000      0.2500000     2.00000      -1806.63246     2.00000      -1806.63241     2.00000       -140.99016     2.00000       -140.98250     2.00000        -94.90357     2.00000        -94.90310     2.00000        -94.90197     2.00000        -94.88677     2.00000        -94.88563     2.00000        -94.88522     2.00000        -13.23140     2.00000         -3.50907     2.00000         -2.30464     2.00000         -0.92129     0.00000          3.25086     0.00000          3.35434     0.00000          3.49999     0.00000          5.99099     0.00000          7.00854     0.00000          8.71218     0.00000         10.65587     0.00000         12.72323     0.00000         13.75153     0.00000         16.03446     0.00000         19.26958
  26        0.1145833      0.1145833      0.2291667     2.00000      -1806.63246     2.00000      -1806.63241     2.00000       -140.99025     2.00000       -140.98240     2.00000        -94.90344     2.00000        -94.90304     2.00000        -94.90209     2.00000        -94.88664     2.00000        -94.88568     2.00000        -94.88534     2.00000        -13.32498     2.00000         -3.20830     2.00000         -2.09226     2.00000         -0.86442     0.00000          3.22861     0.00000          3.25537     0.00000          3.38891     0.00000          5.85163     0.00000          7.11258     0.00000          8.50211     0.00000         10.42445     0.00000         12.67488     0.00000         13.55362     0.00000         15.62567     0.00000         19.87403
  27        0.1041667      0.1041667      0.2083333     2.00000      -1806.63246     2.00000      -1806.63241     2.00000       -140.99034     2.00000       -140.98230     2.00000        -94.90331     2.00000        -94.90298     2.00000        -94.90219     2.00000        -94.88652     2.00000        -94.88573     2.00000        -94.88545     2.00000        -13.41077     2.00000         -2.90468     2.00000         -1.88373     2.00000         -0.81404     0.00000          3.16488     0.00000          3.20076     0.00000          3.28538     0.00000          5.65836     0.00000          7.22928     0.00000          8.35979     0.00000         10.19505     0.00000         12.63631     0.00000         13.37535     0.00000         15.21646     0.00000         20.49242
  28        0.0937500      0.0937500      0.1875000     2.00000      -1806.63246     2.00000      -1806.63241     2.00000       -140.99042     2.00000       -140.98221     2.00000        -94.90320     2.00000        -94.90292     2.00000        -94.90229     2.00000        -94.88641     2.00000        -94.88578     2.00000        -94.88554     2.00000        -13.48867     2.00000         -2.59980     2.00000         -1.68115     2.00000         -0.76996     0.00000          3.08291     0.00000          3.16852     0.00000          3.18947     0.00000          5.41809     0.00000          7.35708     0.00000          8.27720     0.00000          9.97303     0.00000         12.60689     0.00000         13.21674     0.00000         14.81385     0.00000         21.12052
  29        0.0833333      0.0833333      0.1666667     2.00000      -1806.63246     2.00000      -1806.63241     2.00000       -140.99049     2.00000       -140.98214     2.00000        -94.90309     2.00000        -94.90287     2.00000        -94.90237     2.00000        -94.88632     2.00000        -94.88582     2.00000        -94.88563     2.00000        -13.55858     2.00000         -2.29577     2.00000         -1.48695     2.00000         -0.73186     0.00000          3.00950     0.00000          3.10131     0.00000          3.13259     0.00000          5.14487     0.00000          7.49393     0.00000          8.24038     0.00000          9.76343     0.00000         12.58585     0.00000         13.07730     0.00000         14.42423     0.00000         21.75446
  30        0.0729167      0.0729167      0.1458333     2.00000      -1806.63246     2.00000      -1806.63240     2.00000       -140.99055     2.00000       -140.98206     2.00000        -94.90300     2.00000        -94.90282     2.00000        -94.90244     2.00000        -94.88623     2.00000        -94.88586     2.00000        -94.88571     2.00000        -13.62042     2.00000         -1.99546     2.00000         -1.30382     2.00000         -0.69943     0.00000          2.94465     0.00000          3.02113     0.00000          3.09302     0.00000          4.85511     0.00000          7.63703     0.00000          8.23466     0.00000          9.57093     0.00000         12.57226     0.00000         12.95633     0.00000         14.05364     0.00000         22.39009
  31        0.0625000      0.0625000      0.1250000     2.00000      -1806.63246     2.00000      -1806.63240     2.00000       -140.99060     2.00000       -140.98200     2.00000        -94.90291     2.00000        -94.90278     2.00000        -94.90250     2.00000        -94.88616     2.00000        -94.88589     2.00000        -94.88578     2.00000        -13.67411     2.00000         -1.70289     2.00000         -1.13479     2.00000         -0.67229     0.00000          2.88840     0.00000          2.94929     0.00000          3.04905     0.00000          4.56501     0.00000          7.78264     0.00000          8.24767     0.00000          9.39965     0.00000         12.56502     0.00000         12.85309     0.00000         13.70815     0.00000         23.02225
  32        0.0520833      0.0520833      0.1041667     2.00000      -1806.63246     2.00000      -1806.63240     2.00000       -140.99064     2.00000       -140.98195     2.00000        -94.90284     2.00000        -94.90274     2.00000        -94.90255     2.00000        -94.88611     2.00000        -94.88592     2.00000        -94.88584     2.00000        -13.71961     2.00000         -1.42368     2.00000         -0.98315     2.00000         -0.65007     0.00000          2.84077     0.00000          2.88631     0.00000          2.99899     0.00000          4.29039     0.00000          7.92587     0.00000          8.27013     0.00000          9.25291     0.00000         12.56280     0.00000         12.76690     0.00000         13.39424     0.00000         23.11345
  33        0.0416667      0.0416667      0.0833333     2.00000      -1806.63246     2.00000      -1806.63240     2.00000       -140.99067     2.00000       -140.98190     2.00000        -94.90278     2.00000        -94.90272     2.00000        -94.90259     2.00000        -94.88606     2.00000        -94.88594     2.00000        -94.88589     2.00000        -13.75687     2.00000         -1.16572     2.00000         -0.85238     2.00000         -0.63243     0.00000          2.80177     0.00000          2.83290     0.00000          2.94082     0.00000          4.04719     0.00000          8.06047     0.00000          8.29542     0.00000          9.13302     0.00000         12.56412     0.00000         12.69715     0.00000         13.11917     0.00000         23.10850
  34        0.0312500      0.0312500      0.0625000     2.00000      -1806.63246     2.00000      -1806.63240     2.00000       -140.99069     2.00000       -140.98187     2.00000        -94.90273     2.00000        -94.90269     2.00000        -94.90262     2.00000        -94.88603     2.00000        -94.88596     2.00000        -94.88593     2.00000        -13.78586     2.00000         -0.93992     2.00000         -0.74597     2.00000         -0.61906     0.00000          2.77143     0.00000          2.78992     0.00000          2.87447     0.00000          3.85049     0.00000          8.17883     0.00000          8.31898     0.00000          9.04099     0.00000         12.56738     0.00000         12.64339     0.00000         12.89117     0.00000         23.05264
  35        0.0208333      0.0208333      0.0416667     2.00000      -1806.63246     2.00000      -1806.63240     2.00000       -140.99071     2.00000       -140.98184     2.00000        -94.90269     2.00000        -94.90268     2.00000        -94.90265     2.00000        -94.88600     2.00000        -94.88597     2.00000        -94.88596     2.00000        -13.80658     2.00000         -0.76041     2.00000         -0.66718     2.00000         -0.60970     0.00000          2.74974     0.00000          2.75831     0.00000          2.80655     0.00000          3.71059     0.00000          8.27241     0.00000          8.33772     0.00000          8.97660     0.00000         12.57106     0.00000         12.60525     0.00000         12.71911     0.00000         22.98358
  36        0.0104167      0.0104167      0.0208333     2.00000      -1806.63246     2.00000      -1806.63240     2.00000       -140.99071     2.00000       -140.98182     2.00000        -94.90267     2.00000        -94.90267     2.00000        -94.90266     2.00000        -94.88599     2.00000        -94.88598     2.00000        -94.88598     2.00000        -13.81901     2.00000         -0.64326     2.00000         -0.61870     2.00000         -0.60417     0.00000          2.73673     0.00000          2.73892     0.00000          2.75301     0.00000          3.62936     0.00000          8.33285     0.00000          8.34969     0.00000          8.93877     0.00000         12.57385     0.00000         12.58246     0.00000         12.61154     0.00000         22.93107
  37        0.0000000      0.0000000      0.0000000     2.00000      -1806.63246     2.00000      -1806.63240     2.00000       -140.99072     2.00000       -140.98182     2.00000        -94.90266     2.00000        -94.90266     2.00000        -94.90266     2.00000        -94.88598     2.00000        -94.88598     2.00000        -94.88598     2.00000        -13.82316     2.00000         -0.60234     2.00000         -0.60234     2.00000         -0.60233     0.00000          2.73239     0.00000          2.73239     0.00000          2.73239     0.00000          3.60307     0.00000          8.35379     0.00000          8.35379     0.00000          8.92632     0.00000         12.57488     0.00000         12.57488     0.00000         12.57488     0.00000         22.91183
