   1        0.5000000      0.0000000      0.5000000     2.00000      -1806.63240     2.00000      -1806.63240     2.00000       -140.98629     2.00000       -140.98629     2.00000        -94.90554     2.00000        -94.90554     2.00000        -94.89441     2.00000        -94.89441     2.00000        -94.88376     2.00000        -94.88376     2.00000         -9.25186     2.00000         -9.25185     2.00000         -3.71625     2.00000         -3.71625     0.00000          0.75791     0.00000          0.75791     0.00000         10.88095     0.00000         10.88095     0.00000         11.70938     0.00000         11.70938     0.00000         13.42287     0.00000         13.42287     0.00000         13.95792     0.00000         13.95793     0.00000         20.99309
   2        0.5000000      0.0156250      0.5156250     2.00000      -1806.63240     2.00000      -1806.63240     2.00000       -140.98629     2.00000       -140.98629     2.00000        -94.90554     2.00000        -94.90554     2.00000        -94.89441     2.00000        -94.89441     2.00000        -94.88375     2.00000        -94.88375     2.00000         -9.25030     2.00000         -9.25030     2.00000         -3.72902     2.00000         -3.72902     0.00000          0.78237     0.00000          0.78237     0.00000         10.83955     0.00000         10.83956     0.00000         11.65036     0.00000         11.65036     0.00000         13.47105     0.00000         13.47105     0.00000         14.01486     0.00000         14.01487     0.00000         20.92434
   3        0.5000000      0.0312500      0.5312500     2.00000      -1806.63240     2.00000      -1806.63240     2.00000       -140.98629     2.00000       -140.98629     2.00000        -94.90554     2.00000        -94.90554     2.00000        -94.89441     2.00000        -94.89441     2.00000        -94.88375     2.00000        -94.88375     2.00000         -9.24569     2.00000         -9.24568     2.00000         -3.76629     2.00000         -3.76629     0.00000          0.85472     0.00000          0.85472     0.00000         10.70078     0.00000         10.70078     0.00000         11.52967     0.00000         11.52967     0.00000         13.55704     0.00000         13.55704     0.00000         14.20237     0.00000         14.20237     0.00000         20.75240
   4        0.5000000      0.0468750      0.5468750     2.00000      -1806.63240     2.00000      -1806.63240     2.00000       -140.98629     2.00000       -140.98629     2.00000        -94.90554     2.00000        -94.90554     2.00000        -94.89441     2.00000        -94.89441     2.00000        -94.88374     2.00000        -94.88374     2.00000         -9.23814     2.00000         -9.23814     2.00000         -3.82518     2.00000         -3.82518     0.00000          0.97219     0.00000          0.97219     0.00000         10.45009     0.00000         10.45009     0.00000         11.43036     0.00000         11.43036     0.00000         13.62031     0.00000         13.62031     0.00000         14.51222     0.00000         14.51223     0.00000         20.52988
   5        0.5000000      0.0625000      0.5625000     2.00000      -1806.63241     2.00000      -1806.63240     2.00000       -140.98630     2.00000       -140.98629     2.00000        -94.90554     2.00000        -94.90554     2.00000        -94.89441     2.00000        -94.89441     2.00000        -94.88373     2.00000        -94.88373     2.00000         -9.22790     2.00000         -9.22790     2.00000         -3.90155     2.00000         -3.90155     0.00000          1.13077     0.00000          1.13077     0.00000         10.11146     0.00000         10.11146     0.00000         11.37252     0.00000         11.37252     0.00000         13.66402     0.00000         13.66402     0.00000         14.89682     0.00000         14.89683     0.00000         20.28820
   6        0.5000000      0.0781250      0.5781250     2.00000      -1806.63241     2.00000      -1806.63241     2.00000       -140.98630     2.00000       -140.98630     2.00000        -94.90554     2.00000        -94.90554     2.00000        -94.89441     2.00000        -94.89441     2.00000        -94.88372     2.00000        -94.88372     2.00000         -9.21527     2.00000         -9.21527     2.00000         -3.99066     2.00000         -3.99066     0.00000          1.32592     0.00000          1.32592     0.00000          9.72190     0.00000          9.72190     0.00000         11.34166     0.00000         11.34167     0.00000         13.70044     0.00000         13.70045     0.00000         15.32076     0.00000         15.32077     0.00000         20.04330
   7        0.5000000      0.0937500      0.5937500     2.00000      -1806.63241     2.00000      -1806.63241     2.00000       -140.98631     2.00000       -140.98631     2.00000        -94.90554     2.00000        -94.90554     2.00000        -94.89442     2.00000        -94.89441     2.00000        -94.88370     2.00000        -94.88370     2.00000         -9.20065     2.00000         -9.20065     2.00000         -4.08773     2.00000         -4.08773     0.00000          1.55309     0.00000          1.55310     0.00000          9.30571     0.00000          9.30571     0.00000         11.32509     0.00000         11.32509     0.00000         13.73533     0.00000         13.73534     0.00000         15.76583     0.00000         15.76583     0.00000         19.80405
   8        0.5000000      0.1093750      0.6093750     2.00000      -1806.63241     2.00000      -1806.63241     2.00000       -140.98631     2.00000       -140.98631     2.00000        -94.90555     2.00000        -94.90555     2.00000        -94.89442     2.00000        -94.89442     2.00000        -94.88368     2.00000        -94.88368     2.00000         -9.18454     2.00000         -9.18454     2.00000         -4.18830     2.00000         -4.18830     0.00000          1.80809     0.00000          1.80809     0.00000          8.87603     0.00000          8.87603     0.00000         11.31612     0.00000         11.31612     0.00000         13.77072     0.00000         13.77072     0.00000         16.22231     0.00000         16.22231     0.00000         19.57625
   9        0.5000000      0.1250000      0.6250000     2.00000      -1806.63241     2.00000      -1806.63241     2.00000       -140.98632     2.00000       -140.98632     2.00000        -94.90555     2.00000        -94.90555     2.00000        -94.89442     2.00000        -94.89442     2.00000        -94.88366     2.00000        -94.88366     2.00000         -9.16750     2.00000         -9.16750     2.00000         -4.28837     2.00000         -4.28837     0.00000          2.08716     0.00000          2.08716     0.00000          8.44014     0.00000          8.44014     0.00000         11.31139     0.00000         11.31139     0.00000         13.80698     0.00000         13.80698     0.00000         16.68406     0.00000         16.68406     0.00000         19.36457
  10        0.5000000      0.1406250      0.6406250     2.00000      -1806.63242     2.00000      -1806.63242     2.00000       -140.98633     2.00000       -140.98633     2.00000        -94.90555     2.00000        -94.90555     2.00000        -94.89442     2.00000        -94.89442     2.00000        -94.88364     2.00000        -94.88364     2.00000         -9.15014     2.00000         -9.15014     2.00000         -4.38447     2.00000         -4.38447     0.00000          2.38701     0.00000          2.38701     0.00000          8.00250     0.00000          8.00250     0.00000         11.30913     0.00000         11.30913     0.00000         13.84366     0.00000         13.84366     0.00000         17.14579     0.00000         17.14579     0.00000         19.17397
  11        0.5000000      0.1562500      0.6562500     2.00000      -1806.63242     2.00000      -1806.63242     2.00000       -140.98633     2.00000       -140.98633     2.00000        -94.90555     2.00000        -94.90555     2.00000        -94.89442     2.00000        -94.89442     2.00000        -94.88362     2.00000        -94.88362     2.00000         -9.13315     2.00000         -9.13315     2.00000         -4.47362     2.00000         -4.47362     0.00000          2.70469     0.00000          2.70469     0.00000          7.56622     0.00000          7.56622     0.00000         11.30829     0.00000         11.30829     0.00000         13.87982     0.00000         13.87982     0.00000         17.59989     0.00000         17.59989     0.00000         19.01221
  12        0.5000000      0.1718750      0.6718750     2.00000      -1806.63242     2.00000      -1806.63242     2.00000       -140.98634     2.00000       -140.98634     2.00000        -94.90555     2.00000        -94.90555     2.00000        -94.89442     2.00000        -94.89442     2.00000        -94.88360     2.00000        -94.88360     2.00000         -9.11721     2.00000         -9.11721     2.00000         -4.55329     2.00000         -4.55329     0.00000          3.03737     0.00000          3.03738     0.00000          7.13392     0.00000          7.13392     0.00000         11.30827     0.00000         11.30827     0.00000         13.91418     0.00000         13.91418     0.00000         18.02610     0.00000         18.02610     0.00000         18.89986
  13        0.5000000      0.1875000      0.6875000     2.00000      -1806.63242     2.00000      -1806.63242     2.00000       -140.98635     2.00000       -140.98635     2.00000        -94.90555     2.00000        -94.90555     2.00000        -94.89442     2.00000        -94.89442     2.00000        -94.88358     2.00000        -94.88358     2.00000         -9.10301     2.00000         -9.10301     2.00000         -4.62138     2.00000         -4.62138     0.00000          3.38190     0.00000          3.38190     0.00000          6.70843     0.00000          6.70843     0.00000         11.30865     0.00000         11.30865     0.00000         13.94530     0.00000         13.94530     0.00000         18.34140     0.00000         18.34140     0.00000         18.91999
  14        0.5000000      0.2031250      0.7031250     2.00000      -1806.63242     2.00000      -1806.63242     2.00000       -140.98635     2.00000       -140.98635     2.00000        -94.90555     2.00000        -94.90555     2.00000        -94.89442     2.00000        -94.89442     2.00000        -94.88356     2.00000        -94.88356     2.00000         -9.09119     2.00000         -9.09119     2.00000         -4.67614     2.00000         -4.67614     0.00000          3.73372     0.00000          3.73372     0.00000          6.29398     0.00000          6.29398     0.00000         11.30916     0.00000         11.30916     0.00000         13.97161     0.00000         13.97161     0.00000         18.41979     0.00000         18.41979     0.00000         19.19755
  15        0.5000000      0.2187500      0.7187500     2.00000      -1806.63243     2.00000      -1806.63243     2.00000       -140.98636     2.00000       -140.98636     2.00000        -94.90555     2.00000        -94.90555     2.00000        -94.89442     2.00000        -94.89442     2.00000        -94.88355     2.00000        -94.88355     2.00000         -9.08231     2.00000         -9.08231     2.00000         -4.71623     2.00000         -4.71623     0.00000          4.08342     0.00000          4.08342     0.00000          5.89972     0.00000          5.89972     0.00000         11.30963     0.00000         11.30964     0.00000         13.99167     0.00000         13.99167     0.00000         18.39341     0.00000         18.39342     0.00000         19.59597
  16        0.5000000      0.2343750      0.7343750     2.00000      -1806.63243     2.00000      -1806.63243     2.00000       -140.98636     2.00000       -140.98636     2.00000        -94.90556     2.00000        -94.90556     2.00000        -94.89442     2.00000        -94.89442     2.00000        -94.88354     2.00000        -94.88354     2.00000         -9.07680     2.00000         -9.07680     2.00000         -4.74068     2.00000         -4.74068     0.00000          4.40117     0.00000          4.40118     0.00000          5.55530     0.00000          5.55530     0.00000         11.30996     0.00000         11.30996     0.00000         14.00425     0.00000         14.00425     0.00000         18.36337     0.00000         18.36337     0.00000         19.99523
  17        0.5000000      0.2500000      0.7500000     2.00000      -1806.63243     2.00000      -1806.63243     2.00000       -140.98636     2.00000       -140.98636     2.00000        -94.90556     2.00000        -94.90556     2.00000        -94.89442     2.00000        -94.89442     2.00000        -94.88354     2.00000        -94.88354     2.00000         -9.07493     2.00000         -9.07493     2.00000         -4.74889     2.00000         -4.74889     0.00000          4.56326     0.00000          4.56326     0.00000          5.38433     0.00000          5.38434     0.00000         11.31007     0.00000         11.31008     0.00000         14.00854     0.00000         14.00854     0.00000         18.35196     0.00000         18.35196     0.00000         20.23561
