   1        0.3750000      0.3750000      0.7500000     2.00000      -1807.19257     2.00000      -1807.19257     2.00000       -141.54717     2.00000       -141.54581     2.00000        -95.46590     2.00000        -95.46526     2.00000        -95.45642     2.00000        -95.45274     2.00000        -95.44416     2.00000        -95.44352     2.00000        -10.27831     2.00000         -9.15271     2.00000         -5.80281     2.00000         -3.80378     0.00000          0.72806     0.00000          3.86203     0.00000          7.52048     0.00000          7.97336     0.00000          8.32500     0.00000          8.57191     0.00000         15.24377     0.00000         15.38133     0.00000         15.95531     0.00000         16.74518     0.00000         17.08424
   2        0.3645833      0.3645833      0.7291667     2.00000      -1807.19257     2.00000      -1807.19257     2.00000       -141.54729     2.00000       -141.54571     2.00000        -95.46590     2.00000        -95.46519     2.00000        -95.45669     2.00000        -95.45248     2.00000        -95.44421     2.00000        -95.44350     2.00000        -10.38859     2.00000         -9.03860     2.00000         -5.87012     2.00000         -3.72488     0.00000          0.81689     0.00000          4.31902     0.00000          7.24702     0.00000          7.69607     0.00000          8.10541     0.00000          8.33891     0.00000         15.41538     0.00000         15.61094     0.00000         16.27091     0.00000         16.47711     0.00000         17.03833
   3        0.3541667      0.3541667      0.7083333     2.00000      -1807.19257     2.00000      -1807.19257     2.00000       -141.54741     2.00000       -141.54560     2.00000        -95.46590     2.00000        -95.46512     2.00000        -95.45697     2.00000        -95.45222     2.00000        -95.44426     2.00000        -95.44349     2.00000        -10.51212     2.00000         -8.91548     2.00000         -5.91261     2.00000         -3.64079     0.00000          0.91162     0.00000          4.77851     0.00000          6.97824     0.00000          7.43263     0.00000          7.88875     0.00000          8.11352     0.00000         15.53096     0.00000         15.83526     0.00000         16.27237     0.00000         16.58354     0.00000         16.84392
   4        0.3437500      0.3437500      0.6875000     2.00000      -1807.19258     2.00000      -1807.19257     2.00000       -141.54754     2.00000       -141.54548     2.00000        -95.46588     2.00000        -95.46504     2.00000        -95.45725     2.00000        -95.45194     2.00000        -95.44432     2.00000        -95.44349     2.00000        -10.64780     2.00000         -8.78340     2.00000         -5.93052     2.00000         -3.55182     0.00000          1.01189     0.00000          5.23075     0.00000          6.71465     0.00000          7.19152     0.00000          7.67611     0.00000          7.89653     0.00000         15.51109     0.00000         16.05401     0.00000         16.20805     0.00000         16.59322     0.00000         16.89283
   5        0.3333333      0.3333333      0.6666667     2.00000      -1807.19258     2.00000      -1807.19257     2.00000       -141.54767     2.00000       -141.54536     2.00000        -95.46586     2.00000        -95.46496     2.00000        -95.45754     2.00000        -95.45167     2.00000        -95.44438     2.00000        -95.44349     2.00000        -10.79414     2.00000         -8.64237     2.00000         -5.92471     2.00000         -3.45830     0.00000          1.11727     0.00000          5.64987     0.00000          6.45665     0.00000          6.99732     0.00000          7.46852     0.00000          7.68870     0.00000         15.34686     0.00000         16.26684     0.00000         16.28714     0.00000         16.32502     0.00000         17.19859
   6        0.3229167      0.3229167      0.6458333     2.00000      -1807.19258     2.00000      -1807.19258     2.00000       -141.54780     2.00000       -141.54523     2.00000        -95.46583     2.00000        -95.46488     2.00000        -95.45783     2.00000        -95.45138     2.00000        -95.44444     2.00000        -95.44351     2.00000        -10.94938     2.00000         -8.49245     2.00000         -5.89642     2.00000         -3.36060     0.00000          1.22729     0.00000          5.95304     0.00000          6.20458     0.00000          6.93148     0.00000          7.26692     0.00000          7.49078     0.00000         15.12406     0.00000         16.05403     0.00000         16.40394     0.00000         16.47325     0.00000         17.50080
   7        0.3125000      0.3125000      0.6250000     2.00000      -1807.19258     2.00000      -1807.19258     2.00000       -141.54794     2.00000       -141.54510     2.00000        -95.46578     2.00000        -95.46480     2.00000        -95.45811     2.00000        -95.45110     2.00000        -95.44451     2.00000        -95.44353     2.00000        -11.11166     2.00000         -8.33367     2.00000         -5.84714     2.00000         -3.25912     0.00000          1.34135     0.00000          5.95873     0.00000          6.00520     0.00000          7.07224     0.00000          7.12754     0.00000          7.30349     0.00000         14.88696     0.00000         15.78686     0.00000         16.42742     0.00000         16.67252     0.00000         17.22473
   8        0.3020833      0.3020833      0.6041667     2.00000      -1807.19258     2.00000      -1807.19258     2.00000       -141.54807     2.00000       -141.54496     2.00000        -95.46573     2.00000        -95.46471     2.00000        -95.45840     2.00000        -95.45081     2.00000        -95.44457     2.00000        -95.44357     2.00000        -11.27915     2.00000         -8.16609     2.00000         -5.77845     2.00000         -3.15434     0.00000          1.45877     0.00000          5.71936     0.00000          5.87326     0.00000          6.88542     0.00000          7.12755     0.00000          7.51678     0.00000         14.64950     0.00000         15.52730     0.00000         16.15414     0.00000         16.86358     0.00000         17.14152
   9        0.2916667      0.2916667      0.5833333     2.00000      -1807.19258     2.00000      -1807.19258     2.00000       -141.54821     2.00000       -141.54482     2.00000        -95.46567     2.00000        -95.46462     2.00000        -95.45869     2.00000        -95.45053     2.00000        -95.44465     2.00000        -95.44362     2.00000        -11.45009     2.00000         -7.98976     2.00000         -5.69193     2.00000         -3.04675     0.00000          1.57872     0.00000          5.48667     0.00000          5.68178     0.00000          6.70740     0.00000          6.96368     0.00000          7.97236     0.00000         14.41635     0.00000         15.27826     0.00000         15.68226     0.00000         17.04488     0.00000         17.26741
  10        0.2812500      0.2812500      0.5625000     2.00000      -1807.19258     2.00000      -1807.19258     2.00000       -141.54835     2.00000       -141.54468     2.00000        -95.46559     2.00000        -95.46453     2.00000        -95.45897     2.00000        -95.45024     2.00000        -95.44472     2.00000        -95.44368     2.00000        -11.62287     2.00000         -7.80474     2.00000         -5.58909     2.00000         -2.93691     0.00000          1.70024     0.00000          5.26087     0.00000          5.47411     0.00000          6.53918     0.00000          6.81263     0.00000          8.44783     0.00000         14.18860     0.00000         15.04264     0.00000         15.16265     0.00000         17.21431     0.00000         17.45169
  11        0.2708333      0.2708333      0.5416667     2.00000      -1807.19258     2.00000      -1807.19258     2.00000       -141.54849     2.00000       -141.54453     2.00000        -95.46551     2.00000        -95.46443     2.00000        -95.45924     2.00000        -95.44996     2.00000        -95.44479     2.00000        -95.44375     2.00000        -11.79605     2.00000         -7.61109     2.00000         -5.47133     2.00000         -2.82540     0.00000          1.82218     0.00000          5.04214     0.00000          5.26363     0.00000          6.38182     0.00000          6.67512     0.00000          8.92552     0.00000         13.96396     0.00000         14.63697     0.00000         14.82408     0.00000         17.36896     0.00000         17.65618
  12        0.2604167      0.2604167      0.5208333     2.00000      -1807.19258     2.00000      -1807.19257     2.00000       -141.54863     2.00000       -141.54438     2.00000        -95.46542     2.00000        -95.46434     2.00000        -95.45951     2.00000        -95.44968     2.00000        -95.44486     2.00000        -95.44382     2.00000        -11.96838     2.00000         -7.40890     2.00000         -5.33994     2.00000         -2.71287     0.00000          1.94317     0.00000          4.83064     0.00000          5.05537     0.00000          6.23648     0.00000          6.55190     0.00000          9.39413     0.00000         13.72867     0.00000         14.13026     0.00000         14.62760     0.00000         17.50504     0.00000         17.87080
  13        0.2500000      0.2500000      0.5000000     2.00000      -1807.19258     2.00000      -1807.19257     2.00000       -141.54877     2.00000       -141.54424     2.00000        -95.46531     2.00000        -95.46425     2.00000        -95.45977     2.00000        -95.44941     2.00000        -95.44494     2.00000        -95.44391     2.00000        -12.13876     2.00000         -7.19824     2.00000         -5.19613     2.00000         -2.60001     0.00000          2.06163     0.00000          4.62653     0.00000          4.85159     0.00000          6.10435     0.00000          6.44367     0.00000          9.84212     0.00000         13.41035     0.00000         13.71954     0.00000         14.46047     0.00000         17.61768     0.00000         17.78417
  14        0.2395833      0.2395833      0.4791667     2.00000      -1807.19258     2.00000      -1807.19257     2.00000       -141.54891     2.00000       -141.54409     2.00000        -95.46520     2.00000        -95.46415     2.00000        -95.46003     2.00000        -95.44915     2.00000        -95.44501     2.00000        -95.44401     2.00000        -12.30624     2.00000         -6.97921     2.00000         -5.04098     2.00000         -2.48754     0.00000          2.17576     0.00000          4.42995     0.00000          4.65347     0.00000          5.98670     0.00000          6.35111     0.00000         10.25477     0.00000         12.94865     0.00000         13.46780     0.00000         14.33305     0.00000         17.38153     0.00000         17.70091
  15        0.2291667      0.2291667      0.4583333     2.00000      -1807.19258     2.00000      -1807.19257     2.00000       -141.54905     2.00000       -141.54394     2.00000        -95.46508     2.00000        -95.46406     2.00000        -95.46027     2.00000        -95.44889     2.00000        -95.44509     2.00000        -95.44411     2.00000        -12.47001     2.00000         -6.75193     2.00000         -4.87550     2.00000         -2.37621     0.00000          2.28354     0.00000          4.24103     0.00000          4.46168     0.00000          5.88472     0.00000          6.27485     0.00000         10.61262     0.00000         12.44418     0.00000         13.27632     0.00000         14.25860     0.00000         16.99138     0.00000         17.74777
  16        0.2187500      0.2187500      0.4375000     2.00000      -1807.19258     2.00000      -1807.19256     2.00000       -141.54919     2.00000       -141.54379     2.00000        -95.46496     2.00000        -95.46397     2.00000        -95.46051     2.00000        -95.44864     2.00000        -95.44516     2.00000        -95.44423     2.00000        -12.62939     2.00000         -6.51651     2.00000         -4.70068     2.00000         -2.26680     0.00000          2.38282     0.00000          4.05988     0.00000          4.27663     0.00000          5.79945     0.00000          6.21541     0.00000         10.89280     0.00000         11.93652     0.00000         13.10723     0.00000         14.24931     0.00000         16.62837     0.00000         17.75076
  17        0.2083333      0.2083333      0.4166667     2.00000      -1807.19258     2.00000      -1807.19256     2.00000       -141.54933     2.00000       -141.54365     2.00000        -95.46483     2.00000        -95.46388     2.00000        -95.46073     2.00000        -95.44840     2.00000        -95.44524     2.00000        -95.44434     2.00000        -12.78377     2.00000         -6.27312     2.00000         -4.51743     2.00000         -2.16008     0.00000          2.47147     0.00000          3.88662     0.00000          4.09859     0.00000          5.73149     0.00000          6.17318     0.00000         11.07576     0.00000         11.43462     0.00000         12.95330     0.00000         14.30344     0.00000         16.31692     0.00000         17.70269
  18        0.1979167      0.1979167      0.3958333     2.00000      -1807.19259     2.00000      -1807.19256     2.00000       -141.54946     2.00000       -141.54351     2.00000        -95.46469     2.00000        -95.46379     2.00000        -95.46095     2.00000        -95.44818     2.00000        -95.44531     2.00000        -95.44447     2.00000        -12.93267     2.00000         -6.02192     2.00000         -4.32666     2.00000         -2.05681     0.00000          2.54755     0.00000          3.72135     0.00000          3.92775     0.00000          5.68070     0.00000          6.14842     0.00000         10.94243     0.00000         11.15536     0.00000         12.81256     0.00000         14.38286     0.00000         16.10389     0.00000         17.59798
  19        0.1875000      0.1875000      0.3750000     2.00000      -1807.19259     2.00000      -1807.19256     2.00000       -141.54960     2.00000       -141.54337     2.00000        -95.46455     2.00000        -95.46370     2.00000        -95.46115     2.00000        -95.44796     2.00000        -95.44538     2.00000        -95.44459     2.00000        -13.07563     2.00000         -5.76312     2.00000         -4.12931     2.00000         -1.95771     0.00000          2.60956     0.00000          3.56415     0.00000          3.76422     0.00000          5.64578     0.00000          6.14118     0.00000         10.46307     0.00000         11.14231     0.00000         12.68434     0.00000         14.40412     0.00000         16.06423     0.00000         17.43397
  20        0.1770833      0.1770833      0.3541667     2.00000      -1807.19259     2.00000      -1807.19256     2.00000       -141.54973     2.00000       -141.54323     2.00000        -95.46441     2.00000        -95.46362     2.00000        -95.46134     2.00000        -95.44775     2.00000        -95.44545     2.00000        -95.44472     2.00000        -13.21231     2.00000         -5.49696     2.00000         -3.92632     2.00000         -1.86346     0.00000          2.65664     0.00000          3.41510     0.00000          3.60809     0.00000          5.62371     0.00000          6.15135     0.00000         10.00002     0.00000         11.05660     0.00000         12.56832     0.00000         14.30483     0.00000         16.24230     0.00000         17.21180
  21        0.1666667      0.1666667      0.3333333     2.00000      -1807.19259     2.00000      -1807.19255     2.00000       -141.54985     2.00000       -141.54310     2.00000        -95.46427     2.00000        -95.46354     2.00000        -95.46152     2.00000        -95.44756     2.00000        -95.44552     2.00000        -95.44486     2.00000        -13.34236     2.00000         -5.22376     2.00000         -3.71868     2.00000         -1.77462     0.00000          2.68876     0.00000          3.27427     0.00000          3.45943     0.00000          5.60935     0.00000          6.17862     0.00000          9.55780     0.00000         10.91812     0.00000         12.46429     0.00000         14.11215     0.00000         16.59284     0.00000         16.93639
  22        0.1562500      0.1562500      0.3125000     2.00000      -1807.19259     2.00000      -1807.19255     2.00000       -141.54997     2.00000       -141.54298     2.00000        -95.46412     2.00000        -95.46346     2.00000        -95.46168     2.00000        -95.44738     2.00000        -95.44559     2.00000        -95.44499     2.00000        -13.46554     2.00000         -4.94387     2.00000         -3.50747     2.00000         -1.69170     0.00000          2.70665     0.00000          3.14171     0.00000          3.31826     0.00000          5.59487     0.00000          6.22257     0.00000          9.14255     0.00000         10.74256     0.00000         12.37203     0.00000         13.87959     0.00000         16.61546     0.00000         17.04834
  23        0.1458333      0.1458333      0.2916667     2.00000      -1807.19259     2.00000      -1807.19255     2.00000       -141.55009     2.00000       -141.54286     2.00000        -95.46398     2.00000        -95.46338     2.00000        -95.46184     2.00000        -95.44721     2.00000        -95.44565     2.00000        -95.44512     2.00000        -13.58159     2.00000         -4.65774     2.00000         -3.29386     2.00000         -1.61505     0.00000          2.71172     0.00000          3.01749     0.00000          3.18460     0.00000          5.56948     0.00000          6.28263     0.00000          8.76259     0.00000         10.54146     0.00000         12.29131     0.00000         13.63963     0.00000         16.25835     0.00000         17.56640
  24        0.1354167      0.1354167      0.2708333     2.00000      -1807.19259     2.00000      -1807.19255     2.00000       -141.55020     2.00000       -141.54274     2.00000        -95.46384     2.00000        -95.46331     2.00000        -95.46198     2.00000        -95.44705     2.00000        -95.44571     2.00000        -95.44524     2.00000        -13.69031     2.00000         -4.36595     2.00000         -3.07915     2.00000         -1.54493     0.00000          2.70576     0.00000          2.90164     0.00000          3.05847     0.00000          5.51967     0.00000          6.35816     0.00000          8.42855     0.00000         10.32350     0.00000         12.22180     0.00000         13.40782     0.00000         15.87483     0.00000         18.12434
  25        0.1250000      0.1250000      0.2500000     2.00000      -1807.19260     2.00000      -1807.19255     2.00000       -141.55030     2.00000       -141.54264     2.00000        -95.46371     2.00000        -95.46324     2.00000        -95.46211     2.00000        -95.44691     2.00000        -95.44577     2.00000        -95.44536     2.00000        -13.79154     2.00000         -4.06921     2.00000         -2.86478     2.00000         -1.48143     0.00000          2.69073     0.00000          2.79421     0.00000          2.93986     0.00000          5.43086     0.00000          6.44840     0.00000          8.15204     0.00000         10.09573     0.00000         12.16310     0.00000         13.19139     0.00000         15.47432     0.00000         18.70945
  26        0.1145833      0.1145833      0.2291667     2.00000      -1807.19260     2.00000      -1807.19255     2.00000       -141.55039     2.00000       -141.54253     2.00000        -95.46358     2.00000        -95.46318     2.00000        -95.46223     2.00000        -95.44678     2.00000        -95.44582     2.00000        -95.44548     2.00000        -13.88512     2.00000         -3.76844     2.00000         -2.65240     2.00000         -1.42456     0.00000          2.66848     0.00000          2.69523     0.00000          2.82877     0.00000          5.29149     0.00000          6.55244     0.00000          7.94197     0.00000          9.86431     0.00000         12.11474     0.00000         12.99348     0.00000         15.06554     0.00000         19.31389
  27        0.1041667      0.1041667      0.2083333     2.00000      -1807.19260     2.00000      -1807.19255     2.00000       -141.55048     2.00000       -141.54244     2.00000        -95.46345     2.00000        -95.46312     2.00000        -95.46233     2.00000        -95.44666     2.00000        -95.44587     2.00000        -95.44558     2.00000        -13.97091     2.00000         -3.46482     2.00000         -2.44386     2.00000         -1.37418     0.00000          2.60474     0.00000          2.64062     0.00000          2.72524     0.00000          5.09822     0.00000          6.66914     0.00000          7.79965     0.00000          9.63491     0.00000         12.07617     0.00000         12.81521     0.00000         14.65632     0.00000         19.93228
  28        0.0937500      0.0937500      0.1875000     2.00000      -1807.19260     2.00000      -1807.19255     2.00000       -141.55056     2.00000       -141.54235     2.00000        -95.46334     2.00000        -95.46306     2.00000        -95.46243     2.00000        -95.44655     2.00000        -95.44592     2.00000        -95.44568     2.00000        -14.04881     2.00000         -3.15994     2.00000         -2.24129     2.00000         -1.33010     0.00000          2.52278     0.00000          2.60838     0.00000          2.62933     0.00000          4.85795     0.00000          6.79695     0.00000          7.71706     0.00000          9.41289     0.00000         12.04675     0.00000         12.65660     0.00000         14.25371     0.00000         20.56038
  29        0.0833333      0.0833333      0.1666667     2.00000      -1807.19260     2.00000      -1807.19254     2.00000       -141.55063     2.00000       -141.54227     2.00000        -95.46323     2.00000        -95.46301     2.00000        -95.46251     2.00000        -95.44646     2.00000        -95.44596     2.00000        -95.44577     2.00000        -14.11872     2.00000         -2.85590     2.00000         -2.04709     2.00000         -1.29200     0.00000          2.44936     0.00000          2.54118     0.00000          2.57245     0.00000          4.58473     0.00000          6.93380     0.00000          7.68024     0.00000          9.20329     0.00000         12.02571     0.00000         12.51716     0.00000         13.86409     0.00000         21.19432
  30        0.0729167      0.0729167      0.1458333     2.00000      -1807.19260     2.00000      -1807.19254     2.00000       -141.55069     2.00000       -141.54220     2.00000        -95.46313     2.00000        -95.46296     2.00000        -95.46258     2.00000        -95.44637     2.00000        -95.44600     2.00000        -95.44585     2.00000        -14.18056     2.00000         -2.55560     2.00000         -1.86396     2.00000         -1.25957     0.00000          2.38451     0.00000          2.46099     0.00000          2.53289     0.00000          4.29497     0.00000          7.07689     0.00000          7.67452     0.00000          9.01079     0.00000         12.01212     0.00000         12.39620     0.00000         13.49350     0.00000         21.82995
  31        0.0625000      0.0625000      0.1250000     2.00000      -1807.19260     2.00000      -1807.19254     2.00000       -141.55074     2.00000       -141.54214     2.00000        -95.46305     2.00000        -95.46292     2.00000        -95.46264     2.00000        -95.44630     2.00000        -95.44603     2.00000        -95.44592     2.00000        -14.23425     2.00000         -2.26303     2.00000         -1.69493     2.00000         -1.23242     0.00000          2.32826     0.00000          2.38915     0.00000          2.48891     0.00000          4.00487     0.00000          7.22250     0.00000          7.68753     0.00000          8.83951     0.00000         12.00488     0.00000         12.29296     0.00000         13.14801     0.00000         22.46211
  32        0.0520833      0.0520833      0.1041667     2.00000      -1807.19260     2.00000      -1807.19254     2.00000       -141.55078     2.00000       -141.54209     2.00000        -95.46298     2.00000        -95.46288     2.00000        -95.46269     2.00000        -95.44625     2.00000        -95.44606     2.00000        -95.44598     2.00000        -14.27975     2.00000         -1.98382     2.00000         -1.54329     2.00000         -1.21021     0.00000          2.28063     0.00000          2.32617     0.00000          2.43885     0.00000          3.73025     0.00000          7.36573     0.00000          7.70999     0.00000          8.69278     0.00000         12.00266     0.00000         12.20676     0.00000         12.83410     0.00000         22.55331
  33        0.0416667      0.0416667      0.0833333     2.00000      -1807.19260     2.00000      -1807.19254     2.00000       -141.55081     2.00000       -141.54204     2.00000        -95.46291     2.00000        -95.46285     2.00000        -95.46273     2.00000        -95.44620     2.00000        -95.44608     2.00000        -95.44603     2.00000        -14.31701     2.00000         -1.72586     2.00000         -1.41252     2.00000         -1.19257     0.00000          2.24163     0.00000          2.27276     0.00000          2.38068     0.00000          3.48705     0.00000          7.50033     0.00000          7.73528     0.00000          8.57288     0.00000         12.00398     0.00000         12.13701     0.00000         12.55904     0.00000         22.54836
  34        0.0312500      0.0312500      0.0625000     2.00000      -1807.19260     2.00000      -1807.19254     2.00000       -141.55083     2.00000       -141.54200     2.00000        -95.46287     2.00000        -95.46283     2.00000        -95.46276     2.00000        -95.44616     2.00000        -95.44610     2.00000        -95.44607     2.00000        -14.34600     2.00000         -1.50006     2.00000         -1.30611     2.00000         -1.17920     0.00000          2.21129     0.00000          2.22978     0.00000          2.31433     0.00000          3.29036     0.00000          7.61869     0.00000          7.75884     0.00000          8.48085     0.00000         12.00724     0.00000         12.08325     0.00000         12.33103     0.00000         22.49251
  35        0.0208333      0.0208333      0.0416667     2.00000      -1807.19260     2.00000      -1807.19254     2.00000       -141.55084     2.00000       -141.54198     2.00000        -95.46283     2.00000        -95.46281     2.00000        -95.46278     2.00000        -95.44614     2.00000        -95.44611     2.00000        -95.44610     2.00000        -14.36672     2.00000         -1.32055     2.00000         -1.22732     2.00000         -1.16984     0.00000          2.18960     0.00000          2.19817     0.00000          2.24641     0.00000          3.15046     0.00000          7.71228     0.00000          7.77758     0.00000          8.41646     0.00000         12.01092     0.00000         12.04511     0.00000         12.15897     0.00000         22.42344
  36        0.0104167      0.0104167      0.0208333     2.00000      -1807.19260     2.00000      -1807.19253     2.00000       -141.55085     2.00000       -141.54196     2.00000        -95.46281     2.00000        -95.46280     2.00000        -95.46280     2.00000        -95.44613     2.00000        -95.44612     2.00000        -95.44612     2.00000        -14.37915     2.00000         -1.20340     2.00000         -1.17884     2.00000         -1.16431     0.00000          2.17659     0.00000          2.17879     0.00000          2.19287     0.00000          3.06922     0.00000          7.77271     0.00000          7.78955     0.00000          8.37863     0.00000         12.01371     0.00000         12.02232     0.00000         12.05140     0.00000         22.37093
  37        0.0000000      0.0000000      0.0000000     2.00000      -1807.19260     2.00000      -1807.19253     2.00000       -141.55086     2.00000       -141.54196     2.00000        -95.46280     2.00000        -95.46280     2.00000        -95.46280     2.00000        -95.44612     2.00000        -95.44612     2.00000        -95.44612     2.00000        -14.38329     2.00000         -1.16247     2.00000         -1.16247     2.00000         -1.16247     0.00000          2.17225     0.00000          2.17225     0.00000          2.17225     0.00000          3.04293     0.00000          7.79365     0.00000          7.79365     0.00000          8.36618     0.00000         12.01474     0.00000         12.01474     0.00000         12.01475     0.00000         22.35169
