"../../../Engine/Content/Animation/DefaultAnimCurveCompressionSettings.uasset" 0
"../../../Engine/Content/Functions/Engine_MaterialFunctions01/Opacity/CameraDepthFade.uasset" 1
"../../../Engine/Content/EngineMaterials/T_Default_Material_Grid_M.uasset" 2
"../../../Engine/Content/EngineMaterials/T_Default_Material_Grid_N.uasset" 3
"../../../Engine/Content/EngineMaterials/WorldGridMaterial.uasset" 4
"../../../Engine/Content/ArtTools/RenderToTexture/Meshes/S_1_Unit_Plane.uasset" 5
"../../../Engine/Content/EngineMaterials/DefaultMaterial.uasset" 6
"../../../Engine/Content/BasicShapes/Cone.uasset" 7
"../../../Engine/Content/BasicShapes/Cube.uasset" 8
"../../../Engine/Content/BasicShapes/Cylinder.uasset" 9
"../../../Engine/Content/BasicShapes/Plane.uasset" 10
"../../../Engine/Content/BasicShapes/Sphere.uasset" 11
"../../../Engine/Content/EngineMaterials/DefaultPhysicalMaterial.uasset" 12
"../../../Engine/Content/BufferVisualization/AmbientOcclusion.uasset" 13
"../../../Engine/Content/BufferVisualization/BaseColor.uasset" 14
"../../../Engine/Content/BufferVisualization/CustomDepth.uasset" 15
"../../../Engine/Content/Functions/Engine_MaterialFunctions02/Utility/VectorLength.uasset" 16
"../../../Engine/Content/BufferVisualization/CustomDepthWorldUnits.uasset" 17
"../../../Engine/Content/Functions/Engine_MaterialFunctions02/Utility/BreakOutFloat2Components.uasset" 18
"../../../Engine/Content/Functions/Engine_MaterialFunctions01/Texturing/ScaleUVsByCenter.uasset" 19
"../../../Engine/Content/Functions/Engine_MaterialFunctions02/ScreenResolution.uasset" 20
"../../../Engine/Content/Functions/Engine_MaterialFunctions02/Texturing/ScreenAlignedUVs.uasset" 21
"../../../Engine/Content/Functions/Engine_MaterialFunctions02/Utility/MakeFloat2.uasset" 22
"../../../Engine/Content/Functions/Engine_MaterialFunctions02/Utility/MakeFloat3.uasset" 23
"../../../Engine/Content/EngineMaterials/MiniFont.uasset" 24
"../../../Engine/Content/BufferVisualization/CustomStencil.uasset" 25
"../../../Engine/Content/BufferVisualization/FinalImage.uasset" 26
"../../../Engine/Content/BufferVisualization/LightingModel.uasset" 27
"../../../Engine/Content/BufferVisualization/MaterialAO.uasset" 28
"../../../Engine/Content/BufferVisualization/Metallic.uasset" 29
"../../../Engine/Content/BufferVisualization/Opacity.uasset" 30
"../../../Engine/Content/BufferVisualization/PostTonemapHDRColor.uasset" 31
"../../../Engine/Content/BufferVisualization/PreTonemapHDRColor.uasset" 32
"../../../Engine/Content/BufferVisualization/Roughness.uasset" 33
"../../../Engine/Content/BufferVisualization/SceneColor.uasset" 34
"../../../Engine/Content/BufferVisualization/SceneDepth.uasset" 35
"../../../Engine/Content/BufferVisualization/SceneDepthWorldUnits.uasset" 36
"../../../Engine/Content/BufferVisualization/SeparateTranslucencyA.uasset" 37
"../../../Engine/Content/BufferVisualization/SeparateTranslucencyRGB.uasset" 38
"../../../Engine/Content/BufferVisualization/Specular.uasset" 39
"../../../Engine/Content/BufferVisualization/SubsurfaceColor.uasset" 40
"../../../Engine/Content/BufferVisualization/Velocity.uasset" 41
"../../../Engine/Content/BufferVisualization/WorldNormal.uasset" 42
"../../../Engine/Content/EditorLandscapeResources/DataLayer.uasset" 43
"../../../Engine/Content/EditorLandscapeResources/DefaultAlphaTexture.uasset" 44
"../../../Engine/Content/EditorLandscapeResources/LandscapeGizmoHeight_Mat.uasset" 45
"../../../Engine/Content/EditorLandscapeResources/LandscapeGizmo_Mat.uasset" 46
"../../../Engine/Content/EditorLandscapeResources/LandscapeGizmo_Mat_Copied.uasset" 47
"../../../Engine/Content/EditorLandscapeResources/SplineEditorMeshMat.uasset" 48
"../../../Engine/Content/EditorLandscapeResources/SplineEditorMesh.uasset" 49
"../../../Engine/Content/EditorMaterials/Cross.uasset" 50
"../../../Engine/Content/EditorMaterials/Cross_Mat.uasset" 51
"../../../Engine/Content/EditorMaterials/GizmoMaterial.uasset" 52
"../../../Engine/Content/Functions/Engine_MaterialFunctions02/ExampleContent/Textures/flipbook.uasset" 53
"../../../Engine/Content/Functions/Engine_MaterialFunctions02/Texturing/FlipBook.uasset" 54
"../../../Engine/Content/Functions/Engine_MaterialFunctions02/Utility/Sign.uasset" 55
"../../../Engine/Content/Functions/Engine_MaterialFunctions02/Utility/Round.uasset" 56
"../../../Engine/Content/EditorResources/T_EditorHelp.uasset" 57
"../../../Engine/Content/EditorMaterials/HelpActorMaterial.uasset" 58
"../../../Engine/Content/EditorMaterials/CompositeARGBLayer.uasset" 59
"../../../Engine/Content/EditorMaterials/TilingAALineIntegral.uasset" 60
"../../../Engine/Content/EditorMaterials/TilingAALineBoxFiltered.uasset" 61
"../../../Engine/Content/Functions/Engine_MaterialFunctions03/Procedurals/ComputeFilterWidth.uasset" 62
"../../../Engine/Content/EditorMaterials/TilingAADots.uasset" 63
"../../../Engine/Content/EngineMaterials/BlendFunc_DefBase.uasset" 64
"../../../Engine/Content/EngineMaterials/BlendFunc_DefBlend.uasset" 65
"../../../Engine/Content/Functions/Engine_MaterialFunctions03/Blends/Blend_Screen.uasset" 66
"../../../Engine/Content/EditorMaterials/TilingAAGrid.uasset" 67
"../../../Engine/Content/EditorMaterials/LevelGridMaterial.uasset" 68
"../../../Engine/Content/EditorMaterials/MakeCompositeARGBLayer.uasset" 69
"../../../Engine/Content/EditorResources/LevelGrid1DStripes.uasset" 70
"../../../Engine/Content/EditorMaterials/TextureGridCascaded1D.uasset" 71
"../../../Engine/Content/EditorMaterials/TextureGridCascaded2D.uasset" 72
"../../../Engine/Content/EditorMaterials/LevelGridMaterial2.uasset" 73
"../../../Engine/Content/EditorMaterials/MAT_Groups_Toggle.uasset" 74
"../../../Engine/Content/EditorMaterials/MAT_Groups_Visibility.uasset" 75
"../../../Engine/Content/EditorMaterials/PhAT_BoneSelectedMaterial.uasset" 76
"../../../Engine/Content/EditorMaterials/PhAT_ElemSelectedMaterial.uasset" 77
"../../../Engine/Content/EditorMaterials/PhAT_NoCollisionMaterial.uasset" 78
"../../../Engine/Content/EditorMaterials/PhAT_UnselectedMaterial.uasset" 79
"../../../Engine/Content/EditorMaterials/PreviewShadowIndicator.uasset" 80
"../../../Engine/Content/EditorMaterials/PreviewShadowIndicatorMaterial.uasset" 81
"../../../Engine/Content/EditorMaterials/TargetIcon.uasset" 82
"../../../Engine/Content/EditorMaterials/Tick.uasset" 83
"../../../Engine/Content/EditorMaterials/Tick_Mat.uasset" 84
"../../../Engine/Content/EditorMaterials/WidgetGridVertexColorMaterial.uasset" 85
"../../../Engine/Content/EditorMaterials/WidgetGridVertexColorMaterial_Ma.uasset" 86
"../../../Engine/Content/EditorMaterials/WidgetMaterial.uasset" 87
"../../../Engine/Content/EditorMaterials/WidgetMaterial_Current.uasset" 88
"../../../Engine/Content/EditorMaterials/WidgetMaterial_X.uasset" 89
"../../../Engine/Content/EditorMaterials/WidgetMaterial_Y.uasset" 90
"../../../Engine/Content/EditorMaterials/WidgetMaterial_Z.uasset" 91
"../../../Engine/Content/EditorMaterials/WidgetVertexColorMaterial.uasset" 92
"../../../Engine/Content/EditorMaterials/MatineeGroups/MAT_ColorTrack.uasset" 93
"../../../Engine/Content/EditorMaterials/MatineeGroups/MAT_Groups_Anim.uasset" 94
"../../../Engine/Content/EditorMaterials/MatineeGroups/MAT_Groups_AudioMaster.uasset" 95
"../../../Engine/Content/EditorMaterials/MatineeGroups/MAT_Groups_Director.uasset" 96
"../../../Engine/Content/EditorMaterials/MatineeGroups/MAT_Groups_Event.uasset" 97
"../../../Engine/Content/EditorMaterials/MatineeGroups/MAT_Groups_Fade.uasset" 98
"../../../Engine/Content/EditorMaterials/MatineeGroups/MAT_Groups_Float.uasset" 99
"../../../Engine/Content/EditorMaterials/MatineeGroups/MAT_Groups_Move.uasset" 100
"../../../Engine/Content/EditorMaterials/MatineeGroups/MAT_Groups_Slomo.uasset" 101
"../../../Engine/Content/EditorMaterials/MatineeGroups/MAT_Groups_Sound.uasset" 102
"../../../Engine/Content/EditorMaterials/MatineeGroups/MAT_Groups_Vector.uasset" 103
"../../../Engine/Content/EditorMaterials/ParticleSystems/PSysThumbnail_NoImage.uasset" 104
"../../../Engine/Content/EditorMaterials/ParticleSystems/PSysThumbnail_OOD.uasset" 105
"../../../Engine/Content/EngineMaterials/Grid.uasset" 106
"../../../Engine/Content/EditorMaterials/Thumbnails/FloorPlaneMaterial.uasset" 107
"../../../Engine/Content/EditorMeshes/EditorCube.uasset" 108
"../../../Engine/Content/EditorMeshes/EditorCylinder.uasset" 109
"../../../Engine/Content/EditorMeshes/EditorPlane.uasset" 110
"../../../Engine/Content/EditorMaterials/Thumbnails/SkySphereMaterial.uasset" 111
"../../../Engine/Content/EditorMeshes/EditorSkySphere.uasset" 112
"../../../Engine/Content/EditorMeshes/EditorSphere.uasset" 113
"../../../Engine/Content/EditorResources/MatineeCam_D.uasset" 114
"../../../Engine/Content/EditorMaterials/MatineeCam_mat.uasset" 115
"../../../Engine/Content/EditorMeshes/MatineeCam_SM.uasset" 116
"../../../Engine/Content/EditorMeshes/PlanarReflectionPlane.uasset" 117
"../../../Engine/Content/EditorMaterials/Camera/CineMat.uasset" 118
"../../../Engine/Content/EditorMaterials/Camera/MI_CineMat_CameraBody.uasset" 119
"../../../Engine/Content/EngineDebugMaterials/M_SimpleOpaque.uasset" 120
"../../../Engine/Content/EditorMaterials/Camera/MI_CineMat_CamViewFinder.uasset" 121
"../../../Engine/Content/EditorMeshes/Camera/SM_CineCam.uasset" 122
"../../../Engine/Content/EditorMaterials/Camera/MI_CineMat_Rig.uasset" 123
"../../../Engine/Content/EditorMeshes/Camera/SM_CraneRig_Arm.uasset" 124
"../../../Engine/Content/EditorMeshes/Camera/SM_CraneRig_Base.uasset" 125
"../../../Engine/Content/EditorMeshes/Camera/SM_CraneRig_Body.uasset" 126
"../../../Engine/Content/EditorMeshes/Camera/SM_CraneRig_Mount.uasset" 127
"../../../Engine/Content/EditorMeshes/Camera/SM_RailRig_Mount.uasset" 128
"../../../Engine/Content/EditorMeshes/Camera/SM_RailRig_Track.uasset" 129
"../../../Engine/Content/EditorMeshes/ColorCalibrator/M_ChromeBall.uasset" 130
"../../../Engine/Content/EditorResources/Bad.uasset" 131
"../../../Engine/Content/EditorResources/BSPVertex.uasset" 132
"../../../Engine/Content/EditorResources/EmptyActor.uasset" 133
"../../../Engine/Content/EditorResources/MatInstActSprite.uasset" 134
"../../../Engine/Content/EditorResources/SceneManager.uasset" 135
"../../../Engine/Content/EditorResources/SmallFont.uasset" 136
"../../../Engine/Content/EditorResources/S_Actor.uasset" 137
"../../../Engine/Content/EditorResources/S_DecalActorIcon.uasset" 138
"../../../Engine/Content/EditorResources/S_Emitter.uasset" 139
"../../../Engine/Content/EditorResources/S_ExpoHeightFog.uasset" 140
"../../../Engine/Content/EditorResources/S_FTest.uasset" 141
"../../../Engine/Content/EditorResources/S_KBSJoint.uasset" 142
"../../../Engine/Content/EditorResources/S_KHinge.uasset" 143
"../../../Engine/Content/EditorResources/S_KPrismatic.uasset" 144
"../../../Engine/Content/EditorResources/S_LevelSequence.uasset" 145
"../../../Engine/Content/EditorResources/S_NavP.uasset" 146
"../../../Engine/Content/EditorResources/S_Note.uasset" 147
"../../../Engine/Content/EditorResources/S_Player.uasset" 148
"../../../Engine/Content/EditorResources/S_PortalActorIcon2.uasset" 149
"../../../Engine/Content/EditorResources/S_RadForce.uasset" 150
"../../../Engine/Content/EditorResources/S_ReflActorIcon.uasset" 151
"../../../Engine/Content/EditorResources/S_Solver.uasset" 152
"../../../Engine/Content/EditorResources/S_Terrain.uasset" 153
"../../../Engine/Content/EditorResources/S_TextRenderActorIcon.uasset" 154
"../../../Engine/Content/EditorResources/S_Thruster.uasset" 155
"../../../Engine/Content/EditorResources/S_Trigger.uasset" 156
"../../../Engine/Content/EditorResources/S_VectorFieldVol.uasset" 157
"../../../Engine/Content/EditorResources/S_WindDirectional.uasset" 158
"../../../Engine/Content/EditorResources/AI/S_NavLink.uasset" 159
"../../../Engine/Content/EditorResources/LightIcons/SkyLight.uasset" 160
"../../../Engine/Content/EditorResources/LightIcons/S_LightDirectional.uasset" 161
"../../../Engine/Content/EditorResources/LightIcons/S_LightDirectionalMove.uasset" 162
"../../../Engine/Content/EditorResources/LightIcons/S_LightError.uasset" 163
"../../../Engine/Content/EditorResources/LightIcons/S_LightPoint.uasset" 164
"../../../Engine/Content/EditorResources/LightIcons/S_LightPointMove.uasset" 165
"../../../Engine/Content/EditorResources/LightIcons/S_LightSpot.uasset" 166
"../../../Engine/Content/EditorResources/LightIcons/S_LightSpotMove.uasset" 167
"../../../Engine/Content/EditorResources/SequenceRecorder/Countdown.uasset" 168
"../../../Engine/Content/EditorResources/SequenceRecorder/RecordingIndicator.uasset" 169
"../../../Engine/Content/EditorResources/Spline/T_Loft_Spline.uasset" 170
"../../../Engine/Content/EditorSounds/Notifications/CompileFailed.uasset" 171
"../../../Engine/Content/EditorSounds/Notifications/CompileFailed_Cue.uasset" 172
"../../../Engine/Content/EditorSounds/Notifications/CompileSuccess.uasset" 173
"../../../Engine/Content/EditorSounds/Notifications/CompileStart_Cue.uasset" 174
"../../../Engine/Content/EditorSounds/Notifications/CompileSuccess_Cue.uasset" 175
"../../../Engine/Content/EngineDamageTypes/DmgTypeBP_Environmental.uasset" 176
"../../../Engine/Content/EngineDebugMaterials/HeatmapGradient.uasset" 177
"../../../Engine/Content/EngineDebugMaterials/BoneWeightMaterial.uasset" 178
"../../../Engine/Content/EngineDebugMaterials/ClothMaterial.uasset" 179
"../../../Engine/Content/EngineDebugMaterials/ClothMaterial_WF.uasset" 180
"../../../Engine/Content/EngineDebugMaterials/DebugEditorMaterial.uasset" 181
"../../../Engine/Content/EngineDebugMaterials/DebugMeshMaterial.uasset" 182
"../../../Engine/Content/EngineDebugMaterials/GeomMaterial.uasset" 183
"../../../Engine/Content/Functions/Engine_MaterialFunctions01/Shading/ConvertFromDiffSpec.uasset" 184
"../../../Engine/Content/EngineDebugMaterials/LevelColorationLitMaterial.uasset" 185
"../../../Engine/Content/EngineDebugMaterials/LevelColorationUnlitMaterial.uasset" 186
"../../../Engine/Content/EngineMaterials/DefaultWhiteGrid.uasset" 187
"../../../Engine/Content/EngineDebugMaterials/MAT_LevelColorationLitLightmapUV.uasset" 188
"../../../Engine/Content/EngineDebugMaterials/M_SimpleTranslucent.uasset" 189
"../../../Engine/Content/Functions/Engine_MaterialFunctions02/Utility/CameraDirectionVector.uasset" 190
"../../../Engine/Content/EngineDebugMaterials/VolumeToRender.uasset" 191
"../../../Engine/Content/EngineDebugMaterials/M_VolumeRenderSphereTracePP.uasset" 192
"../../../Engine/Content/EngineDebugMaterials/ShadedLevelColorationLitMaterial.uasset" 193
"../../../Engine/Content/EngineDebugMaterials/ShadedLevelColorationUnlitMateri.uasset" 194
"../../../Engine/Content/EngineDebugMaterials/VertexColorMaterial.uasset" 195
"../../../Engine/Content/EngineDebugMaterials/VertexColorViewMode_AlphaAsColor.uasset" 196
"../../../Engine/Content/EngineDebugMaterials/VertexColorViewMode_BlueOnly.uasset" 197
"../../../Engine/Content/EngineDebugMaterials/VertexColorViewMode_ColorOnly.uasset" 198
"../../../Engine/Content/EngineDebugMaterials/VertexColorViewMode_GreenOnly.uasset" 199
"../../../Engine/Content/EngineDebugMaterials/VertexColorViewMode_RedOnly.uasset" 200
"../../../Engine/Content/EngineDebugMaterials/WireframeMaterial.uasset" 201
"../../../Engine/Content/EngineFonts/Faces/RobotoBold.uasset" 202
"../../../Engine/Content/EngineFonts/Faces/RobotoBoldItalic.uasset" 203
"../../../Engine/Content/EngineFonts/Faces/RobotoItalic.uasset" 204
"../../../Engine/Content/EngineFonts/Faces/RobotoLight.uasset" 205
"../../../Engine/Content/EngineFonts/Faces/RobotoRegular.uasset" 206
"../../../Engine/Content/EngineFonts/Roboto.uasset" 207
"../../../Engine/Content/EngineFonts/Faces/RobotoTiny.uasset" 208
"../../../Engine/Content/EngineFonts/RobotoTiny.uasset" 209
"../../../Engine/Content/EngineFonts/SmallFont.uasset" 210
"../../../Engine/Content/EngineFonts/TinyFont.uasset" 211
"../../../Engine/Content/EngineMaterials/BaseFlattenDiffuseMap.uasset" 212
"../../../Engine/Content/EngineMaterials/BaseFlattenEmissiveMap.uasset" 213
"../../../Engine/Content/EngineMaterials/BaseFlattenGrayscaleMap.uasset" 214
"../../../Engine/Content/EngineMaterials/BaseFlattenNormalMap.uasset" 215
"../../../Engine/Content/EngineMaterials/BaseFlattenMaterial.uasset" 216
"../../../Engine/Content/EngineResources/WhiteSquareTexture.uasset" 217
"../../../Engine/Content/EngineMaterials/BlinkingCaret.uasset" 218
"../../../Engine/Content/EngineMaterials/BlueNoise.uasset" 219
"../../../Engine/Content/EngineMaterials/DefaultBloomKernel.uasset" 220
"../../../Engine/Content/EngineMaterials/DefaultBokeh.uasset" 221
"../../../Engine/Content/EngineMaterials/DefaultDiffuse.uasset" 222
"../../../Engine/Content/EngineMaterials/DefaultDeferredDecalMaterial.uasset" 223
"../../../Engine/Content/EngineMaterials/DefaultLightFunctionMaterial.uasset" 224
"../../../Engine/Content/EngineMaterials/DefaultNormal.uasset" 225
"../../../Engine/Content/EngineMaterials/DefaultPostProcessMaterial.uasset" 226
"../../../Engine/Content/EngineFonts/RobotoDistanceField.uasset" 227
"../../../Engine/Content/EngineMaterials/DefaultTextMaterialOpaque.uasset" 228
"../../../Engine/Content/EngineMaterials/DefaultVirtualTextureMaterial.uasset" 229
"../../../Engine/Content/EngineMaterials/EditorBrushMaterial.uasset" 230
"../../../Engine/Content/EngineMaterials/DefaultWhiteGrid_Low.uasset" 231
"../../../Engine/Content/EngineMaterials/EmissiveMeshMaterial.uasset" 232
"../../../Engine/Content/EngineMaterials/Good64x64TilingNoiseHighFreq.uasset" 233
"../../../Engine/Content/EngineMaterials/Grid_N.uasset" 234
"../../../Engine/Content/EngineMaterials/HighResolutionScreenshotMaskFunction.uasset" 235
"../../../Engine/Content/EngineMaterials/HighResScreenshot.uasset" 236
"../../../Engine/Content/EngineMaterials/HighResScreenshotCaptureRegion.uasset" 237
"../../../Engine/Content/EngineMaterials/HighResScreenshotMask.uasset" 238
"../../../Engine/Content/EngineMaterials/LandscapeHolePhysicalMaterial.uasset" 239
"../../../Engine/Content/EngineMaterials/InvalidLightmapSettings.uasset" 240
"../../../Engine/Content/EngineMaterials/M_InvalidLightmapSettings.uasset" 241
"../../../Engine/Content/EngineMaterials/PaperDiffuse.uasset" 242
"../../../Engine/Content/EngineMaterials/PaperNormal.uasset" 243
"../../../Engine/Content/Functions/Engine_MaterialFunctions02/WorldPositionOffset/CameraOffset.uasset" 244
"../../../Engine/Content/EngineMaterials/PhAT_JointLimitMaterial.uasset" 245
"../../../Engine/Content/EngineMaterials/PhysMat_Rubber.uasset" 246
"../../../Engine/Content/EngineMaterials/PreintegratedSkinBRDF.uasset" 247
"../../../Engine/Content/EngineMaterials/RemoveSurfaceMaterial.uasset" 248
"../../../Engine/Content/EngineMaterials/WeightMapPlaceholderTexture.uasset" 249
"../../../Engine/Content/EngineMaterials/Widget3DPassThrough.uasset" 250
"../../../Engine/Content/EngineMaterials/Widget3DPassThrough_Masked.uasset" 251
"../../../Engine/Content/EngineMaterials/Widget3DPassThrough_Opaque.uasset" 252
"../../../Engine/Content/EngineMaterials/Widget3DPassThrough_Masked_OneSided.uasset" 253
"../../../Engine/Content/EngineMaterials/Widget3DPassThrough_Opaque_OneSided.uasset" 254
"../../../Engine/Content/EngineMaterials/Widget3DPassThrough_Translucent.uasset" 255
"../../../Engine/Content/EngineMaterials/Widget3DPassThrough_Translucent_OneSided.uasset" 256
"../../../Engine/Content/EngineMeshes/Cylinder.uasset" 257
"../../../Engine/Content/EngineMeshes/Sphere.uasset" 258
"../../../Engine/Content/EngineResources/Black.uasset" 259
"../../../Engine/Content/EngineResources/DefaultTexture.uasset" 260
"../../../Engine/Content/EngineResources/DefaultTextureCube.uasset" 261
"../../../Engine/Content/EngineResources/DefaultVolumeTexture2D.uasset" 262
"../../../Engine/Content/EngineResources/DefaultVolumeTexture.uasset" 263
"../../../Engine/Content/EngineResources/GradientTexture0.uasset" 264
"../../../Engine/Content/EngineResources/StreamingPauseIcon.uasset" 265
"../../../Engine/Content/EngineResources/M_StreamingPause.uasset" 266
"../../../Engine/Content/EngineSounds/Master.uasset" 267
"../../../Engine/Content/Functions/Engine_MaterialFunctions01/Shading/PowerToRoughness.uasset" 268
"../../../Engine/Content/Maps/Templates/Thumbnails/Default.uasset" 269
"../../../Engine/Content/Maps/Templates/Thumbnails/VR-Basic.uasset" 270
"../../../Engine/Content/MapTemplates/Sky/DaylightAmbientCubemap.uasset" 271
"../../../Engine/Content/MobileResources/T_MobileControls_texture.uasset" 272
"../../../Engine/Content/MobileResources/T_MobileMenu2.uasset" 273
"../../../Engine/Content/MobileResources/HUD/AnalogHat.uasset" 274
"../../../Engine/Content/MobileResources/HUD/VirtualJoystick_Background.uasset" 275
"../../../Engine/Content/MobileResources/HUD/VirtualJoystick_Thumb.uasset" 276
"../../../Engine/Content/MobileResources/HUD/DefaultVirtualJoysticks.uasset" 277
"../../../Engine/Content/MobileResources/HUD/LeftVirtualJoystickOnly.uasset" 278
"../../../Engine/Content/MobileResources/HUD/MobileHUDButton1_off.uasset" 279
"../../../Engine/Content/MobileResources/HUD/MobileHUDButton1_on.uasset" 280
"../../../Engine/Content/MobileResources/HUD/MobileHUDButton2_off.uasset" 281
"../../../Engine/Content/MobileResources/HUD/MobileHUDButton2_on.uasset" 282
"../../../Engine/Content/MobileResources/HUD/MobileHUDButton3.uasset" 283
"../../../Engine/Content/MobileResources/HUD/MobileHUDButtonFire.uasset" 284
"../../../Engine/Content/MobileResources/HUD/MobileHUDDirectionPad.uasset" 285
"../../../Engine/Content/MobileResources/HUD/MobileHUDDirectionPad2.uasset" 286
"../../../Engine/Content/MobileResources/HUD/MobileHUDDirectionPad3.uasset" 287
"../../../Engine/Content/MobileResources/HUD/MobileHUDDirectionStick.uasset" 288
"../../../Engine/Content/MobileResources/HUD/T_Castle_ThumbstickInner.uasset" 289
"../../../Engine/Content/MobileResources/HUD/T_Castle_ThumbstickOutter.uasset" 290
"../../../Engine/Content/Tutorial/ContentIntroCurve.uasset" 291
"../../../Engine/Content/Tutorial/Basics/LevelEditorAttract.uasset" 292
"../../../Engine/Content/Tutorial/Basics/TutorialAssets/icon_tab_Levels_40x.uasset" 293
"../../../Engine/Content/Tutorial/Basics/LevelEditorOverview.uasset" 294
"../../../Engine/Content/Tutorial/Installation/InstallingVisualStudioTutorial.uasset" 295
"../../../Engine/Content/VREditor/LaserPointer/VR_LaserPower_01.uasset" 296
"../../../Engine/Content/VREditor/TransformGizmo/TransformGizmoMaterial.uasset" 297
"../../../Engine/Content/VREditor/TransformGizmo/TranslucentTransformGizmoMaterial.uasset" 298
"../../../Engine/Content/VREditor/TransformGizmo/BoundingBoxCorner.uasset" 299
"../../../Engine/Content/VREditor/TransformGizmo/BoundingBoxEdge.uasset" 300
"../../../Engine/Content/VREditor/TransformGizmo/PlaneTranslationHandle.uasset" 301
"../../../Engine/Content/VREditor/TransformGizmo/Main.uasset" 302
"../../../Engine/Content/VREditor/TransformGizmo/Xray.uasset" 303
"../../../Engine/Content/VREditor/TransformGizmo/SM_Sequencer_Key.uasset" 304
"../../../Engine/Content/VREditor/TransformGizmo/SM_Sequencer_Node.uasset" 305
"D:/Université de Sherbrooke/Automne 2019/IMN118 Fondement dun jeu video/TP4/UE_Mari_LowPoly/Mari_LowPoly_Neo_Qui_Marche/Content/cinematics/ciné_début/sequence_debut.uasset" 306
"D:/Université de Sherbrooke/Automne 2019/IMN118 Fondement dun jeu video/TP4/UE_Mari_LowPoly/Mari_LowPoly_Neo_Qui_Marche/Content/Mannequin/Character/Mesh/UE4_Mannequin_Skeleton.uasset" 307
"D:/Université de Sherbrooke/Automne 2019/IMN118 Fondement dun jeu video/TP4/UE_Mari_LowPoly/Mari_LowPoly_Neo_Qui_Marche/Content/Mannequin/Animations/ThirdPerson_Jump.uasset" 308
"D:/Université de Sherbrooke/Automne 2019/IMN118 Fondement dun jeu video/TP4/UE_Mari_LowPoly/Mari_LowPoly_Neo_Qui_Marche/Content/Mannequin/Animations/ThirdPersonJump_Loop.uasset" 309
"D:/Université de Sherbrooke/Automne 2019/IMN118 Fondement dun jeu video/TP4/UE_Mari_LowPoly/Mari_LowPoly_Neo_Qui_Marche/Content/Mannequin/Animations/ThirdPersonJump_Start.uasset" 310
"D:/Université de Sherbrooke/Automne 2019/IMN118 Fondement dun jeu video/TP4/UE_Mari_LowPoly/Mari_LowPoly_Neo_Qui_Marche/Content/Mannequin/Animations/ThirdPersonIdle.uasset" 311
"D:/Université de Sherbrooke/Automne 2019/IMN118 Fondement dun jeu video/TP4/UE_Mari_LowPoly/Mari_LowPoly_Neo_Qui_Marche/Content/Mannequin/Animations/ThirdPersonRun.uasset" 312
"D:/Université de Sherbrooke/Automne 2019/IMN118 Fondement dun jeu video/TP4/UE_Mari_LowPoly/Mari_LowPoly_Neo_Qui_Marche/Content/Mannequin/Animations/ThirdPersonWalk.uasset" 313
"D:/Université de Sherbrooke/Automne 2019/IMN118 Fondement dun jeu video/TP4/UE_Mari_LowPoly/Mari_LowPoly_Neo_Qui_Marche/Content/Mannequin/Animations/ThirdPerson_IdleRun_2D.uasset" 314
"../../../Engine/Content/EditorBlueprintResources/StandardMacros.uasset" 315
"D:/Université de Sherbrooke/Automne 2019/IMN118 Fondement dun jeu video/TP4/UE_Mari_LowPoly/Mari_LowPoly_Neo_Qui_Marche/Content/Mannequin/Animations/ThirdPerson_AnimBP.uasset" 316
"../../../Engine/Content/Functions/Engine_MaterialFunctions02/Utility/BlendAngleCorrectedNormals.uasset" 317
"../../../Engine/Content/Functions/MaterialLayerFunctions/MatLayerBlend_NormalBlend.uasset" 318
"../../../Engine/Content/Functions/MaterialLayerFunctions/MatLayerBlend_Simple.uasset" 319
"D:/Université de Sherbrooke/Automne 2019/IMN118 Fondement dun jeu video/TP4/UE_Mari_LowPoly/Mari_LowPoly_Neo_Qui_Marche/Content/Mannequin/Character/Materials/MaterialLayers/T_ML_Rubber_Blue_01_D.uasset" 320
"D:/Université de Sherbrooke/Automne 2019/IMN118 Fondement dun jeu video/TP4/UE_Mari_LowPoly/Mari_LowPoly_Neo_Qui_Marche/Content/Mannequin/Character/Materials/MaterialLayers/T_ML_Rubber_Blue_01_N.uasset" 321
"D:/Université de Sherbrooke/Automne 2019/IMN118 Fondement dun jeu video/TP4/UE_Mari_LowPoly/Mari_LowPoly_Neo_Qui_Marche/Content/Mannequin/Character/Materials/MaterialLayers/ML_GlossyBlack_Latex_UE4.uasset" 322
"D:/Université de Sherbrooke/Automne 2019/IMN118 Fondement dun jeu video/TP4/UE_Mari_LowPoly/Mari_LowPoly_Neo_Qui_Marche/Content/Mannequin/Character/Materials/MaterialLayers/ML_Plastic_Shiny_Beige.uasset" 323
"D:/Université de Sherbrooke/Automne 2019/IMN118 Fondement dun jeu video/TP4/UE_Mari_LowPoly/Mari_LowPoly_Neo_Qui_Marche/Content/Mannequin/Character/Textures/UE4_LOGO_CARD.uasset" 324
"D:/Université de Sherbrooke/Automne 2019/IMN118 Fondement dun jeu video/TP4/UE_Mari_LowPoly/Mari_LowPoly_Neo_Qui_Marche/Content/Mannequin/Character/Materials/MaterialLayers/ML_Plastic_Shiny_Beige_LOGO.uasset" 325
"D:/Université de Sherbrooke/Automne 2019/IMN118 Fondement dun jeu video/TP4/UE_Mari_LowPoly/Mari_LowPoly_Neo_Qui_Marche/Content/Mannequin/Character/Materials/MaterialLayers/T_ML_Aluminum01.uasset" 326
"D:/Université de Sherbrooke/Automne 2019/IMN118 Fondement dun jeu video/TP4/UE_Mari_LowPoly/Mari_LowPoly_Neo_Qui_Marche/Content/Mannequin/Character/Materials/MaterialLayers/T_ML_Aluminum01_N.uasset" 327
"D:/Université de Sherbrooke/Automne 2019/IMN118 Fondement dun jeu video/TP4/UE_Mari_LowPoly/Mari_LowPoly_Neo_Qui_Marche/Content/Mannequin/Character/Materials/MaterialLayers/ML_SoftMetal_UE4.uasset" 328
"D:/Université de Sherbrooke/Automne 2019/IMN118 Fondement dun jeu video/TP4/UE_Mari_LowPoly/Mari_LowPoly_Neo_Qui_Marche/Content/Mannequin/Character/Textures/UE4_Mannequin__normals.uasset" 329
"D:/Université de Sherbrooke/Automne 2019/IMN118 Fondement dun jeu video/TP4/UE_Mari_LowPoly/Mari_LowPoly_Neo_Qui_Marche/Content/Mannequin/Character/Textures/UE4_Mannequin_MAT_MASKA.uasset" 330
"D:/Université de Sherbrooke/Automne 2019/IMN118 Fondement dun jeu video/TP4/UE_Mari_LowPoly/Mari_LowPoly_Neo_Qui_Marche/Content/Mannequin/Character/Materials/M_UE4Man_Body.uasset" 331
"D:/Université de Sherbrooke/Automne 2019/IMN118 Fondement dun jeu video/TP4/UE_Mari_LowPoly/Mari_LowPoly_Neo_Qui_Marche/Content/Mannequin/Character/Textures/UE4Man_Logo_N.uasset" 332
"D:/Université de Sherbrooke/Automne 2019/IMN118 Fondement dun jeu video/TP4/UE_Mari_LowPoly/Mari_LowPoly_Neo_Qui_Marche/Content/Mannequin/Character/Materials/M_UE4Man_ChestLogo.uasset" 333
"D:/Université de Sherbrooke/Automne 2019/IMN118 Fondement dun jeu video/TP4/UE_Mari_LowPoly/Mari_LowPoly_Neo_Qui_Marche/Content/Mannequin/Character/Mesh/SK_Mannequin_PhysicsAsset.uasset" 334
"D:/Université de Sherbrooke/Automne 2019/IMN118 Fondement dun jeu video/TP4/UE_Mari_LowPoly/Mari_LowPoly_Neo_Qui_Marche/Content/Mannequin/Character/Mesh/SK_Mannequin.uasset" 335
"D:/Université de Sherbrooke/Automne 2019/IMN118 Fondement dun jeu video/TP4/UE_Mari_LowPoly/Mari_LowPoly_Neo_Qui_Marche/Content/ThirdPersonBP/Blueprints/ThirdPersonCharacter.uasset" 336
"D:/Université de Sherbrooke/Automne 2019/IMN118 Fondement dun jeu video/TP4/UE_Mari_LowPoly/Mari_LowPoly_Neo_Qui_Marche/Content/cinematics/ciné_fin/sequence_fin.uasset" 337
"D:/Université de Sherbrooke/Automne 2019/IMN118 Fondement dun jeu video/TP4/UE_Mari_LowPoly/Mari_LowPoly_Neo_Qui_Marche/Content/cinematics/ciné_morpheus/morpheus_sequence.uasset" 338
"D:/Université de Sherbrooke/Automne 2019/IMN118 Fondement dun jeu video/TP4/UE_Mari_LowPoly/Mari_LowPoly_Neo_Qui_Marche/Content/cinematics/ciné_trinity/trinity_sequence.uasset" 339
"D:/Université de Sherbrooke/Automne 2019/IMN118 Fondement dun jeu video/TP4/UE_Mari_LowPoly/Mari_LowPoly_Neo_Qui_Marche/Content/ThirdPersonBP/Blueprints/ThirdPersonGameMode.uasset" 340
"../../Plugins/2D/Paper2D/Content/PlaceholderTextures/DummySpriteTexture.uasset" 341
"../../Plugins/2D/Paper2D/Content/DummySprite.uasset" 342
"../../Plugins/2D/Paper2D/Content/DefaultPaperTerrainMaterial.uasset" 343
"../../Plugins/2D/Paper2D/Content/DefaultSpriteMaterial.uasset" 344
"../../Plugins/2D/Paper2D/Content/MaskedUnlitSpriteMaterial.uasset" 345
"../../Plugins/2D/Paper2D/Content/OpaqueUnlitSpriteMaterial.uasset" 346
"../../Plugins/Runtime/Oculus/OculusVR/Content/OculusMR_RenderTarget.uasset" 347
"../../../Engine/Content/Functions/Engine_MaterialFunctions02/Utility/BreakOutFloat4Components.uasset" 348
"../../Plugins/Runtime/Oculus/OculusVR/Content/Materials/OculusMR_ChromaKey.uasset" 349
"../../Plugins/Runtime/Oculus/OculusVR/Content/Materials/OculusMR_ChromaKey_Lit.uasset" 350
"../../Plugins/Runtime/Oculus/OculusVR/Content/Materials/OculusMR_OpaqueColoredMaterial.uasset" 351
"../../Plugins/Runtime/Oculus/OculusVR/Content/Materials/OculusMR_WhiteMaterial.uasset" 352
"D:/Université de Sherbrooke/Automne 2019/IMN118 Fondement dun jeu video/TP4/UE_Mari_LowPoly/Mari_LowPoly_Neo_Qui_Marche/Content/Movies/videoplayback.uasset" 353
"../../../Engine/Content/Maps/Entry_BuiltData.uasset" 354
"../../../Engine/Content/Maps/Entry.umap" 355
"D:/Université de Sherbrooke/Automne 2019/IMN118 Fondement dun jeu video/TP4/UE_Mari_LowPoly/Mari_LowPoly_Neo_Qui_Marche/Content/AnimalVarietyPack/Fox/Meshes/SK_Fox_Skeleton.uasset" 356
"D:/Université de Sherbrooke/Automne 2019/IMN118 Fondement dun jeu video/TP4/UE_Mari_LowPoly/Mari_LowPoly_Neo_Qui_Marche/Content/AnimalVarietyPack/Fox/Animations/ANIM_Fox_Run.uasset" 357
"D:/Université de Sherbrooke/Automne 2019/IMN118 Fondement dun jeu video/TP4/UE_Mari_LowPoly/Mari_LowPoly_Neo_Qui_Marche/Content/AnimalVarietyPack/Fox/Textures/Néo.uasset" 358
"D:/Université de Sherbrooke/Automne 2019/IMN118 Fondement dun jeu video/TP4/UE_Mari_LowPoly/Mari_LowPoly_Neo_Qui_Marche/Content/AnimalVarietyPack/Fox/Textures/T_Fox_BaseColor.uasset" 359
"D:/Université de Sherbrooke/Automne 2019/IMN118 Fondement dun jeu video/TP4/UE_Mari_LowPoly/Mari_LowPoly_Neo_Qui_Marche/Content/AnimalVarietyPack/Fox/Textures/T_Fox_Nml.uasset" 360
"D:/Université de Sherbrooke/Automne 2019/IMN118 Fondement dun jeu video/TP4/UE_Mari_LowPoly/Mari_LowPoly_Neo_Qui_Marche/Content/AnimalVarietyPack/Fox/Textures/T_Fox_OcclusionRoughnessMetallic.uasset" 361
"D:/Université de Sherbrooke/Automne 2019/IMN118 Fondement dun jeu video/TP4/UE_Mari_LowPoly/Mari_LowPoly_Neo_Qui_Marche/Content/AnimalVarietyPack/Fox/Textures/T_Fox_Specular.uasset" 362
"D:/Université de Sherbrooke/Automne 2019/IMN118 Fondement dun jeu video/TP4/UE_Mari_LowPoly/Mari_LowPoly_Neo_Qui_Marche/Content/AnimalVarietyPack/Fox/Materials/M_Fox.uasset" 363
"D:/Université de Sherbrooke/Automne 2019/IMN118 Fondement dun jeu video/TP4/UE_Mari_LowPoly/Mari_LowPoly_Neo_Qui_Marche/Content/AnimalVarietyPack/Fox/Materials/M_FoxFur.uasset" 364
"D:/Université de Sherbrooke/Automne 2019/IMN118 Fondement dun jeu video/TP4/UE_Mari_LowPoly/Mari_LowPoly_Neo_Qui_Marche/Content/AnimalVarietyPack/Fox/Meshes/SK_Fox_PhysicsAsset.uasset" 365
"D:/Université de Sherbrooke/Automne 2019/IMN118 Fondement dun jeu video/TP4/UE_Mari_LowPoly/Mari_LowPoly_Neo_Qui_Marche/Content/AnimalVarietyPack/Fox/Meshes/SK_Fox.uasset" 366
"D:/Université de Sherbrooke/Automne 2019/IMN118 Fondement dun jeu video/TP4/UE_Mari_LowPoly/Mari_LowPoly_Neo_Qui_Marche/Content/AnimalVarietyPack/Fox/cat.uasset" 367
"../../../Engine/Content/EngineSky/C_Sky_Cloud_Color.uasset" 368
"../../../Engine/Content/EngineSky/C_Sky_Horizon_Color.uasset" 369
"../../../Engine/Content/EngineSky/C_Sky_Zenith_Color.uasset" 370
"../../../Engine/Content/EngineSky/T_Sky_Blue.uasset" 371
"../../../Engine/Content/EngineSky/T_Sky_Clouds_M.uasset" 372
"../../../Engine/Content/EngineSky/T_Sky_Stars.uasset" 373
"../../../Engine/Content/EngineSky/M_Sky_Panning_Clouds2.uasset" 374
"../../../Engine/Content/EngineSky/SM_SkySphere.uasset" 375
"../../../Engine/Content/EngineSky/BP_Sky_Sphere.uasset" 376
"../../../Engine/Content/Functions/Engine_MaterialFunctions01/Density/ExponentialDensity.uasset" 377
"../../../Engine/Content/Functions/Engine_MaterialFunctions01/Gradient/RadialGradientExponential.uasset" 378
"D:/Université de Sherbrooke/Automne 2019/IMN118 Fondement dun jeu video/TP4/UE_Mari_LowPoly/Mari_LowPoly_Neo_Qui_Marche/Content/ThirdPersonBP/Night_Scene/Glow_MAT.uasset" 379
"D:/Université de Sherbrooke/Automne 2019/IMN118 Fondement dun jeu video/TP4/UE_Mari_LowPoly/Mari_LowPoly_Neo_Qui_Marche/Content/ThirdPersonBP/Night_Scene/Glow_MAT_Inst.uasset" 380
"D:/Université de Sherbrooke/Automne 2019/IMN118 Fondement dun jeu video/TP4/UE_Mari_LowPoly/Mari_LowPoly_Neo_Qui_Marche/Content/ThirdPersonBP/Night_Scene/Moon_Diffuse.uasset" 381
"D:/Université de Sherbrooke/Automne 2019/IMN118 Fondement dun jeu video/TP4/UE_Mari_LowPoly/Mari_LowPoly_Neo_Qui_Marche/Content/ThirdPersonBP/Night_Scene/Moon_MAT.uasset" 382
"D:/Université de Sherbrooke/Automne 2019/IMN118 Fondement dun jeu video/TP4/UE_Mari_LowPoly/Mari_LowPoly_Neo_Qui_Marche/Content/ThirdPersonBP/Night_Scene/Moon_MAT_Inst.uasset" 383
"D:/Université de Sherbrooke/Automne 2019/IMN118 Fondement dun jeu video/TP4/UE_Mari_LowPoly/Mari_LowPoly_Neo_Qui_Marche/Content/ThirdPersonBP/Night_Scene/lambert1.uasset" 384
"D:/Université de Sherbrooke/Automne 2019/IMN118 Fondement dun jeu video/TP4/UE_Mari_LowPoly/Mari_LowPoly_Neo_Qui_Marche/Content/ThirdPersonBP/Night_Scene/mesh_Plane.uasset" 385
"D:/Université de Sherbrooke/Automne 2019/IMN118 Fondement dun jeu video/TP4/UE_Mari_LowPoly/Mari_LowPoly_Neo_Qui_Marche/Content/ThirdPersonBP/Night_Scene/mesh_Sphere.uasset" 386
"D:/Université de Sherbrooke/Automne 2019/IMN118 Fondement dun jeu video/TP4/UE_Mari_LowPoly/Mari_LowPoly_Neo_Qui_Marche/Content/ThirdPersonBP/Night_Scene/MoonBP.uasset" 387
"D:/Université de Sherbrooke/Automne 2019/IMN118 Fondement dun jeu video/TP4/UE_Mari_LowPoly/Mari_LowPoly_Neo_Qui_Marche/Content/ThirdPersonBP/Maps/ThirdPersonExampleMap_BuiltData.uasset" 388
"D:/Université de Sherbrooke/Automne 2019/IMN118 Fondement dun jeu video/TP4/UE_Mari_LowPoly/Mari_LowPoly_Neo_Qui_Marche/Content/SystemeNeige/NeigeGen/CP_Neige.uasset" 389
"D:/Université de Sherbrooke/Automne 2019/IMN118 Fondement dun jeu video/TP4/UE_Mari_LowPoly/Mari_LowPoly_Neo_Qui_Marche/Content/SystemeNeige/NeigeGen/T_Rock_Basalt_D.uasset" 390
"D:/Université de Sherbrooke/Automne 2019/IMN118 Fondement dun jeu video/TP4/UE_Mari_LowPoly/Mari_LowPoly_Neo_Qui_Marche/Content/SystemeNeige/NeigeGen/T_Rock_Basalt_N.uasset" 391
"D:/Université de Sherbrooke/Automne 2019/IMN118 Fondement dun jeu video/TP4/UE_Mari_LowPoly/Mari_LowPoly_Neo_Qui_Marche/Content/SystemeNeige/NeigeGen/M_NeigeGen.uasset" 392
"D:/Université de Sherbrooke/Automne 2019/IMN118 Fondement dun jeu video/TP4/UE_Mari_LowPoly/Mari_LowPoly_Neo_Qui_Marche/Content/Geometry/cliff/sapin.uasset" 393
"D:/Université de Sherbrooke/Automne 2019/IMN118 Fondement dun jeu video/TP4/UE_Mari_LowPoly/Mari_LowPoly_Neo_Qui_Marche/Content/Geometry/cliff/Couleur_cliff.uasset" 394
"D:/Université de Sherbrooke/Automne 2019/IMN118 Fondement dun jeu video/TP4/UE_Mari_LowPoly/Mari_LowPoly_Neo_Qui_Marche/Content/Geometry/cliff/cliff_MLP.uasset" 395
"D:/Université de Sherbrooke/Automne 2019/IMN118 Fondement dun jeu video/TP4/UE_Mari_LowPoly/Mari_LowPoly_Neo_Qui_Marche/Content/Geometry/maison/couleur_maison2.uasset" 396
"D:/Université de Sherbrooke/Automne 2019/IMN118 Fondement dun jeu video/TP4/UE_Mari_LowPoly/Mari_LowPoly_Neo_Qui_Marche/Content/Geometry/maison/couleur_maison1.uasset" 397
"D:/Université de Sherbrooke/Automne 2019/IMN118 Fondement dun jeu video/TP4/UE_Mari_LowPoly/Mari_LowPoly_Neo_Qui_Marche/Content/Geometry/maison/maison.uasset" 398
"D:/Université de Sherbrooke/Automne 2019/IMN118 Fondement dun jeu video/TP4/UE_Mari_LowPoly/Mari_LowPoly_Neo_Qui_Marche/Content/Geometry/Meshes/CubeMaterial.uasset" 399
"D:/Université de Sherbrooke/Automne 2019/IMN118 Fondement dun jeu video/TP4/UE_Mari_LowPoly/Mari_LowPoly_Neo_Qui_Marche/Content/Geometry/Meshes/TemplateFloor.uasset" 400
"D:/Université de Sherbrooke/Automne 2019/IMN118 Fondement dun jeu video/TP4/UE_Mari_LowPoly/Mari_LowPoly_Neo_Qui_Marche/Content/Geometry/morpheus/SITING_CAT.uasset" 401
"D:/Université de Sherbrooke/Automne 2019/IMN118 Fondement dun jeu video/TP4/UE_Mari_LowPoly/Mari_LowPoly_Neo_Qui_Marche/Content/Geometry/morpheus/couleur_chat.uasset" 402
"D:/Université de Sherbrooke/Automne 2019/IMN118 Fondement dun jeu video/TP4/UE_Mari_LowPoly/Mari_LowPoly_Neo_Qui_Marche/Content/Geometry/morpheus/morpheus_final.uasset" 403
"D:/Université de Sherbrooke/Automne 2019/IMN118 Fondement dun jeu video/TP4/UE_Mari_LowPoly/Mari_LowPoly_Neo_Qui_Marche/Content/Geometry/sapins/sapin.uasset" 404
"D:/Université de Sherbrooke/Automne 2019/IMN118 Fondement dun jeu video/TP4/UE_Mari_LowPoly/Mari_LowPoly_Neo_Qui_Marche/Content/Geometry/sapins/couleur_sapin.uasset" 405
"D:/Université de Sherbrooke/Automne 2019/IMN118 Fondement dun jeu video/TP4/UE_Mari_LowPoly/Mari_LowPoly_Neo_Qui_Marche/Content/Geometry/sapin_trinité/sapin_Trinité.uasset" 406
"D:/Université de Sherbrooke/Automne 2019/IMN118 Fondement dun jeu video/TP4/UE_Mari_LowPoly/Mari_LowPoly_Neo_Qui_Marche/Content/Geometry/sapins/sapin_MLP_2.uasset" 407
"D:/Université de Sherbrooke/Automne 2019/IMN118 Fondement dun jeu video/TP4/UE_Mari_LowPoly/Mari_LowPoly_Neo_Qui_Marche/Content/Geometry/trinité/SITING_CAT.uasset" 408
"D:/Université de Sherbrooke/Automne 2019/IMN118 Fondement dun jeu video/TP4/UE_Mari_LowPoly/Mari_LowPoly_Neo_Qui_Marche/Content/Geometry/trinité/couleur_chat.uasset" 409
"D:/Université de Sherbrooke/Automne 2019/IMN118 Fondement dun jeu video/TP4/UE_Mari_LowPoly/Mari_LowPoly_Neo_Qui_Marche/Content/Geometry/trinité/trinité_final.uasset" 410
"D:/Université de Sherbrooke/Automne 2019/IMN118 Fondement dun jeu video/TP4/UE_Mari_LowPoly/Mari_LowPoly_Neo_Qui_Marche/Content/StarterContent/Audio/musique_TP4.uasset" 411
"D:/Université de Sherbrooke/Automne 2019/IMN118 Fondement dun jeu video/TP4/UE_Mari_LowPoly/Mari_LowPoly_Neo_Qui_Marche/Content/StarterContent/Textures/T_Smoke_SubUV.uasset" 412
"D:/Université de Sherbrooke/Automne 2019/IMN118 Fondement dun jeu video/TP4/UE_Mari_LowPoly/Mari_LowPoly_Neo_Qui_Marche/Content/StarterContent/Textures/T_Smoke_Tiled_D.uasset" 413
"D:/Université de Sherbrooke/Automne 2019/IMN118 Fondement dun jeu video/TP4/UE_Mari_LowPoly/Mari_LowPoly_Neo_Qui_Marche/Content/StarterContent/Particles/Materials/M_smoke_subUV.uasset" 414
"D:/Université de Sherbrooke/Automne 2019/IMN118 Fondement dun jeu video/TP4/UE_Mari_LowPoly/Mari_LowPoly_Neo_Qui_Marche/Content/StarterContent/Particles/P_Steam_Lit.uasset" 415
"D:/Université de Sherbrooke/Automne 2019/IMN118 Fondement dun jeu video/TP4/UE_Mari_LowPoly/Mari_LowPoly_Neo_Qui_Marche/Content/SystemeNeige/Particules/Flocon.uasset" 416
"D:/Université de Sherbrooke/Automne 2019/IMN118 Fondement dun jeu video/TP4/UE_Mari_LowPoly/Mari_LowPoly_Neo_Qui_Marche/Content/SystemeNeige/Particules/M_Flocon_Part_Light.uasset" 417
"D:/Université de Sherbrooke/Automne 2019/IMN118 Fondement dun jeu video/TP4/UE_Mari_LowPoly/Mari_LowPoly_Neo_Qui_Marche/Content/SystemeNeige/Particules/M_Flocon_Part_UnLight.uasset" 418
"D:/Université de Sherbrooke/Automne 2019/IMN118 Fondement dun jeu video/TP4/UE_Mari_LowPoly/Mari_LowPoly_Neo_Qui_Marche/Content/SystemeNeige/Particules/M_Neige_Part_Light.uasset" 419
"D:/Université de Sherbrooke/Automne 2019/IMN118 Fondement dun jeu video/TP4/UE_Mari_LowPoly/Mari_LowPoly_Neo_Qui_Marche/Content/SystemeNeige/Particules/M_Neige_Part_UnLight.uasset" 420
"D:/Université de Sherbrooke/Automne 2019/IMN118 Fondement dun jeu video/TP4/UE_Mari_LowPoly/Mari_LowPoly_Neo_Qui_Marche/Content/SystemeNeige/Particules/p_Neige.uasset" 421
"D:/Université de Sherbrooke/Automne 2019/IMN118 Fondement dun jeu video/TP4/UE_Mari_LowPoly/Mari_LowPoly_Neo_Qui_Marche/Content/ThirdPersonBP/Maps/ThirdPersonExampleMap.umap" 422
