﻿[
  {
    "Name": "Agrarian Idyll"
  },
  {
    "Name": "Aristocratic Elite"
  },
  {
    "Name": "Beacon of Liberty"
  },
  {
    "Name": "Citizen Service"
  },
  {
    "Name": "Corvee System"
  },
  {
    "Name": "Cutthroat Politics"
  },
  {
    "Name": "Distinguished Admiralty"
  },
  {
    "Name": "Efficient Bureaucracy"
  },
  {
    "Name": "Environmentalist"
  },
  {
    "Name": "Exalted Priesthood"
  },
  {
    "Name": "Feudal Society"
  },
  {
    "Name": "Free Haven"
  },
  {
    "Name": "Functional Architecture"
  },
  {
    "Name": "Idealistic Foundation"
  },
  {
    "Name": "Imperial Cult"
  },
  {
    "Name": "Inward Perfection"
  },
  {
    "Name": "Meritocracy"
  },
  {
    "Name": "Mining Guilds"
  },
  {
    "Name": "Nationalistic Zeal"
  },
  {
    "Name": "Parliamentary System"
  },
  {
    "Name": "Philosopher King"
  },
  {
    "Name": "Police State"
  },
  {
    "Name": "Shadow Council"
  },
  {
    "Name": "Slaver Guilds"
  },
  {
    "Name": "Warrior Culture"
  }
]