<svg width="38" height="38" viewBox="0 0 38 38" fill="none" xmlns="http://www.w3.org/2000/svg">
<path fill-rule="evenodd" clip-rule="evenodd" d="M18.3544 0.203416L9.10196 5.51796L9.05025 5.54719C8.15243 6.07366 7.54997 7.04515 7.54997 8.15692V26.8751L12.5397 24.0094L12.5107 23.9443L12.5091 23.9396L12.4774 23.8644L12.4476 23.7904L12.4433 23.7795L12.4136 23.7035L12.385 23.6271L12.3842 23.624L12.3834 23.6232L12.3552 23.5453L12.3278 23.4654L12.327 23.463L12.3003 23.3839L12.2741 23.3017L12.2737 23.3001L12.2729 23.2986L12.2659 23.2756L12.2588 23.2534C12.2475 23.2152 12.2361 23.1758 12.2251 23.1369L12.2244 23.1357L12.2016 23.0535L12.1793 22.9697L12.1785 22.967V22.9658L12.1668 22.9186L12.1546 22.8719C12.135 22.7924 12.1174 22.7121 12.1006 22.6314L12.1002 22.6303L12.0833 22.5449L12.0681 22.4627V22.4604L12.0673 22.4573V22.4553L12.052 22.3707L12.0387 22.2862C12.0207 22.1685 12.0054 22.0516 11.994 21.9359L11.9936 21.9323L11.9854 21.8482L11.978 21.7585L11.9717 21.6693L11.967 21.5844L11.9666 21.5812V21.5801L11.9623 21.4901L11.9595 21.4028V21.4008L11.958 21.3096L11.9572 21.22L11.958 21.1331L11.9595 21.0466L11.9615 20.9881L11.9623 20.9714L11.9658 20.8732L11.9693 20.8132L11.9705 20.7999L11.9713 20.7898L11.9768 20.7021L11.9913 20.5314L11.9999 20.4511L12.0105 20.3596L12.0203 20.2844L12.0332 20.1916L12.0453 20.1141L12.0606 20.0221L12.0739 19.9492L12.0916 19.8561L12.1064 19.7813C12.1151 19.7392 12.1209 19.7131 12.1268 19.6878L12.1421 19.6211L12.1656 19.5256L12.1836 19.4547L12.2048 19.3768L12.2114 19.3518L12.2263 19.2981L12.2412 19.2474L12.2573 19.1956L12.2796 19.1223L12.3027 19.0494L12.3262 18.9785L12.336 18.9509C12.3501 18.9103 12.3642 18.8702 12.381 18.8238L12.4034 18.765L12.4038 18.7634L12.4077 18.7529C12.4163 18.7307 12.4253 18.7061 12.4402 18.6683L12.4704 18.5939L12.4993 18.523L12.542 18.4248L12.5671 18.3679L12.602 18.2915L12.6341 18.2225L12.6721 18.1446L12.7085 18.0725L12.7469 17.9977L12.7814 17.9322L12.8033 17.8921L12.8245 17.8527L12.8605 17.7892L12.8636 17.7834C12.8754 17.7627 12.8867 17.742 12.9056 17.7109L12.9412 17.6505L12.9416 17.6493L12.9482 17.638L12.9878 17.5733L13.0246 17.5145L13.0779 17.4303L13.0912 17.4108L13.1359 17.343L13.1817 17.276C13.2597 17.1618 13.3411 17.0507 13.425 16.9432L13.4818 16.8703L13.5198 16.8243L13.546 16.7916L13.5813 16.7487L13.6177 16.7059L13.6514 16.6665L13.6827 16.6303L13.7152 16.594L13.7595 16.5445L13.7936 16.5071L13.8277 16.4701L13.8657 16.4296L13.9044 16.3887L13.9436 16.3481L13.9706 16.3209L14.0157 16.2753L14.0611 16.2305L14.0784 16.2137L14.125 16.1689L14.1724 16.1245L14.1971 16.1015L14.2448 16.057L14.2942 16.0126L14.3024 16.0056L14.3565 15.9573L14.4125 15.9094L14.4184 15.9043L14.4195 15.9035C14.4548 15.8731 14.4889 15.8447 14.5187 15.8205C14.548 15.7963 14.5817 15.7695 14.6193 15.7394C14.7936 15.6019 14.9734 15.4725 15.1599 15.3525L15.1673 15.347L15.2296 15.3077L15.2915 15.2687L15.3001 15.2636L15.3612 15.2266L15.4216 15.1904L15.44 15.1799L15.4568 15.1701L15.4741 15.1604C15.5042 15.1428 15.5328 15.1265 15.5583 15.1124L15.5783 15.1015L15.6362 15.0696L15.6954 15.038L15.7224 15.024L15.7835 14.9924L15.8438 14.9616L15.8536 14.957L15.9222 14.9234L15.9899 14.8907L15.9923 14.8899C16.0518 14.8619 16.1122 14.8342 16.1729 14.8081C16.2309 14.7828 16.2924 14.757 16.357 14.7313C16.6739 14.6039 17.0018 14.4983 17.3386 14.418L17.3445 14.4165L17.4189 14.3989L17.4926 14.3826L17.5051 14.3798L17.5807 14.3642L17.6579 14.3494L17.6622 14.3487L17.7362 14.3346L17.8118 14.3218L17.8314 14.3183L17.9043 14.3066L17.9783 14.296L17.9877 14.2941L18.0641 14.284L18.1389 14.2742L18.1452 14.2734L18.2145 14.2645L18.2141 14.1951V6.69209C18.2141 6.56271 18.2408 6.45945 18.2842 6.3819C18.3219 6.31526 18.3724 6.26577 18.4315 6.23382C18.4915 6.20147 18.5604 6.18511 18.6329 6.18511C18.7277 6.18511 18.8283 6.21278 18.9231 6.26499L30.4456 12.8908V8.15692C30.4456 7.07905 29.8784 6.13211 29.0244 5.5959L19.6576 0.216666C19.4112 0.0763786 19.2067 0.00311749 19.0011 0C18.9964 0 18.9917 0 18.987 0C18.7857 0 18.5878 0.0674158 18.3544 0.203416ZM19.7877 14.2399L19.859 14.2477L19.8641 14.2485L19.9447 14.259L20.0247 14.2699L20.036 14.2723L20.1171 14.2844L20.1982 14.2976L20.2009 14.2984L20.2844 14.3132L20.3674 14.3292L20.3698 14.3296L20.452 14.3467L20.5362 14.3646L20.5398 14.3658L20.5633 14.3713L20.586 14.3763C20.6256 14.3853 20.6651 14.3954 20.7047 14.4052H20.7059L20.7893 14.4266L20.8731 14.4492L20.8759 14.45L20.8766 14.4508L20.924 14.4636L20.9703 14.4769C21.049 14.5002 21.1281 14.5248 21.2065 14.5505L21.2088 14.5513L21.2907 14.579L21.3702 14.607L21.3722 14.6078L21.3753 14.6094L21.3769 14.6097L21.458 14.6394L21.5383 14.6698L21.539 14.6701C21.6507 14.7134 21.7592 14.759 21.8653 14.8061L21.8689 14.8073L21.9464 14.8432L22.0279 14.8814L22.1086 14.9207L22.185 14.9589L22.1881 14.9601L22.1893 14.9609L22.2696 15.0022L22.3468 15.0439L22.3483 15.0446L22.429 15.0887L22.5074 15.1327L22.5822 15.1767L22.657 15.2216L22.7213 15.2613L22.8047 15.3143L22.8556 15.347L22.8662 15.354L22.874 15.3599L22.8846 15.3665L22.9481 15.4086L23.0131 15.453L23.0895 15.5064L23.1553 15.554L23.2297 15.6093L23.29 15.6549L23.3645 15.7129L23.426 15.762L23.4984 15.8209L23.5552 15.8688L23.6273 15.9304L23.6849 15.9811C23.717 16.0095 23.737 16.0274 23.7562 16.0454L23.8067 16.0913L23.878 16.1599L23.9309 16.2106L23.9877 16.2675L24.046 16.3255L24.0829 16.3637L24.1193 16.4035L24.1726 16.4592L24.2239 16.5157L24.274 16.5714L24.2932 16.594C24.3214 16.6264 24.3496 16.6583 24.3814 16.6961L24.4213 16.7448L24.4225 16.7456L24.4295 16.7546C24.4452 16.7733 24.4613 16.7932 24.4871 16.8247L24.5369 16.8879L24.5839 16.9486L24.6387 17.0219L24.6481 17.0344L24.6853 17.0843L24.7343 17.1525L24.7782 17.2148L24.8267 17.2861L24.8718 17.3539L24.9176 17.4241L24.9572 17.4868L24.9819 17.5258L25.005 17.5636L25.0422 17.6263L25.0457 17.6322C25.0579 17.6524 25.07 17.6727 25.088 17.7042L25.1229 17.7654L25.1233 17.7662L25.1299 17.7775L25.1668 17.8438L25.1993 17.9053L25.2228 17.949L25.2463 17.9934L25.2561 18.0137L25.2565 18.0144L25.2572 18.0148L25.2929 18.0865L25.3285 18.1598C25.3889 18.2845 25.4449 18.41 25.4966 18.5358L25.5099 18.5678L25.5314 18.6216L25.553 18.6765L25.5875 18.7677L25.6067 18.8207L25.6239 18.869L25.64 18.9142L25.6556 18.9606L25.6764 19.0233L25.6921 19.0717L25.7073 19.1196L25.7395 19.2256L25.7551 19.2801L25.7657 19.3168L25.799 19.4399L25.8049 19.4633L25.8209 19.5264L25.8354 19.5888L25.8433 19.6211L25.8581 19.685L25.8718 19.7501L25.8738 19.7606L25.8887 19.8315L25.9028 19.9032L25.9044 19.911V19.9126C25.913 19.9582 25.9208 20.0018 25.9271 20.0392C25.9333 20.0767 25.9404 20.1191 25.9471 20.1667C25.9796 20.3853 26.0023 20.6055 26.0144 20.8256L26.0148 20.835L26.0184 20.9086L26.0207 20.9811L26.0211 20.9913L26.0227 21.0626L26.0238 21.1323V21.1923C26.0242 21.2274 26.0238 21.2601 26.0234 21.289L26.0219 21.3774L26.0195 21.4445L26.0187 21.4745L26.0117 21.6105L26.0113 21.621L26.0062 21.6974L26.0007 21.7714V21.7741C25.9949 21.8396 25.9886 21.9051 25.9811 21.9709C25.9741 22.0337 25.9655 22.0991 25.9561 22.1677C25.9083 22.5044 25.8362 22.8395 25.7383 23.17L25.7363 23.1758L25.714 23.2483L25.6917 23.3204L25.6877 23.3325L25.6635 23.4054L25.638 23.4794L25.6368 23.4833L25.6117 23.5538L25.5847 23.6259L25.5781 23.6442L25.5518 23.7132L25.5244 23.7822L25.5213 23.7915L25.4919 23.8617L25.4629 23.9318L25.4605 23.9373L25.4335 24.0016L25.4942 24.0363L32.0262 27.7874C32.139 27.8521 32.215 27.9261 32.2612 28.0033C32.3004 28.0684 32.3176 28.1369 32.316 28.204C32.3148 28.2714 32.2937 28.3388 32.2577 28.4015C32.2099 28.4834 32.1362 28.5562 32.0434 28.612L20.6338 35.1568L20.5135 35.2253L20.6338 35.2947L24.6348 37.5923C25.5738 38.132 26.6811 38.1164 27.575 37.6488L36.9411 32.2688C37.1867 32.1266 37.3528 31.987 37.4581 31.8113C37.5639 31.6352 37.6066 31.4278 37.6042 31.1523V20.4648C37.5948 19.4282 37.0503 18.4228 36.0828 17.8671L19.7877 8.50803V14.2399ZM1.91548 17.8687C0.976916 18.408 0.436343 19.3702 0.395996 20.3736L0.397171 31.1329C0.398346 31.4154 0.436735 31.6285 0.536623 31.807C0.636903 31.9863 0.796333 32.1262 1.03724 32.2626L10.29 37.5767L10.341 37.6063C11.2482 38.1164 12.3959 38.1499 13.3635 37.5942L29.5387 28.3041L29.6582 28.2348L24.7308 25.4048L24.6685 25.3694L24.6262 25.4267L24.6258 25.4274L24.6231 25.4306L24.5733 25.4953L24.5239 25.558L24.5165 25.567L24.4652 25.6309L24.4131 25.6936L24.4111 25.6959L24.4107 25.6967L24.3567 25.7602L24.3011 25.8238L24.2995 25.8257L24.2439 25.8884L24.1855 25.952L24.1839 25.9527L24.1828 25.9543L24.1667 25.9718L24.1506 25.989C24.1232 26.0182 24.095 26.0471 24.0664 26.0767L24.0652 26.0774L24.0057 26.1382L23.9434 26.1994L23.9415 26.2014L23.9407 26.2018L23.9058 26.236L23.8709 26.2696C23.8114 26.3261 23.7507 26.3814 23.6884 26.4363L23.6876 26.4371L23.6218 26.4944L23.5576 26.549L23.556 26.5501L23.5533 26.5521L23.5521 26.5533L23.4855 26.6086L23.4189 26.6628C23.3257 26.7372 23.2309 26.8081 23.1365 26.8759L23.1341 26.8779L23.064 26.9274L22.99 26.9784L22.9152 27.0287L22.8439 27.075L22.8415 27.077L22.8403 27.0774L22.764 27.1261L22.6891 27.1721L22.6876 27.1729L22.6092 27.2204L22.5317 27.2656L22.4557 27.3089L22.3793 27.3506L22.3276 27.3778L22.3131 27.3856L22.2249 27.4316L22.1709 27.4585L22.1591 27.464L22.1505 27.4682L22.1392 27.4741L22.071 27.5076L21.9151 27.5805L21.8411 27.6136L21.6859 27.6791L21.5978 27.7141L21.5246 27.7426L21.4368 27.7757L21.3671 27.8006L21.277 27.8318L21.2045 27.8564C21.1634 27.87 21.1379 27.8774 21.1125 27.8856L21.0474 27.9059L20.9522 27.9335L20.8817 27.953L20.8034 27.9741L20.7783 27.9807L20.7239 27.9947L20.6722 28.0072L20.6193 28.0193L20.5441 28.0372L20.4689 28.0532L20.3956 28.0684L20.3666 28.0738C20.3247 28.0824 20.2824 28.0902 20.2334 28.0984L20.1712 28.1085L20.17 28.1089L20.1586 28.1108C20.1347 28.1147 20.1093 28.1194 20.0689 28.1252L19.9886 28.1369L19.9122 28.1471L19.8214 28.158L19.8057 28.1595L19.7434 28.1662L19.6596 28.1747L19.5836 28.1814L19.497 28.1872L19.4155 28.1923L19.3317 28.1966L19.2569 28.1997L19.1664 28.202L19.0931 28.2032L19.0865 28.2028C19.0622 28.2032 19.0387 28.2036 19.0027 28.2036L18.9322 28.2028H18.9177L18.8417 28.2012L18.7723 28.1989L18.6717 28.195L18.6497 28.1931H18.6485L18.6478 28.1934L18.5671 28.1888L18.4856 28.1825C18.3473 28.1724 18.2098 28.158 18.0743 28.1397L18.0402 28.135L17.9826 28.1268L17.9239 28.1175L17.882 28.1112L17.8271 28.1019L17.7715 28.0921L17.7206 28.0828L17.6736 28.0734L17.6254 28.0641L17.5604 28.0508L17.4609 28.029L17.4064 28.0169L17.3523 28.0037L17.2971 27.99L17.2599 27.9807L17.1976 27.9643L17.1361 27.9476L17.1126 27.9413L17.0499 27.9234L16.988 27.9055L16.9559 27.8953L16.8929 27.8762L16.8298 27.856L16.8196 27.8529L16.7503 27.8295L16.6809 27.8057L16.6731 27.8034L16.6719 27.803C16.6277 27.7874 16.5861 27.7722 16.5505 27.7586C16.5145 27.7457 16.4745 27.7301 16.4295 27.7122C16.2226 27.6315 16.0201 27.5407 15.8223 27.4406L15.8137 27.4363L15.7486 27.4028L15.6836 27.3689L15.6746 27.3638L15.6119 27.3299L15.5504 27.2956L15.532 27.2847L15.5148 27.2753L15.4983 27.2656C15.4674 27.2485 15.4388 27.2317 15.4141 27.2173L15.3945 27.2056L15.3377 27.1713L15.2809 27.1362L15.1971 27.0832L15.1399 27.0462L15.1313 27.0404L15.0675 26.9979L15.0052 26.9558L15.0032 26.9546C14.9488 26.9172 14.8951 26.8786 14.8418 26.8397C14.7909 26.8023 14.7376 26.7621 14.6828 26.7197C14.4133 26.5104 14.1579 26.2805 13.9193 26.0307L13.9154 26.026L13.8629 25.9707L13.8116 25.9153L13.8026 25.906L13.7517 25.8483L13.7003 25.7899L13.6972 25.7864L13.6479 25.7295L13.5989 25.671L13.5864 25.6554L13.5397 25.5985L13.4931 25.5401L13.4873 25.5331L13.4399 25.4723L13.394 25.4123L13.3905 25.408L13.3478 25.3526L6.75556 29.1392C6.64314 29.2035 6.5405 29.2323 6.4508 29.2339C6.37442 29.2347 6.30586 29.2156 6.24789 29.1805C6.19031 29.1458 6.14213 29.0944 6.1053 29.0317C6.05791 28.9502 6.03127 28.8497 6.02931 28.7417L6.03636 15.5017L1.91548 17.8687Z" fill="#BA0B22"/>
<path fill-rule="evenodd" clip-rule="evenodd" d="M13.4585 21.1506C13.4585 24.2105 15.94 26.6922 18.9997 26.6922C22.0604 26.6922 24.5418 24.2105 24.5418 21.1506C24.5418 18.0906 22.0604 15.6089 18.9997 15.6089C15.94 15.6089 13.4585 18.0906 13.4585 21.1506Z" fill="#FFC730"/>
</svg>
