<svg width="26" height="26" viewBox="0 0 26 26" fill="none" xmlns="http://www.w3.org/2000/svg">
<path fill-rule="evenodd" clip-rule="evenodd" d="M17.0017 22.0037H8.99833C6.23618 22.0037 3.99625 19.7638 3.99625 17.0017V8.99833C3.99625 6.23618 6.23618 3.99625 8.99833 3.99625H17.0017C19.7638 3.99625 22.0037 6.23618 22.0037 8.99833V17.0017C22.0037 19.7638 19.7638 22.0037 17.0017 22.0037Z" stroke="#f39237" stroke-width="1.5" stroke-linecap="round" stroke-linejoin="round"/>
<path d="M12.999 8.99833C12.8609 8.99833 12.7489 9.11038 12.7499 9.24844C12.7499 9.3865 12.8619 9.49854 13 9.49854C13.1381 9.49854 13.2501 9.3865 13.2501 9.24844C13.2501 9.11038 13.1381 8.99833 12.999 8.99833" stroke="#f39237" stroke-width="1.5" stroke-linecap="round" stroke-linejoin="round"/>
<path d="M13.2501 17.1857V12.4338H12.2497" stroke="#f39237" stroke-width="1.5" stroke-linecap="round" stroke-linejoin="round"/>
</svg>
