<svg width="26" height="26" viewBox="0 0 26 26" fill="none" xmlns="http://www.w3.org/2000/svg">
<path fill-rule="evenodd" clip-rule="evenodd" d="M3.99625 19.0025V11.6655C3.99653 10.7398 4.42402 9.86596 5.15473 9.29754L11.1572 4.6286C12.2411 3.78547 13.7589 3.78547 14.8428 4.6286L20.8453 9.29754C21.576 9.86596 22.0035 10.7398 22.0037 11.6655V19.0025C22.0037 20.6601 20.66 22.0038 19.0025 22.0038H6.9975C5.33995 22.0038 3.99625 20.6601 3.99625 19.0025Z" stroke="#F39237" stroke-width="1.5" stroke-linecap="round" stroke-linejoin="round"/>
</svg>
