-- Merging decision tree log ---
manifest
ADDED from F:\SEMESTER_6\SistemAplikasiBergerak\Modul Kelas\Program Pak Ivan\HelloSharedPrefs\app\src\main\AndroidManifest.xml:15:1-32:12
INJECTED from F:\SEMESTER_6\SistemAplikasiBergerak\Modul Kelas\Program Pak Ivan\HelloSharedPrefs\app\src\main\AndroidManifest.xml:15:1-32:12
INJECTED from F:\SEMESTER_6\SistemAplikasiBergerak\Modul Kelas\Program Pak Ivan\HelloSharedPrefs\app\src\main\AndroidManifest.xml:15:1-32:12
INJECTED from F:\SEMESTER_6\SistemAplikasiBergerak\Modul Kelas\Program Pak Ivan\HelloSharedPrefs\app\src\main\AndroidManifest.xml:15:1-32:12
MERGED from [com.android.support:appcompat-v7:23.4.0] C:\Users\Evi\.gradle\caches\transforms-1\files-1.1\appcompat-v7-23.4.0.aar\b0410296184df2b20bf03cddc06bf6f1\AndroidManifest.xml:17:1-27:12
MERGED from [com.android.support:animated-vector-drawable:23.4.0] C:\Users\Evi\.gradle\caches\transforms-1\files-1.1\animated-vector-drawable-23.4.0.aar\52815c41d02f9983f144a702bc84cb70\AndroidManifest.xml:2:1-9:12
MERGED from [com.android.support:support-vector-drawable:23.4.0] C:\Users\Evi\.gradle\caches\transforms-1\files-1.1\support-vector-drawable-23.4.0.aar\f65afc77e6ebf3a40e39fb192cb866ae\AndroidManifest.xml:2:1-9:12
MERGED from [com.android.support:support-v4:23.4.0] C:\Users\Evi\.gradle\caches\transforms-1\files-1.1\support-v4-23.4.0.aar\e02f4339828e8f437a887104a72106dc\AndroidManifest.xml:17:1-24:12
INJECTED from F:\SEMESTER_6\SistemAplikasiBergerak\Modul Kelas\Program Pak Ivan\HelloSharedPrefs\app\src\main\AndroidManifest.xml:15:1-32:12
INJECTED from F:\SEMESTER_6\SistemAplikasiBergerak\Modul Kelas\Program Pak Ivan\HelloSharedPrefs\app\src\main\AndroidManifest.xml:15:1-32:12
INJECTED from F:\SEMESTER_6\SistemAplikasiBergerak\Modul Kelas\Program Pak Ivan\HelloSharedPrefs\app\src\main\AndroidManifest.xml:15:1-32:12
	package
		ADDED from F:\SEMESTER_6\SistemAplikasiBergerak\Modul Kelas\Program Pak Ivan\HelloSharedPrefs\app\src\main\AndroidManifest.xml:16:5-51
		INJECTED from F:\SEMESTER_6\SistemAplikasiBergerak\Modul Kelas\Program Pak Ivan\HelloSharedPrefs\app\src\main\AndroidManifest.xml
		INJECTED from F:\SEMESTER_6\SistemAplikasiBergerak\Modul Kelas\Program Pak Ivan\HelloSharedPrefs\app\src\main\AndroidManifest.xml
	android:versionName
		INJECTED from F:\SEMESTER_6\SistemAplikasiBergerak\Modul Kelas\Program Pak Ivan\HelloSharedPrefs\app\src\main\AndroidManifest.xml
		ADDED from F:\SEMESTER_6\SistemAplikasiBergerak\Modul Kelas\Program Pak Ivan\HelloSharedPrefs\app\src\main\AndroidManifest.xml:15:1-32:12
		INJECTED from F:\SEMESTER_6\SistemAplikasiBergerak\Modul Kelas\Program Pak Ivan\HelloSharedPrefs\app\src\main\AndroidManifest.xml
	android:versionCode
		INJECTED from F:\SEMESTER_6\SistemAplikasiBergerak\Modul Kelas\Program Pak Ivan\HelloSharedPrefs\app\src\main\AndroidManifest.xml
		ADDED from F:\SEMESTER_6\SistemAplikasiBergerak\Modul Kelas\Program Pak Ivan\HelloSharedPrefs\app\src\main\AndroidManifest.xml:15:1-32:12
		INJECTED from F:\SEMESTER_6\SistemAplikasiBergerak\Modul Kelas\Program Pak Ivan\HelloSharedPrefs\app\src\main\AndroidManifest.xml
	xmlns:android
		ADDED from F:\SEMESTER_6\SistemAplikasiBergerak\Modul Kelas\Program Pak Ivan\HelloSharedPrefs\app\src\main\AndroidManifest.xml:15:11-69
application
ADDED from F:\SEMESTER_6\SistemAplikasiBergerak\Modul Kelas\Program Pak Ivan\HelloSharedPrefs\app\src\main\AndroidManifest.xml:18:5-30:19
MERGED from [com.android.support:appcompat-v7:23.4.0] C:\Users\Evi\.gradle\caches\transforms-1\files-1.1\appcompat-v7-23.4.0.aar\b0410296184df2b20bf03cddc06bf6f1\AndroidManifest.xml:25:5-20
MERGED from [com.android.support:appcompat-v7:23.4.0] C:\Users\Evi\.gradle\caches\transforms-1\files-1.1\appcompat-v7-23.4.0.aar\b0410296184df2b20bf03cddc06bf6f1\AndroidManifest.xml:25:5-20
MERGED from [com.android.support:animated-vector-drawable:23.4.0] C:\Users\Evi\.gradle\caches\transforms-1\files-1.1\animated-vector-drawable-23.4.0.aar\52815c41d02f9983f144a702bc84cb70\AndroidManifest.xml:7:5-20
MERGED from [com.android.support:animated-vector-drawable:23.4.0] C:\Users\Evi\.gradle\caches\transforms-1\files-1.1\animated-vector-drawable-23.4.0.aar\52815c41d02f9983f144a702bc84cb70\AndroidManifest.xml:7:5-20
MERGED from [com.android.support:support-vector-drawable:23.4.0] C:\Users\Evi\.gradle\caches\transforms-1\files-1.1\support-vector-drawable-23.4.0.aar\f65afc77e6ebf3a40e39fb192cb866ae\AndroidManifest.xml:7:5-20
MERGED from [com.android.support:support-vector-drawable:23.4.0] C:\Users\Evi\.gradle\caches\transforms-1\files-1.1\support-vector-drawable-23.4.0.aar\f65afc77e6ebf3a40e39fb192cb866ae\AndroidManifest.xml:7:5-20
MERGED from [com.android.support:support-v4:23.4.0] C:\Users\Evi\.gradle\caches\transforms-1\files-1.1\support-v4-23.4.0.aar\e02f4339828e8f437a887104a72106dc\AndroidManifest.xml:22:5-20
MERGED from [com.android.support:support-v4:23.4.0] C:\Users\Evi\.gradle\caches\transforms-1\files-1.1\support-v4-23.4.0.aar\e02f4339828e8f437a887104a72106dc\AndroidManifest.xml:22:5-20
	android:supportsRtl
		ADDED from F:\SEMESTER_6\SistemAplikasiBergerak\Modul Kelas\Program Pak Ivan\HelloSharedPrefs\app\src\main\AndroidManifest.xml:22:9-35
	android:label
		ADDED from F:\SEMESTER_6\SistemAplikasiBergerak\Modul Kelas\Program Pak Ivan\HelloSharedPrefs\app\src\main\AndroidManifest.xml:21:9-41
	android:icon
		ADDED from F:\SEMESTER_6\SistemAplikasiBergerak\Modul Kelas\Program Pak Ivan\HelloSharedPrefs\app\src\main\AndroidManifest.xml:20:9-43
	android:allowBackup
		ADDED from F:\SEMESTER_6\SistemAplikasiBergerak\Modul Kelas\Program Pak Ivan\HelloSharedPrefs\app\src\main\AndroidManifest.xml:19:9-35
	android:theme
		ADDED from F:\SEMESTER_6\SistemAplikasiBergerak\Modul Kelas\Program Pak Ivan\HelloSharedPrefs\app\src\main\AndroidManifest.xml:23:9-40
activity#com.example.android.hellosharedprefs.MainActivity
ADDED from F:\SEMESTER_6\SistemAplikasiBergerak\Modul Kelas\Program Pak Ivan\HelloSharedPrefs\app\src\main\AndroidManifest.xml:24:9-29:20
	android:name
		ADDED from F:\SEMESTER_6\SistemAplikasiBergerak\Modul Kelas\Program Pak Ivan\HelloSharedPrefs\app\src\main\AndroidManifest.xml:24:19-47
intent-filter#android.intent.action.MAIN+android.intent.category.LAUNCHER
ADDED from F:\SEMESTER_6\SistemAplikasiBergerak\Modul Kelas\Program Pak Ivan\HelloSharedPrefs\app\src\main\AndroidManifest.xml:25:13-28:29
action#android.intent.action.MAIN
ADDED from F:\SEMESTER_6\SistemAplikasiBergerak\Modul Kelas\Program Pak Ivan\HelloSharedPrefs\app\src\main\AndroidManifest.xml:26:17-69
	android:name
		ADDED from F:\SEMESTER_6\SistemAplikasiBergerak\Modul Kelas\Program Pak Ivan\HelloSharedPrefs\app\src\main\AndroidManifest.xml:26:25-66
category#android.intent.category.LAUNCHER
ADDED from F:\SEMESTER_6\SistemAplikasiBergerak\Modul Kelas\Program Pak Ivan\HelloSharedPrefs\app\src\main\AndroidManifest.xml:27:17-77
	android:name
		ADDED from F:\SEMESTER_6\SistemAplikasiBergerak\Modul Kelas\Program Pak Ivan\HelloSharedPrefs\app\src\main\AndroidManifest.xml:27:27-74
uses-sdk
INJECTED from F:\SEMESTER_6\SistemAplikasiBergerak\Modul Kelas\Program Pak Ivan\HelloSharedPrefs\app\src\main\AndroidManifest.xml reason: use-sdk injection requested
INJECTED from F:\SEMESTER_6\SistemAplikasiBergerak\Modul Kelas\Program Pak Ivan\HelloSharedPrefs\app\src\main\AndroidManifest.xml
INJECTED from F:\SEMESTER_6\SistemAplikasiBergerak\Modul Kelas\Program Pak Ivan\HelloSharedPrefs\app\src\main\AndroidManifest.xml
MERGED from [com.android.support:appcompat-v7:23.4.0] C:\Users\Evi\.gradle\caches\transforms-1\files-1.1\appcompat-v7-23.4.0.aar\b0410296184df2b20bf03cddc06bf6f1\AndroidManifest.xml:21:5-23:78
MERGED from [com.android.support:appcompat-v7:23.4.0] C:\Users\Evi\.gradle\caches\transforms-1\files-1.1\appcompat-v7-23.4.0.aar\b0410296184df2b20bf03cddc06bf6f1\AndroidManifest.xml:21:5-23:78
MERGED from [com.android.support:animated-vector-drawable:23.4.0] C:\Users\Evi\.gradle\caches\transforms-1\files-1.1\animated-vector-drawable-23.4.0.aar\52815c41d02f9983f144a702bc84cb70\AndroidManifest.xml:5:5-44
MERGED from [com.android.support:animated-vector-drawable:23.4.0] C:\Users\Evi\.gradle\caches\transforms-1\files-1.1\animated-vector-drawable-23.4.0.aar\52815c41d02f9983f144a702bc84cb70\AndroidManifest.xml:5:5-44
MERGED from [com.android.support:support-vector-drawable:23.4.0] C:\Users\Evi\.gradle\caches\transforms-1\files-1.1\support-vector-drawable-23.4.0.aar\f65afc77e6ebf3a40e39fb192cb866ae\AndroidManifest.xml:5:5-43
MERGED from [com.android.support:support-vector-drawable:23.4.0] C:\Users\Evi\.gradle\caches\transforms-1\files-1.1\support-vector-drawable-23.4.0.aar\f65afc77e6ebf3a40e39fb192cb866ae\AndroidManifest.xml:5:5-43
MERGED from [com.android.support:support-v4:23.4.0] C:\Users\Evi\.gradle\caches\transforms-1\files-1.1\support-v4-23.4.0.aar\e02f4339828e8f437a887104a72106dc\AndroidManifest.xml:20:5-43
MERGED from [com.android.support:support-v4:23.4.0] C:\Users\Evi\.gradle\caches\transforms-1\files-1.1\support-v4-23.4.0.aar\e02f4339828e8f437a887104a72106dc\AndroidManifest.xml:20:5-43
INJECTED from F:\SEMESTER_6\SistemAplikasiBergerak\Modul Kelas\Program Pak Ivan\HelloSharedPrefs\app\src\main\AndroidManifest.xml
INJECTED from F:\SEMESTER_6\SistemAplikasiBergerak\Modul Kelas\Program Pak Ivan\HelloSharedPrefs\app\src\main\AndroidManifest.xml
	tools:overrideLibrary
		ADDED from [com.android.support:appcompat-v7:23.4.0] C:\Users\Evi\.gradle\caches\transforms-1\files-1.1\appcompat-v7-23.4.0.aar\b0410296184df2b20bf03cddc06bf6f1\AndroidManifest.xml:23:9-75
	android:targetSdkVersion
		INJECTED from F:\SEMESTER_6\SistemAplikasiBergerak\Modul Kelas\Program Pak Ivan\HelloSharedPrefs\app\src\main\AndroidManifest.xml
		ADDED from F:\SEMESTER_6\SistemAplikasiBergerak\Modul Kelas\Program Pak Ivan\HelloSharedPrefs\app\src\main\AndroidManifest.xml
		INJECTED from F:\SEMESTER_6\SistemAplikasiBergerak\Modul Kelas\Program Pak Ivan\HelloSharedPrefs\app\src\main\AndroidManifest.xml
	android:minSdkVersion
		INJECTED from F:\SEMESTER_6\SistemAplikasiBergerak\Modul Kelas\Program Pak Ivan\HelloSharedPrefs\app\src\main\AndroidManifest.xml
		ADDED from F:\SEMESTER_6\SistemAplikasiBergerak\Modul Kelas\Program Pak Ivan\HelloSharedPrefs\app\src\main\AndroidManifest.xml
		INJECTED from F:\SEMESTER_6\SistemAplikasiBergerak\Modul Kelas\Program Pak Ivan\HelloSharedPrefs\app\src\main\AndroidManifest.xml
