parent_code,code,type,description,uom,cost_code,cost_head,detail
,HVAC,Class,HVAC,,,,MEP
HVAC,M11,Class,Equipments,,,,MEP
M11,M1101,Class,Chiller,,,,MEP
M1101,M110101,Class,Air Cooled Chiller,,,,MEP
M110101,M110101-0001,Resource,Air Cooled Chiller Chiller 1,Nos,Equipments,HVAC,MEP
M110101,M110101-0002,Resource,Air Cooled Chiller Chiller 2,Nos,Equipments,HVAC,MEP
M110101,M110101-0003,Resource,Air Cooled Chiller Chiller 3,Nos,Equipments,HVAC,MEP
M110101,M110101-0004,Resource,Air Cooled Chiller Chiller 4,Nos,Equipments,HVAC,MEP
M110101,M110101-0005,Resource,Air Cooled Chiller Chiller 5,Nos,Equipments,HVAC,MEP
M11,M110102,Class,Water Cooled Chiller,,,,
M110102,M110102-0001,Resource,Water Cooled Chiller 1,Nos,Equipments,HVAC,MEP
M11,M1102,Class,Cooling Tower,,,,
M1102,M1102-0001,Resource,Cooling Tower counter flow Upto 300 Ton Forced draft,Nos,Equipments,HVAC,MEP
M1102,M1102-0002,Resource,Cooling Tower counter flow 301-350 Ton Forced draft,Nos,Equipments,HVAC,MEP
M1102,M1102-0003,Resource,Cooling Tower counter flow 351-400 Ton Forced draft,Nos,Equipments,HVAC,MEP
M1102,M1102-0004,Resource,Cooling Tower counter flow 401-450 Ton Forced draft,Nos,Equipments,HVAC,MEP
M1102,M1102-0005,Resource,Cooling Tower counter flow 451-500 Ton Forced draft,Nos,Equipments,HVAC,MEP
M1102,M1102-0006,Resource,Cooling Tower counter flow 501-550 Ton Forced draft,Nos,Equipments,HVAC,MEP
M1102,M1102-0007,Resource,Cooling Tower counter flow 551-600 Ton Forced draft,Nos,Equipments,HVAC,MEP
M1102,M1102-0008,Resource,Cooling Tower counter flow 601-650 Ton Forced draft,Nos,Equipments,HVAC,MEP
M1102,M1102-0009,Resource,Cooling Tower counter flow 651-700 Ton Forced draft,Nos,Equipments,HVAC,MEP
M1102,M1102-0010,Resource,Cooling Tower counter flow 701-750 Ton Forced draft,Nos,Equipments,HVAC,MEP
M1102,M1102-0011,Resource,Cooling Tower counter flow 751-800 Ton Forced draft,Nos,Equipments,HVAC,MEP
M1102,M1102-0012,Resource,Cooling Tower counter flow 801-850 Ton Forced draft,Nos,Equipments,HVAC,MEP
M1102,M1102-0013,Resource,Cooling Tower counter flow 851-900 Ton Forced draft,Nos,Equipments,HVAC,MEP
M1102,M1102-0014,Resource,Cooling Tower counter flow 901-950 Ton Forced draft,Nos,Equipments,HVAC,MEP
M1102,M1102-0015,Resource,Cooling Tower counter flow 951-1000 Ton Forced draft,Nos,Equipments,HVAC,MEP
M1102,M1102-0016,Resource,Cooling Tower counter flow 1001-1050 Ton Forced draft,Nos,Equipments,HVAC,MEP
M1102,M1102-0017,Resource,Cooling Tower counter flow 1051-1100 Ton Forced draft,Nos,Equipments,HVAC,MEP
M1102,M1102-0018,Resource,Cooling Tower counter flow 1101-1150 Ton Forced draft,Nos,Equipments,HVAC,MEP
M1102,M1102-0019,Resource,Cooling Tower counter flow 1151-1200 Ton Forced draft,Nos,Equipments,HVAC,MEP
M1102,M1102-0020,Resource,Cooling Tower counter flow 1201-1250 Ton Forced draft,Nos,Equipments,HVAC,MEP
M1102,M1102-0021,Resource,Cooling Tower counter flow 1251-1300 Ton Forced draft,Nos,Equipments,HVAC,MEP
M1102,M1102-0022,Resource,Cooling Tower cross flow Upto 300 Ton Forced draft,Nos,Equipments,HVAC,MEP
M1102,M1102-0023,Resource,Cooling Tower cross flow 301-350 Ton Forced draft,Nos,Equipments,HVAC,MEP
M1102,M1102-0024,Resource,Cooling Tower cross flow 351-400 Ton Forced draft,Nos,Equipments,HVAC,MEP
M1102,M1102-0025,Resource,Cooling Tower cross flow 401-450 Ton Forced draft,Nos,Equipments,HVAC,MEP
M1102,M1102-0026,Resource,Cooling Tower cross flow 451-500 Ton Forced draft,Nos,Equipments,HVAC,MEP
M1102,M1102-0027,Resource,Cooling Tower cross flow 501-550 Ton Forced draft,Nos,Equipments,HVAC,MEP
M1102,M1102-0028,Resource,Cooling Tower cross flow 551-600 Ton Forced draft,Nos,Equipments,HVAC,MEP
M1102,M1102-0029,Resource,Cooling Tower cross flow 601-650 Ton Forced draft,Nos,Equipments,HVAC,MEP
M1102,M1102-0030,Resource,Cooling Tower cross flow 651-700 Ton Forced draft,Nos,Equipments,HVAC,MEP
M1102,M1102-0031,Resource,Cooling Tower cross flow 701-750 Ton Forced draft,Nos,Equipments,HVAC,MEP
M1102,M1102-0032,Resource,Cooling Tower cross flow 751-800 Ton Forced draft,Nos,Equipments,HVAC,MEP
M1102,M1102-0033,Resource,Cooling Tower cross flow 801-850 Ton Forced draft,Nos,Equipments,HVAC,MEP
M1102,M1102-0034,Resource,Cooling Tower cross flow 851-900 Ton Forced draft,Nos,Equipments,HVAC,MEP
M1102,M1102-0035,Resource,Cooling Tower cross flow 901-950 Ton Forced draft,Nos,Equipments,HVAC,MEP
M1102,M1102-0036,Resource,Cooling Tower cross flow 951-1000 Ton Forced draft,Nos,Equipments,HVAC,MEP
M1102,M1102-0037,Resource,Cooling Tower cross flow 1001-1050 Ton Forced draft,Nos,Equipments,HVAC,MEP
M1102,M1102-0038,Resource,Cooling Tower cross flow 1051-1100 Ton Forced draft,Nos,Equipments,HVAC,MEP
M1102,M1102-0039,Resource,Cooling Tower cross flow 1101-1150 Ton Forced draft,Nos,Equipments,HVAC,MEP
M1102,M1102-0040,Resource,Cooling Tower cross flow 1151-1200 Ton Forced draft,Nos,Equipments,HVAC,MEP
M1102,M1102-0041,Resource,Cooling Tower cross flow 1201-1250 Ton Forced draft,Nos,Equipments,HVAC,MEP
M1102,M1102-0042,Resource,Cooling Tower cross flow 1251-1300 Ton Forced draft,Nos,Equipments,HVAC,MEP
M1102,M1102-0043,Resource,Cooling Tower counter flow Upto 300 Ton Induced draft,Nos,Equipments,HVAC,MEP
M1102,M1102-0044,Resource,Cooling Tower counter flow 301-350 Ton Induced draft,Nos,Equipments,HVAC,MEP
M1102,M1102-0045,Resource,Cooling Tower counter flow 351-400 Ton Induced draft,Nos,Equipments,HVAC,MEP
M1102,M1102-0046,Resource,Cooling Tower counter flow 401-450 Ton Induced draft,Nos,Equipments,HVAC,MEP
M1102,M1102-0047,Resource,Cooling Tower counter flow 451-500 Ton Induced draft,Nos,Equipments,HVAC,MEP
M1102,M1102-0048,Resource,Cooling Tower counter flow 501-550 Ton Induced draft,Nos,Equipments,HVAC,MEP
M1102,M1102-0049,Resource,Cooling Tower counter flow 551-600 Ton Induced draft,Nos,Equipments,HVAC,MEP
M1102,M1102-0050,Resource,Cooling Tower counter flow 601-650 Ton Induced draft,Nos,Equipments,HVAC,MEP
M1102,M1102-0051,Resource,Cooling Tower counter flow 651-700 Ton Induced draft,Nos,Equipments,HVAC,MEP
M1102,M1102-0052,Resource,Cooling Tower counter flow 701-750 Ton Induced draft,Nos,Equipments,HVAC,MEP
M1102,M1102-0053,Resource,Cooling Tower counter flow 751-800 Ton Induced draft,Nos,Equipments,HVAC,MEP
M1102,M1102-0054,Resource,Cooling Tower counter flow 801-850 Ton Induced draft,Nos,Equipments,HVAC,MEP
M1102,M1102-0055,Resource,Cooling Tower counter flow 851-900 Ton Induced draft,Nos,Equipments,HVAC,MEP
M1102,M1102-0056,Resource,Cooling Tower counter flow 901-950 Ton Induced draft,Nos,Equipments,HVAC,MEP
M1102,M1102-0057,Resource,Cooling Tower counter flow 951-1000 Ton Induced draft,Nos,Equipments,HVAC,MEP
M1102,M1102-0058,Resource,Cooling Tower counter flow 1001-1050 Ton Induced draft,Nos,Equipments,HVAC,MEP
M1102,M1102-0059,Resource,Cooling Tower counter flow 1051-1100 Ton Induced draft,Nos,Equipments,HVAC,MEP
M1102,M1102-0060,Resource,Cooling Tower counter flow 1101-1150 Ton Induced draft,Nos,Equipments,HVAC,MEP
M1102,M1102-0061,Resource,Cooling Tower counter flow 1151-1200 Ton Induced draft,Nos,Equipments,HVAC,MEP
M1102,M1102-0062,Resource,Cooling Tower counter flow 1201-1250 Ton Induced draft,Nos,Equipments,HVAC,MEP
M1102,M1102-0063,Resource,Cooling Tower counter flow 1251-1300 Ton Induced draft,Nos,Equipments,HVAC,MEP
M1102,M1102-0064,Resource,Cooling Tower cross flow Upto 300 Ton Induced draft,Nos,Equipments,HVAC,MEP
M1102,M1102-0065,Resource,Cooling Tower cross flow 301-350 Ton Induced draft,Nos,Equipments,HVAC,MEP
M1102,M1102-0066,Resource,Cooling Tower cross flow 351-400 Ton Induced draft,Nos,Equipments,HVAC,MEP
M1102,M1102-0067,Resource,Cooling Tower cross flow 401-450 Ton Induced draft,Nos,Equipments,HVAC,MEP
M1102,M1102-0068,Resource,Cooling Tower cross flow 451-500 Ton Induced draft,Nos,Equipments,HVAC,MEP
M1102,M1102-0069,Resource,Cooling Tower cross flow 501-550 Ton Induced draft,Nos,Equipments,HVAC,MEP
M1102,M1102-0070,Resource,Cooling Tower cross flow 551-600 Ton Induced draft,Nos,Equipments,HVAC,MEP
M1102,M1102-0071,Resource,Cooling Tower cross flow 601-650 Ton Induced draft,Nos,Equipments,HVAC,MEP
M1102,M1102-0072,Resource,Cooling Tower cross flow 651-700 Ton Induced draft,Nos,Equipments,HVAC,MEP
M1102,M1102-0073,Resource,Cooling Tower cross flow 701-750 Ton Induced draft,Nos,Equipments,HVAC,MEP
M1102,M1102-0074,Resource,Cooling Tower cross flow 751-800 Ton Induced draft,Nos,Equipments,HVAC,MEP
M1102,M1102-0075,Resource,Cooling Tower cross flow 801-850 Ton Induced draft,Nos,Equipments,HVAC,MEP
M1102,M1102-0076,Resource,Cooling Tower cross flow 851-900 Ton Induced draft,Nos,Equipments,HVAC,MEP
M1102,M1102-0077,Resource,Cooling Tower cross flow 901-950 Ton Induced draft,Nos,Equipments,HVAC,MEP
M1102,M1102-0078,Resource,Cooling Tower cross flow 951-1000 Ton Induced draft,Nos,Equipments,HVAC,MEP
M1102,M1102-0079,Resource,Cooling Tower cross flow 1001-1050 Ton Induced draft,Nos,Equipments,HVAC,MEP
M1102,M1102-0080,Resource,Cooling Tower cross flow 1051-1100 Ton Induced draft,Nos,Equipments,HVAC,MEP
M1102,M1102-0081,Resource,Cooling Tower cross flow 1101-1150 Ton Induced draft,Nos,Equipments,HVAC,MEP
M1102,M1102-0082,Resource,Cooling Tower cross flow 1151-1200 Ton Induced draft,Nos,Equipments,HVAC,MEP
M1102,M1102-0083,Resource,Cooling Tower cross flow 1201-1250 Ton Induced draft,Nos,Equipments,HVAC,MEP
M1102,M1102-0084,Resource,Cooling Tower cross flow 1251-1300 Ton Induced draft,Nos,Equipments,HVAC,MEP
M1102,M1102-0085,Resource,Cooling Tower counter flow Upto 300 Ton Induced draft - Concrete Basin & Tile Fills,Nos,Equipments,HVAC,MEP
M1102,M1102-0086,Resource,Cooling Tower counter flow 301-350 Ton Induced draft - Concrete Basin & Tile Fills,Nos,Equipments,HVAC,MEP
M1102,M1102-0087,Resource,Cooling Tower counter flow 351-400 Ton Induced draft - Concrete Basin & Tile Fills,Nos,Equipments,HVAC,MEP
M1102,M1102-0088,Resource,Cooling Tower counter flow 401-450 Ton Induced draft - Concrete Basin & Tile Fills,Nos,Equipments,HVAC,MEP
M1102,M1102-0089,Resource,Cooling Tower counter flow 451-500 Ton Induced draft - Concrete Basin & Tile Fills,Nos,Equipments,HVAC,MEP
M1102,M1102-0090,Resource,Cooling Tower counter flow 501-550 Ton Induced draft - Concrete Basin & Tile Fills,Nos,Equipments,HVAC,MEP
M1102,M1102-0091,Resource,Cooling Tower counter flow 551-600 Ton Induced draft - Concrete Basin & Tile Fills,Nos,Equipments,HVAC,MEP
M1102,M1102-0092,Resource,Cooling Tower counter flow 601-650 Ton Induced draft - Concrete Basin & Tile Fills,Nos,Equipments,HVAC,MEP
M1102,M1102-0093,Resource,Cooling Tower counter flow 651-700 Ton Induced draft - Concrete Basin & Tile Fills,Nos,Equipments,HVAC,MEP
M1102,M1102-0094,Resource,Cooling Tower counter flow 701-750 Ton Induced draft - Concrete Basin & Tile Fills,Nos,Equipments,HVAC,MEP
M1102,M1102-0095,Resource,Cooling Tower counter flow 751-800 Ton Induced draft - Concrete Basin & Tile Fills,Nos,Equipments,HVAC,MEP
M1102,M1102-0096,Resource,Cooling Tower counter flow 801-850 Ton Induced draft - Concrete Basin & Tile Fills,Nos,Equipments,HVAC,MEP
M1102,M1102-0097,Resource,Cooling Tower counter flow 851-900 Ton Induced draft - Concrete Basin & Tile Fills,Nos,Equipments,HVAC,MEP
M1102,M1102-0098,Resource,Cooling Tower counter flow 901-950 Ton Induced draft - Concrete Basin & Tile Fills,Nos,Equipments,HVAC,MEP
M1102,M1102-0099,Resource,Cooling Tower counter flow 951-1000 Ton Induced draft - Concrete Basin & Tile Fills,Nos,Equipments,HVAC,MEP
M1102,M1102-0100,Resource,Cooling Tower counter flow 1001-1050 Ton Induced draft - Concrete Basin & Tile Fills,Nos,Equipments,HVAC,MEP
M1102,M1102-0101,Resource,Cooling Tower counter flow 1051-1100 Ton Induced draft - Concrete Basin & Tile Fills,Nos,Equipments,HVAC,MEP
M1102,M1102-0102,Resource,Cooling Tower counter flow 1101-1150 Ton Induced draft - Concrete Basin & Tile Fills,Nos,Equipments,HVAC,MEP
M1102,M1102-0103,Resource,Cooling Tower counter flow 1151-1200 Ton Induced draft - Concrete Basin & Tile Fills,Nos,Equipments,HVAC,MEP
M1102,M1102-0104,Resource,Cooling Tower counter flow 1201-1250 Ton Induced draft - Concrete Basin & Tile Fills,Nos,Equipments,HVAC,MEP
M1102,M1102-0105,Resource,Cooling Tower counter flow 1251-1300 Ton Induced draft - Concrete Basin & Tile Fills,Nos,Equipments,HVAC,MEP
M1102,M1102-0106,Resource,Cooling Tower cross flow Upto 300 Ton Induced draft - Concrete Basin & Tile Fills,Nos,Equipments,HVAC,MEP
M1102,M1102-0107,Resource,Cooling Tower cross flow 301-350 Ton Induced draft - Concrete Basin & Tile Fills,Nos,Equipments,HVAC,MEP
M1102,M1102-0108,Resource,Cooling Tower cross flow 351-400 Ton Induced draft - Concrete Basin & Tile Fills,Nos,Equipments,HVAC,MEP
M1102,M1102-0109,Resource,Cooling Tower cross flow 401-450 Ton Induced draft - Concrete Basin & Tile Fills,Nos,Equipments,HVAC,MEP
M1102,M1102-0110,Resource,Cooling Tower cross flow 451-500 Ton Induced draft - Concrete Basin & Tile Fills,Nos,Equipments,HVAC,MEP
M1102,M1102-0111,Resource,Cooling Tower cross flow 501-550 Ton Induced draft - Concrete Basin & Tile Fills,Nos,Equipments,HVAC,MEP
M1102,M1102-0112,Resource,Cooling Tower cross flow 551-600 Ton Induced draft - Concrete Basin & Tile Fills,Nos,Equipments,HVAC,MEP
M1102,M1102-0113,Resource,Cooling Tower cross flow 601-650 Ton Induced draft - Concrete Basin & Tile Fills,Nos,Equipments,HVAC,MEP
M1102,M1102-0114,Resource,Cooling Tower cross flow 651-700 Ton Induced draft - Concrete Basin & Tile Fills,Nos,Equipments,HVAC,MEP
M1102,M1102-0115,Resource,Cooling Tower cross flow 701-750 Ton Induced draft - Concrete Basin & Tile Fills,Nos,Equipments,HVAC,MEP
M1102,M1102-0116,Resource,Cooling Tower cross flow 751-800 Ton Induced draft - Concrete Basin & Tile Fills,Nos,Equipments,HVAC,MEP
M1102,M1102-0117,Resource,Cooling Tower cross flow 801-850 Ton Induced draft - Concrete Basin & Tile Fills,Nos,Equipments,HVAC,MEP
M1102,M1102-0118,Resource,Cooling Tower cross flow 851-900 Ton Induced draft - Concrete Basin & Tile Fills,Nos,Equipments,HVAC,MEP
M1102,M1102-0119,Resource,Cooling Tower cross flow 901-950 Ton Induced draft - Concrete Basin & Tile Fills,Nos,Equipments,HVAC,MEP
M1102,M1102-0120,Resource,Cooling Tower cross flow 951-1000 Ton Induced draft - Concrete Basin & Tile Fills,Nos,Equipments,HVAC,MEP
M1102,M1102-0121,Resource,Cooling Tower cross flow 1001-1050 Ton Induced draft - Concrete Basin & Tile Fills,Nos,Equipments,HVAC,MEP
M1102,M1102-0122,Resource,Cooling Tower cross flow 1051-1100 Ton Induced draft - Concrete Basin & Tile Fills,Nos,Equipments,HVAC,MEP
M1102,M1102-0123,Resource,Cooling Tower cross flow 1101-1150 Ton Induced draft - Concrete Basin & Tile Fills,Nos,Equipments,HVAC,MEP
M1102,M1102-0124,Resource,Cooling Tower cross flow 1151-1200 Ton Induced draft - Concrete Basin & Tile Fills,Nos,Equipments,HVAC,MEP
M1102,M1102-0125,Resource,Cooling Tower cross flow 1201-1250 Ton Induced draft - Concrete Basin & Tile Fills,Nos,Equipments,HVAC,MEP
M1102,M1102-0126,Resource,Cooling Tower cross flow 1251-1300 Ton Induced draft - Concrete Basin & Tile Fills,Nos,Equipments,HVAC,MEP
M11,M1103,Class,Chilled Water Pump,,,,MEP
M1103,M1103-0001,Resource,CHW Pump Horizontal End Suction 0-50 GPM,Nos,Equipments,HVAC,MEP
M1103,M1103-0002,Resource,CHW Pump Horizontal End Suction 51-100 GPM,Nos,Equipments,HVAC,MEP
M1103,M1103-0003,Resource,CHW Pump Horizontal End Suction 101-150 GPM,Nos,Equipments,HVAC,MEP
M1103,M1103-0004,Resource,CHW Pump Horizontal End Suction 151-200 GPM,Nos,Equipments,HVAC,MEP
M1103,M1103-0005,Resource,CHW Pump Horizontal End Suction 201-250 GPM,Nos,Equipments,HVAC,MEP
M1103,M1103-0006,Resource,CHW Pump Horizontal End Suction 251-300 GPM,Nos,Equipments,HVAC,MEP
M1103,M1103-0007,Resource,CHW Pump Horizontal End Suction 301-350 GPM,Nos,Equipments,HVAC,MEP
M1103,M1103-0008,Resource,CHW Pump Horizontal End Suction 351-400 GPM,Nos,Equipments,HVAC,MEP
M1103,M1103-0009,Resource,CHW Pump Horizontal End Suction 401-450 GPM,Nos,Equipments,HVAC,MEP
M1103,M1103-0010,Resource,CHW Pump Horizontal End Suction 451-500 GPM,Nos,Equipments,HVAC,MEP
M1103,M1103-0011,Resource,CHW Pump Horizontal End Suction 501-550 GPM,Nos,Equipments,HVAC,MEP
M1103,M1103-0012,Resource,CHW Pump Horizontal End Suction 551-600 GPM,Nos,Equipments,HVAC,MEP
M1103,M1103-0013,Resource,CHW Pump Horizontal End Suction 601-650 GPM,Nos,Equipments,HVAC,MEP
M1103,M1103-0014,Resource,CHW Pump Horizontal End Suction 651-700 GPM,Nos,Equipments,HVAC,MEP
M1103,M1103-0015,Resource,CHW Pump Horizontal End Suction 701-750 GPM,Nos,Equipments,HVAC,MEP
M1103,M1103-0016,Resource,CHW Pump Horizontal End Suction 751-800 GPM,Nos,Equipments,HVAC,MEP
M1103,M1103-0017,Resource,CHW Pump Horizontal End Suction 801-850 GPM,Nos,Equipments,HVAC,MEP
M1103,M1103-0018,Resource,CHW Pump Horizontal End Suction 851-900 GPM,Nos,Equipments,HVAC,MEP
M1103,M1103-0019,Resource,CHW Pump Horizontal End Suction 901-950 GPM,Nos,Equipments,HVAC,MEP
M1103,M1103-0020,Resource,CHW Pump Horizontal End Suction 951-1000 GPM,Nos,Equipments,HVAC,MEP
M1103,M1103-0021,Resource,CHW Pump Vertical End Suction 0-50 GPM,Nos,Equipments,HVAC,MEP
M1103,M1103-0022,Resource,CHW Pump Vertical End Suction 51-100 GPM,Nos,Equipments,HVAC,MEP
M1103,M1103-0023,Resource,CHW Pump Vertical End Suction 101-150 GPM,Nos,Equipments,HVAC,MEP
M1103,M1103-0024,Resource,CHW Pump Vertical End Suction 151-200 GPM,Nos,Equipments,HVAC,MEP
M1103,M1103-0025,Resource,CHW Pump Vertical End Suction 201-250 GPM,Nos,Equipments,HVAC,MEP
M1103,M1103-0026,Resource,CHW Pump Vertical End Suction 251-300 GPM,Nos,Equipments,HVAC,MEP
M1103,M1103-0027,Resource,CHW Pump Vertical End Suction 301-350 GPM,Nos,Equipments,HVAC,MEP
M1103,M1103-0028,Resource,CHW Pump Vertical End Suction 351-400 GPM,Nos,Equipments,HVAC,MEP
M1103,M1103-0029,Resource,CHW Pump Vertical End Suction 401-450 GPM,Nos,Equipments,HVAC,MEP
M1103,M1103-0030,Resource,CHW Pump Vertical End Suction 451-500 GPM,Nos,Equipments,HVAC,MEP
M1103,M1103-0031,Resource,CHW Pump Vertical End Suction 501-550 GPM,Nos,Equipments,HVAC,MEP
M1103,M1103-0032,Resource,CHW Pump Vertical End Suction 551-600 GPM,Nos,Equipments,HVAC,MEP
M1103,M1103-0033,Resource,CHW Pump Vertical End Suction 601-650 GPM,Nos,Equipments,HVAC,MEP
M1103,M1103-0034,Resource,CHW Pump Vertical End Suction 651-700 GPM,Nos,Equipments,HVAC,MEP
M1103,M1103-0035,Resource,CHW Pump Vertical End Suction 701-750 GPM,Nos,Equipments,HVAC,MEP
M1103,M1103-0036,Resource,CHW Pump Vertical End Suction 751-800 GPM,Nos,Equipments,HVAC,MEP
M1103,M1103-0037,Resource,CHW Pump Vertical End Suction 801-850 GPM,Nos,Equipments,HVAC,MEP
M1103,M1103-0038,Resource,CHW Pump Vertical End Suction 851-900 GPM,Nos,Equipments,HVAC,MEP
M1103,M1103-0039,Resource,CHW Pump Vertical End Suction 901-950 GPM,Nos,Equipments,HVAC,MEP
M1103,M1103-0040,Resource,CHW Pump Vertical End Suction 951-1000 GPM,Nos,Equipments,HVAC,MEP
M1103,M1103-0041,Resource,CHW Pump Horizontal Split Case 0-50 GPM,Nos,Equipments,HVAC,MEP
M1103,M1103-0042,Resource,CHW Pump Horizontal Split Case 51-100 GPM,Nos,Equipments,HVAC,MEP
M1103,M1103-0043,Resource,CHW Pump Horizontal Split Case 101-150 GPM,Nos,Equipments,HVAC,MEP
M1103,M1103-0044,Resource,CHW Pump Horizontal Split Case 151-200 GPM,Nos,Equipments,HVAC,MEP
M1103,M1103-0045,Resource,CHW Pump Horizontal Split Case 201-250 GPM,Nos,Equipments,HVAC,MEP
M1103,M1103-0046,Resource,CHW Pump Horizontal Split Case 251-300 GPM,Nos,Equipments,HVAC,MEP
M1103,M1103-0047,Resource,CHW Pump Horizontal Split Case 301-350 GPM,Nos,Equipments,HVAC,MEP
M1103,M1103-0048,Resource,CHW Pump Horizontal Split Case 351-400 GPM,Nos,Equipments,HVAC,MEP
M1103,M1103-0049,Resource,CHW Pump Horizontal Split Case 401-450 GPM,Nos,Equipments,HVAC,MEP
M1103,M1103-0050,Resource,CHW Pump Horizontal Split Case 451-500 GPM,Nos,Equipments,HVAC,MEP
M1103,M1103-0051,Resource,CHW Pump Horizontal Split Case 501-550 GPM,Nos,Equipments,HVAC,MEP
M1103,M1103-0052,Resource,CHW Pump Horizontal Split Case 551-600 GPM,Nos,Equipments,HVAC,MEP
M1103,M1103-0053,Resource,CHW Pump Horizontal Split Case 601-650 GPM,Nos,Equipments,HVAC,MEP
M1103,M1103-0054,Resource,CHW Pump Horizontal Split Case 651-700 GPM,Nos,Equipments,HVAC,MEP
M1103,M1103-0055,Resource,CHW Pump Horizontal Split Case 701-750 GPM,Nos,Equipments,HVAC,MEP
M1103,M1103-0056,Resource,CHW Pump Horizontal Split Case 751-800 GPM,Nos,Equipments,HVAC,MEP
M1103,M1103-0057,Resource,CHW Pump Horizontal Split Case 801-850 GPM,Nos,Equipments,HVAC,MEP
M1103,M1103-0058,Resource,CHW Pump Horizontal Split Case 851-900 GPM,Nos,Equipments,HVAC,MEP
M1103,M1103-0059,Resource,CHW Pump Horizontal Split Case 901-950 GPM,Nos,Equipments,HVAC,MEP
M1103,M1103-0060,Resource,CHW Pump Horizontal Split Case 951-1000 GPM,Nos,Equipments,HVAC,MEP
M1103,M1103-0061,Resource,CHW Pump Vertical Split Case 0-50 GPM,Nos,Equipments,HVAC,MEP
M1103,M1103-0062,Resource,CHW Pump Vertical Split Case 51-100 GPM,Nos,Equipments,HVAC,MEP
M1103,M1103-0063,Resource,CHW Pump Vertical Split Case 101-150 GPM,Nos,Equipments,HVAC,MEP
M1103,M1103-0064,Resource,CHW Pump Vertical Split Case 151-200 GPM,Nos,Equipments,HVAC,MEP
M1103,M1103-0065,Resource,CHW Pump Vertical Split Case 201-250 GPM,Nos,Equipments,HVAC,MEP
M1103,M1103-0066,Resource,CHW Pump Vertical Split Case 251-300 GPM,Nos,Equipments,HVAC,MEP
M1103,M1103-0067,Resource,CHW Pump Vertical Split Case 301-350 GPM,Nos,Equipments,HVAC,MEP
M1103,M1103-0068,Resource,CHW Pump Vertical Split Case 351-400 GPM,Nos,Equipments,HVAC,MEP
M1103,M1103-0069,Resource,CHW Pump Vertical Split Case 401-450 GPM,Nos,Equipments,HVAC,MEP
M1103,M1103-0070,Resource,CHW Pump Vertical Split Case 451-500 GPM,Nos,Equipments,HVAC,MEP
M1103,M1103-0071,Resource,CHW Pump Vertical Split Case 501-550 GPM,Nos,Equipments,HVAC,MEP
M1103,M1103-0072,Resource,CHW Pump Vertical Split Case 551-600 GPM,Nos,Equipments,HVAC,MEP
M1103,M1103-0073,Resource,CHW Pump Vertical Split Case 601-650 GPM,Nos,Equipments,HVAC,MEP
M1103,M1103-0074,Resource,CHW Pump Vertical Split Case 651-700 GPM,Nos,Equipments,HVAC,MEP
M1103,M1103-0075,Resource,CHW Pump Vertical Split Case 701-750 GPM,Nos,Equipments,HVAC,MEP
M1103,M1103-0076,Resource,CHW Pump Vertical Split Case 751-800 GPM,Nos,Equipments,HVAC,MEP
M1103,M1103-0077,Resource,CHW Pump Vertical Split Case 801-850 GPM,Nos,Equipments,HVAC,MEP
M1103,M1103-0078,Resource,CHW Pump Vertical Split Case 851-900 GPM,Nos,Equipments,HVAC,MEP
M1103,M1103-0079,Resource,CHW Pump Vertical Split Case 901-950 GPM,Nos,Equipments,HVAC,MEP
M1103,M1103-0080,Resource,CHW Pump Vertical Split Case 951-1000 GPM,Nos,Equipments,HVAC,MEP
M1103,M1103-0081,Resource,CHW Pump Horizontal Multistage 0-50 GPM,Nos,Equipments,HVAC,MEP
M1103,M1103-0082,Resource,CHW Pump Horizontal Multistage 51-100 GPM,Nos,Equipments,HVAC,MEP
M1103,M1103-0083,Resource,CHW Pump Horizontal Multistage 101-150 GPM,Nos,Equipments,HVAC,MEP
M1103,M1103-0084,Resource,CHW Pump Horizontal Multistage 151-200 GPM,Nos,Equipments,HVAC,MEP
M1103,M1103-0085,Resource,CHW Pump Horizontal Multistage 201-250 GPM,Nos,Equipments,HVAC,MEP
M1103,M1103-0086,Resource,CHW Pump Horizontal Multistage 251-300 GPM,Nos,Equipments,HVAC,MEP
M1103,M1103-0087,Resource,CHW Pump Horizontal Multistage 301-350 GPM,Nos,Equipments,HVAC,MEP
M1103,M1103-0088,Resource,CHW Pump Horizontal Multistage 351-400 GPM,Nos,Equipments,HVAC,MEP
M1103,M1103-0089,Resource,CHW Pump Horizontal Multistage 401-450 GPM,Nos,Equipments,HVAC,MEP
M1103,M1103-0090,Resource,CHW Pump Horizontal Multistage 451-500 GPM,Nos,Equipments,HVAC,MEP
M1103,M1103-0091,Resource,CHW Pump Horizontal Multistage 501-550 GPM,Nos,Equipments,HVAC,MEP
M1103,M1103-0092,Resource,CHW Pump Horizontal Multistage 551-600 GPM,Nos,Equipments,HVAC,MEP
M1103,M1103-0093,Resource,CHW Pump Horizontal Multistage 601-650 GPM,Nos,Equipments,HVAC,MEP
M1103,M1103-0094,Resource,CHW Pump Horizontal Multistage 651-700 GPM,Nos,Equipments,HVAC,MEP
M1103,M1103-0095,Resource,CHW Pump Horizontal Multistage 701-750 GPM,Nos,Equipments,HVAC,MEP
M1103,M1103-0096,Resource,CHW Pump Horizontal Multistage 751-800 GPM,Nos,Equipments,HVAC,MEP
M1103,M1103-0097,Resource,CHW Pump Horizontal Multistage 801-850 GPM,Nos,Equipments,HVAC,MEP
M1103,M1103-0098,Resource,CHW Pump Horizontal Multistage 851-900 GPM,Nos,Equipments,HVAC,MEP
M1103,M1103-0099,Resource,CHW Pump Horizontal Multistage 901-950 GPM,Nos,Equipments,HVAC,MEP
M1103,M1103-0100,Resource,CHW Pump Horizontal Multistage 951-1000 GPM,Nos,Equipments,HVAC,MEP
M1103,M1103-0101,Resource,CHW Pump Vertical Multistage 0-50 GPM,Nos,Equipments,HVAC,MEP
M1103,M1103-0102,Resource,CHW Pump Vertical Multistage 51-100 GPM,Nos,Equipments,HVAC,MEP
M1103,M1103-0103,Resource,CHW Pump Vertical Multistage 101-150 GPM,Nos,Equipments,HVAC,MEP
M1103,M1103-0104,Resource,CHW Pump Vertical Multistage 151-200 GPM,Nos,Equipments,HVAC,MEP
M1103,M1103-0105,Resource,CHW Pump Vertical Multistage 201-250 GPM,Nos,Equipments,HVAC,MEP
M1103,M1103-0106,Resource,CHW Pump Vertical Multistage 251-300 GPM,Nos,Equipments,HVAC,MEP
M1103,M1103-0107,Resource,CHW Pump Vertical Multistage 301-350 GPM,Nos,Equipments,HVAC,MEP
M1103,M1103-0108,Resource,CHW Pump Vertical Multistage 351-400 GPM,Nos,Equipments,HVAC,MEP
M1103,M1103-0109,Resource,CHW Pump Vertical Multistage 401-450 GPM,Nos,Equipments,HVAC,MEP
M1103,M1103-0110,Resource,CHW Pump Vertical Multistage 451-500 GPM,Nos,Equipments,HVAC,MEP
M1103,M1103-0111,Resource,CHW Pump Vertical Multistage 501-550 GPM,Nos,Equipments,HVAC,MEP
M1103,M1103-0112,Resource,CHW Pump Vertical Multistage 551-600 GPM,Nos,Equipments,HVAC,MEP
M1103,M1103-0113,Resource,CHW Pump Vertical Multistage 601-650 GPM,Nos,Equipments,HVAC,MEP
M1103,M1103-0114,Resource,CHW Pump Vertical Multistage 651-700 GPM,Nos,Equipments,HVAC,MEP
M1103,M1103-0115,Resource,CHW Pump Vertical Multistage 701-750 GPM,Nos,Equipments,HVAC,MEP
M1103,M1103-0116,Resource,CHW Pump Vertical Multistage 751-800 GPM,Nos,Equipments,HVAC,MEP
M1103,M1103-0117,Resource,CHW Pump Vertical Multistage 801-850 GPM,Nos,Equipments,HVAC,MEP
M1103,M1103-0118,Resource,CHW Pump Vertical Multistage 851-900 GPM,Nos,Equipments,HVAC,MEP
M1103,M1103-0119,Resource,CHW Pump Vertical Multistage 901-950 GPM,Nos,Equipments,HVAC,MEP
M1103,M1103-0120,Resource,CHW Pump Vertical Multistage 951-1000 GPM,Nos,Equipments,HVAC,MEP
M11,M1104,Class,Condensor Water Pump,,,,MEP
M1104,M1104-0001,Resource,Condensor Water Pump 1,Nos,Equipments,HVAC,MEP
M11,M1105,Class,CHW Pressurization Unit,,,,MEP
M1105,M1105-0001,Resource,"Pressurization Unit 0-5 GPM,8L Pr.Vessel Horizontal End Suction",Nos,Equipments,HVAC,MEP
M1105,M1105-0002,Resource,"Pressurization Unit 0-5 GPM,12L Pr.Vessel Horizontal End Suction",Nos,Equipments,HVAC,MEP
M1105,M1105-0003,Resource,"Pressurization Unit 0-5 GPM,19L Pr.Vessel Horizontal End Suction",Nos,Equipments,HVAC,MEP
M1105,M1105-0004,Resource,"Pressurization Unit 0-5 GPM,24L Pr.Vessel Horizontal End Suction",Nos,Equipments,HVAC,MEP
M1105,M1105-0005,Resource,"Pressurization Unit 0-5 GPM,35L Pr.Vessel Horizontal End Suction",Nos,Equipments,HVAC,MEP
M11,M1106,Class,Chemical Dosing Unit,,,,MEP
M1106,M1106-0001,Resource,Chemical Dosing Unit 1,Nos,Equipments,HVAC,MEP
M11,M1107,Class,Side Stream Filtration Unit,,,,MEP
M1107,M1107-0001,Resource,Side Stream Filtration Unit 1,Nos,Equipments,HVAC,MEP
M11,M1108,Class,Fresh Air Handling Unit (FAHU),,,,MEP
M1108,M110801,Class,FAHU DX,,,,MEP
M110801,M11080101,Class,FAHU + HP + HRW,,,,MEP
M11080101,M11080101-0001,Resource,FAHU+Heat Pipe 8967-9674L/s Heat Recovery Wheel+DX Coil,Nos,Equipments,HVAC,MEP
M11080101,M11080101-0002,Resource,FAHU+Heat Pipe 9675-11090L/s Heat Recovery Wheel+DX Coil,Nos,Equipments,HVAC,MEP
M11080101,M11080101-0003,Resource,FAHU+Heat Pipe 11091-12977L/s Heat Recovery Wheel+DX Coil,Nos,Equipments,HVAC,MEP
M11080101,M11080101-0004,Resource,FAHU+Heat Pipe 12978-17225L/s Heat Recovery Wheel+DX Coil,Nos,Equipments,HVAC,MEP
M11080101,M11080101-0005,Resource,FAHU+Heat Pipe 17226-23831L/s Heat Recovery Wheel+DX Coil,Nos,Equipments,HVAC,MEP
M11080101,M11080101-0006,Resource,FAHU+Heat Pipe 23832-26427L/s Heat Recovery Wheel+DX Coil,Nos,Equipments,HVAC,MEP
M1108,M11080102,Class,FAHU + HP + HE,,,,MEP
M11080102,M11080102-0002,Resource,FAHU + HP + HE +DX Coil,Nos,Equipments,HVAC,MEP
M1108,M11080103,Class,FAHU + HRW,,,,MEP
M11080103,M11080103-0003,Resource,FAHU + HRW +DX Coil,Nos,Equipments,HVAC,MEP
M1108,M11080104,Class,FAHU + HE,,,,MEP
M11080104,M11080104-0004,Resource,FAHU + HE +DX Coil,Nos,Equipments,HVAC,MEP
M1108,M11080105,Class,FAHU + HP,,,,MEP
M11080105,M11080105-0005,Resource,FAHU + HP +DX Coil,Nos,Equipments,HVAC,MEP
M1108,M110802,Class,FAHU CHW,,,,MEP
M110802,M11080201,Class,FAHU + HP + HRW,,,,MEP
M11080201,M11080201-0001,Resource,FAHU CHW+ HP + HRW + DX Coil,Nos,Equipments,HVAC,MEP
M110802,M11080202,Class,FAHU + HP + HE,,,,MEP
M11080202,M11080202-0001,Resource,FAHU CHW + HP + HE +DX Coil,Nos,Equipments,HVAC,MEP
M110802,M11080203,Class,FAHU + HRW,,,,MEP
M11080203,M11080203-0001,Resource,FAHU CHW + HRW +DX Coil,Nos,Equipments,HVAC,MEP
M110802,M11080204,Class,FAHU + HE,,,,MEP
M11080204,M11080204-0001,Resource,FAHU CHW + HE +DX Coil,Nos,Equipments,HVAC,MEP
M110802,M11080205,Class,FAHU + HP,,,,MEP
M11080205,M11080205-0001,Resource,FAHU CHW + HP +DX Coil,Nos,Equipments,HVAC,MEP
M11,M1109,Class,Air Handling Unit (AHU),,,,
M1109,M110901,Class,AHU DX,,,,
M110901,M110901-0001,Resource,AHU DX 01,Nos,Equipments,HVAC,MEP
M1109,M110902,Class,AHU CHW,,,,
M110902,M110902-0001,Resource,AHU CHW 01,Nos,Equipments,HVAC,MEP
M11,M1110,Class,Fan Coil Unit (FCU),,,,
M1110,M1110-0001,Resource,FCU Ducted Type 2345 CFM,Nos,Equipments,HVAC,MEP
M11,M1111,Class,Packaged Unit,,,,
M1111,M1111-0001,Resource,Packaged Unit 1,Nos,Equipments,HVAC,MEP
M11,M1112,Class,Condensing Unit,,,,
M1112,M1112-0001,Resource,Condensing Unit 1,Nos,Equipments,HVAC,MEP
M11,M1113,Class,Split AC Unit,,,,
M1113,M111301,Class,Decorative Split,,,,
M111301,M1113011,Class,Indoor Unit,,,,
M1113011,M11130111,Class,Wall Mounted,,,,
M11130111,M11130111-0001,Resource,Wall Mounted 1,Nos,Equipments,HVAC,MEP
M111301,M11130112,Class,Cassette,,,,
M11130112,M11130112-0001,Resource,Cassette 1,Nos,Equipments,HVAC,MEP
M111301,M11130113,Class,Free Standing,,,,
M11130113,M11130113-0001,Resource,Free Standing 1,Nos,Equipments,HVAC,MEP
M1113,M1113012,Class,Outdoor Unit,,,,
M1113012,M11130121,Class,Wall Mounted,,,,
M11130121,M11130121-0001,Resource,Wall Mounted 1,Nos,Equipments,HVAC,MEP
M1113,M11130122,Class,Cassette,,,,
M11130122,M11130122-0001,Resource,Cassette 1,Nos,Equipments,HVAC,MEP
M1113,M11140123,Class,Free Standing,,,,
M11140123,M11140123-0001,Resource,Free Standing 1,Nos,Equipments,HVAC,MEP
M11,M1114,Class,VRF,,,,
M1114,M111401,Resource,Decorative VRF,,,,
M111401,M1114011,Resource,Indoor Unit,,,,
M111401,M11140111,Resource,Wall Mounted,,,,
M11140111,M11140111-0001,Class,Wall Mounted 1,,,,
M1114,M11140122,Class,Cassette,,,,
M11140122,M11140122-0001,Resource,Cassette 1,Nos,Equipments,HVAC,MEP
M1114,M11140123,Class,Free Standing,,,,
M11140123,M11140123-0001,Resource,Free Standing 1,Nos,Equipments,HVAC,MEP
M11,M1115,Class,Window AC Unit,,,,
M1115,M1115-0001,Resource,Window unit 1,Nos,Equipments,HVAC,MEP
M11,M1116,Class,Closed Contol Unit,,,,
M1116,M1116-0001,Resource,CCU Up Flow Upto 353 L/s,Nos,Equipments,HVAC,MEP
M1116,M1116-0002,Resource,CCU Up Flow 354-556 L/s,Nos,Equipments,HVAC,MEP
M1116,M1116-0003,Resource,CCU Up Flow 557-825 L/s,Nos,Equipments,HVAC,MEP
M1116,M1116-0004,Resource,CCU Up Flow 826-1297 L/s,Nos,Equipments,HVAC,MEP
M1116,M1116-0005,Resource,CCU Up Flow 1298-1769 L/s,Nos,Equipments,HVAC,MEP
M1116,M1116-0006,Resource,CCU Up Flow 1770-2477 L/s,Nos,Equipments,HVAC,MEP
M11,M1117,Class,Fans,,,,
M1117,M111701,Class,Ducted Fans,,,,
M111701,M111701-0001,Resource,Ducted Fans,Nos,Equipments,HVAC,MEP
M1117,M111702,Class,Wall / Window Mounted Fans,,,,
M111702,M111702-0001,Resource,Wall / Window Mounted Fans,Nos,Equipments,HVAC,MEP
M11,M1118,Class,Ecology Unit & Electrostatic Precipitator,,,,
M1118,M1118-0001,Resource,Ecology Unit & Electrostatic Precipitator 1,Nos,Equipments,HVAC,MEP
M11,M1119,Class,VAV / CAV,,,,
M1119,M111901-0001,Resource,VAV1,Nos,Equipments,HVAC,MEP
M11,M111902,Class,CAV,,,,
M111902,M111902-0001,Resource,CAV1,Nos,Equipments,HVAC,MEP
M11,M1120,Class,AC Controls & Accessories,,,,
M1120,M112001,Class,Building Management System,,,,
M112001,M112001-0001,Resource,Building Management System 1,Nos,Equipments,HVAC,MEP
M1120,M112002,Class,Co2 System,,,,
M112002,M112002-0001,Resource,Co2 System 1,Nos,Equipments,HVAC,MEP
M1120,M112003,Class,Room Pressure Monitoring System,,,,
M112003,M112003-0001,Resource,Room Pressure Monitoring System 1,Nos,Equipments,HVAC,MEP
M1120,M112004,Class,Control Panel,,,,
M112004,M112004-0001,Resource,Control Panel 1,Nos,Equipments,HVAC,MEP
M1120,M112005,Class,Thermostat,,,,
M112005,M112005-0001,Resource,Thermostat 1,Nos,Equipments,HVAC,MEP
M1120,M112006,Class,Field Devices,,,,
M112006,M112006-0001,Resource,Field Devices 1,Nos,Equipments,HVAC,MEP
M11,M112007,Class,Control valves,,,,
M112007,M1120071-0001,Resource,PICV 1,Nos,Equipments,HVAC,MEP
M112007,M1120072-0001,Resource,2 Way on/off Control Valves 1,Nos,Equipments,HVAC,MEP
M112007,M1120073-0001,Resource,2 Way Modulating Control Valves 1,Nos,Equipments,HVAC,MEP
M112007,M1120074-0001,Resource,3 Way on/off Control Valves 1,Nos,Equipments,HVAC,MEP
M112007,M1120075-0001,Resource,3 Way Modulating Control Valves 1,Nos,Equipments,HVAC,MEP
HVAC,M12,Class,Ducting,,,,
M12,M1201,Class,Duct ,,,,
M1201,M120101,Class,GI Duct,,,,
M120101,M120101-0001,Resource,GI Duct 0.56mm Thick,Nos,Equipments,HVAC,MEP
M120101,M120101-0002,Resource,GI Duct 0.6mm Thick,Nos,Equipments,HVAC,MEP
M120101,M120101-0003,Resource,GI Duct 0.7mm Thick,Nos,Equipments,HVAC,MEP
M120101,M120101-0004,Resource,GI Duct 0.8mm Thick,Nos,Equipments,HVAC,MEP
M120101,M120101-0005,Resource,GI Duct 0.85mm Thick,Nos,Equipments,HVAC,MEP
M120101,M120101-0006,Resource,GI Duct 0.9mm Thick,Nos,Equipments,HVAC,MEP
M120101,M120101-0007,Resource,GI Duct 1.0mm Thick,Nos,Equipments,HVAC,MEP
M120101,M120101-0008,Resource,GI Duct 1.1mm Thick,Nos,Equipments,HVAC,MEP
M120101,M120101-0009,Resource,GI Duct 1.2mm Thick,Nos,Equipments,HVAC,MEP
