[gd_scene load_steps=4 format=2]

[ext_resource path="res://Assets/Familiar Looking Rocket.png" type="Texture" id=1]
[ext_resource path="res://Scripts/Script_GameClear.gd" type="Script" id=2]

[sub_resource type="RectangleShape2D" id=1]
extents = Vector2( 155.709, 242.079 )

[node name="Finish_Rocket" type="Sprite"]
texture = ExtResource( 1 )
script = ExtResource( 2 )

[node name="Area2D" type="Area2D" parent="."]

[node name="CollisionShape2D" type="CollisionShape2D" parent="Area2D"]
shape = SubResource( 1 )
[connection signal="body_entered" from="Area2D" to="." method="_on_Area2D_body_entered"]
