[gd_resource type="DynamicFont" load_steps=2 format=2]

[ext_resource path="res://Assets/Fonts/Taken_From_T5/continuum bold.ttf" type="DynamicFontData" id=1]

[resource]
size = 30
outline_color = Color( 0.933333, 0.156863, 0.156863, 1 )
extra_spacing_top = 4
font_data = ExtResource( 1 )
