[gd_scene load_steps=5 format=2]

[ext_resource path="res://Assets/Fonts/karmatic_arcade_120.tres" type="DynamicFont" id=1]
[ext_resource path="res://Assets/Fonts/boycott.tres" type="DynamicFont" id=2]
[ext_resource path="res://Assets/Fonts/data_control_begin.tres" type="DynamicFont" id=3]
[ext_resource path="res://Scripts/Script_LinkButton.gd" type="Script" id=4]

[node name="ColorRect" type="ColorRect"]
anchor_right = 1.0
anchor_bottom = 1.0
color = Color( 0.509804, 0.0627451, 0.0627451, 1 )

[node name="Title" type="Label" parent="."]
margin_top = 75.0
margin_right = 1024.0
margin_bottom = 90.0
custom_fonts/font = ExtResource( 1 )
text = "GAME OVER"
align = 1

[node name="Dead" type="Label" parent="."]
margin_top = 259.0
margin_right = 1024.0
margin_bottom = 380.0
custom_fonts/font = ExtResource( 2 )
text = "Kamu Telah Dikalahkan Oleh Sebuah Slime..."
align = 1

[node name="Back To Menu" type="LinkButton" parent="."]
margin_left = 310.0
margin_top = 436.0
margin_right = 731.001
margin_bottom = 515.0
custom_fonts/font = ExtResource( 3 )
text = "back to menu"
underline = 1
script = ExtResource( 4 )
scene_to_load = "MainMenu"
[connection signal="pressed" from="Back To Menu" to="Back To Menu" method="_on_Button_pressed"]
