[gd_scene load_steps=2 format=2]

[sub_resource type="SpatialMaterial" id=1]
albedo_color = Color( 0.898039, 0.0666667, 0.0666667, 1 )

[node name="Lamp" type="CSGCombiner"]
use_collision = true

[node name="CSGCylinder" type="CSGCylinder" parent="."]
height = 1.1968
cone = true

[node name="CSGCylinder2" type="CSGCylinder" parent="."]
transform = Transform( 1, 0, 0, 0, 1, 0, 0, 0, 1, 0, 0.98118, 0 )
radius = 0.209
height = 2.604

[node name="CSGPolygon" type="CSGPolygon" parent="."]
transform = Transform( 1, 0, 0, 0, 1, 0, 0, 0, 1, -0.0702452, 2.10946, -0.04725 )
invert_faces = true
polygon = PoolVector2Array( 0, 0, 0.173202, 0.820816, 0.739601, 0.783973, 1, 0 )
mode = 1
spin_degrees = 360.0
spin_sides = 8
material = SubResource( 1 )
