S#0#2020-08-27 18:05:04.396#msop_pvo#5D4838810EB1E419099D20F81642BFB8#1#USUARIO#1#1#1#1#ES#9999#127.0.0.1#OK######
S#0#2020-08-27 18:13:35.746#msop_pvo#40F39AC9447B79F7CC82D66D07FEE9E7#1#USUARIO#1#1#1#1#ES#9999#127.0.0.1#OK######
S#0#2020-08-28 12:50:49.980#msop_pvo#1CB2A5FCCCE13A6286BD7F57CD40B39D#1#USUARIO#1#1#1#1#ES#9999#127.0.0.1#OK######
S#0#2020-08-28 13:25:43.574#msop_pvo#337BCD6A707B6EB077E5CE7D67736558#1#USUARIO#1#1#1#1#ES#9999#127.0.0.1#OK######
S#1#2020-08-28 13:38:23.011#msop_pvo#337BCD6A707B6EB077E5CE7D67736558#########
S#0#2020-08-28 13:47:29.087#msop_pvo#9682E777D7B62FA119E27034456F4366#1#USUARIO#1#1#1#1#ES#9999#127.0.0.1#OK######
S#0#2020-08-28 13:58:08.504#msop_pvo#771256BAC53B7865B35D843BDC9D0F3C#1#USUARIO#1#1#1#1#ES#9999#127.0.0.1#OK######
S#1#2020-08-28 14:10:19.560#msop_pvo#771256BAC53B7865B35D843BDC9D0F3C#########
S#0#2020-09-17 13:12:10.283#msop_pvo#C71C684AEF79297E9E3033F10285803B#1#USUARIO#1#1#1#1#ES#9999#127.0.0.1#OK######
S#0#2020-09-17 13:22:51.682#msop_pvo#DF4F02327EC06C711FB172CA0E005E5A#1#USUARIO#1#1#1#1#ES#9999#127.0.0.1#OK######
S#1#2020-09-17 13:34:45.019#msop_pvo#DF4F02327EC06C711FB172CA0E005E5A#########
S#0#2020-09-17 13:38:34.005#msop_pvo#1A1C78CF31B0F80D44D4475FA758CD22#1#USUARIO#1#1#1#1#ES#9999#127.0.0.1#OK######
S#0#2020-09-17 13:50:56.980#msop_pvo#4C9EDD65DA8731924D40A11BB024C5D0#1#USUARIO#1#1#1#1#ES#9999#127.0.0.1#OK######
S#0#2020-09-17 14:04:38.667#msop_pvo#BEDDE4D648B0D9367985245ECB7C65E0#1#USUARIO#1#1#1#1#ES#9999#127.0.0.1#OK######
S#0#2020-09-17 14:16:05.656#msop_pvo#5918B7D0DEE17313F7BEFC668A5A78CE#1#USUARIO#1#1#1#1#ES#9999#127.0.0.1#OK######
S#0#2020-09-17 16:11:53.885#msop_pvo#300D005714D2A3F9A6FFAAFC80E8CE4C#1#USUARIO#1#1#1#1#ES#9999#127.0.0.1#OK######
S#1#2020-09-17 16:24:07.869#msop_pvo#300D005714D2A3F9A6FFAAFC80E8CE4C#########
S#0#2020-09-17 16:30:20.319#msop_pvo#A8241863CDA952A99238CC4AC382645E#1#USUARIO#1#1#1#1#ES#9999#127.0.0.1#OK######
S#1#2020-09-17 16:42:31.293#msop_pvo#A8241863CDA952A99238CC4AC382645E#########
S#0#2020-09-17 17:43:16.777#msop_pvo#78B648FFC27E5EF1112AA286C6B352D7#1#USUARIO#1#1#1#1#ES#9999#127.0.0.1#OK######
S#0#2020-09-17 17:49:31.008#msop_pvo#33D947CDB67A631F1AE5AF49EC908207#1#USUARIO#1#1#1#1#ES#9999#127.0.0.1#OK######
S#1#2020-09-17 17:59:42.104#msop_pvo#33D947CDB67A631F1AE5AF49EC908207#########
