"goobay 5V 2,5A:",,,,,,,,,,,,,,,,,,,,,,,,,,,,,,,,,,,,,,,,,,,,,,,,,,,,,,,,,,,,,,,,,,,,,,,,,,,,,,,,,,,,,,,,,,,,,,,,,,,,,,,,,,,,,,,,,,,,,,,,,,,,,,,,,,,,,,,,,,,,,,,,,,,,,,,,,,,,,,,,,,,,,,,,,,,,,,,,,,,,,,,,,,,,,,,,,,,,,,,,,,,,,,,,,,,,,,,,,,,,,,,,,,,,,,,,,,,,,,,,,,,,,,,,,,,,,,,,,,,,,,,,,,,,,,,,,,,,,,,,,,,,,,,,,,,,,,,,,,,,,,,,,,,,,,,,,,,,,,,,,,,,,,,,,,,,,,,,,,,,,,,,,,,,,,,,,,,,,,,,,,,,,,,,,,,,,,,,,,,,,,,,,,,,,,,,,,,,,,,,,,,,,,,,,,,,,,,,,,,,,,,,,,,,,,,,,,,,,,,,,,,,,,,,,,,,,,,,,,,,,,,,,,,,,,,,,,,,,,,,,,,,,,,,,,,,,,,,,,,,,,,,,,,,,,,,,,,,,,,,,,,,,,,,,,,,,,,,,,,,,,,,,,,,,,,,,,,,,,,,,,,,,,,,,,,,,,,,,,,,,,,,,,,,,,,,,,,,,,,,,,,,,,,,,,,,,,,,,,,,,,,,,,,,,,,,,,,,,,,,,,,,,,,,,,,,,,,,,,,,,,,,,,,,,,,,,,,,,,,,,,,,,,,,,,,,,,,,,,,,,,,,,,,,,,,,,,,,,,,,,,,,,,,,,,,,,,,,,,,,,,,,,,,,,,,,,,,,,,,,,,,,,,,,,,,,,,,,,,,,,,,,,,,,,,,,,,,,,,,,,,,,,,,,,,,,,,,,,,,,,,,,,,,,,,,,,,,,,,,,,,,,,,,,,,,,,,,,,,,,,,,,,,,,,,,,,,,,,,,,,,,,,,,,,,,,,,,,,,,,,,,,,,,,,,,,,,,,,,,,,,,,,,,,,,,,,,,,,,,,,,,,,,,,,,,,,,,,,,,,,,,,,,,,,,,,,,,,,,,,,,,,,,,,,,,,,,,,,,,,,,,,,,,,,,,,,,,,,,,,,,,
cpuFrequency,600.064,1200,600,1200,1200,1200,600,600,1200,600,1200,600,1200,599.998,600,600,1200.002,600,1200,600,1200,600,1200,600,1200,1200,1200.002,600,1200,600,1200,1200,1200,600,1200,600,1200,600,1200,599.998,1200,600,600,600,1200,600,1200,1200,600,600,1200,600,1200,600,1200,600,1200,1200,600,600,1200,1200,600,600,1199.998,1200,600,1200,600,1200,600,1200,600,1200,600,1200,1200,1200,1200,1200,1200.002,1200,1200,1200,1200,1200,1200,1200,1200,1200,1200,1200,1200,1200,1200,1200,1200,1200,1200,1200,1200,1200.002,1200,1200.002,1199.998,1200.002,1195,1200,1195,1195,1195,1141,1141,1141,1141,1141,1141.002,1087,1087,1141,1141,1140.998,1141,1087,1034,1087,1141,1034,1087,1033.998,1141,1087,1034,1034,1034,1034,1034,1034,1034,1087,1034,1034,1034,980,1034,1033.998,1034,1034,1034,1033.998,1034,1034,1034,980,980,980,980,1034,1034,980,979.998,980,980,926,1034,980,980,979.998,980,980,980,980,926,1034,980,926,926,1033.998,980,980,926,980.002,980,980,980,1034,980,926,926,926,980,980,926,926,980,926,926,925.998,926,980,926,926,980,926,926,980,926,980,926,926,926,926,980,980,926,926,980,926,926,1200,600,1200,600,1200,600,1200,600,1200,1200,600,600,1200,1200,600,600.002,1200,1199.998,600,1200,1200,1200,600,1200,600,1200,600,1200,600,1200,600,1200,600,1200,599.998,1200,1199.998,1200,600,1200,600,600,600,1200,600,1200,600,1200,600,1200,599.998,1200,600,1200.002,600,1200,600.002,1200,1200,600.002,600.002,1200.002,1199.998,600,1199.998,600,1200,600,1200,600,600,1199.998,600,600,,,,,,,,,,,,,,,,,,,,,,,,,,,,,,,,,,,,,,,,,,,,,,,,,,,,,,,,,,,,,,,,,,,,,,,,,,,,,,,,,,,,,,,,,,,,,,,,,,,,,,,,,,,,,,,,,,,,,,,,,,,,,,,,,,,,,,,,,,,,,,,,,,,,,,,,,,,,,,,,,,,,,,,,,,,,,,,,,,,,,,,,,,,,,,,,,,,,,,,,,,,,,,,,,,,,,,,,,,,,,,,,,,,,,,,,,,,,,,,,,,,,,,,,,,,,,,,,,,,,,,,,,,,,,,,,,,,,,,,,,,,,,,,,,,,,,,,,,,,,,,,,,,,,,,,,,,,,,,,,,,,,,,,,,,,,,,,,,,,,,,,,,,,,,,,,,,,,,,,,,,,,,,,,,,,,,,,,,,,,,,,,,,,,,,,,,,,,,,,,,,,,,,,,,,,,,,,,,,,,,,,,,,,,,,,,,,,,,,,,,,,,,,,,,,,,,,,,,,,,,,,,,,,,,,,,,,,,,,,,,,,,,,,,,,,,,,,,,,,,,,,,,,,,,,,,,,,,,,,,,,,,,,,,,,,,,,,,,,,,,,,,,,,,,,,,,,,,,,,,,,,,,,,,,,,,,,,,,,,,,,,,,,,,,,,,,,,,,,,,,,,,,,,,,,,,,,,,,,,,,,,,,,,,,,,,,,,,,,,,,,,,,,,,,,,,,,,,,,,,,,,,,,,,,,,,,,,,,,,,,,,,,,,,,,,,,,,,,,,,,,,,,,,,,,,,,,,,,,,,,,,,,,,,,,
temperature:,56.4,56.4,55.8,55.8,56.4,55.8,56.9,56.4,56.9,55.8,56.4,55.8,56.9,55.8,55.8,55.3,55.8,52.6,46.2,46.2,48.3,49.9,51.5,52.1,53.2,53.7,54.2,54.8,54.8,54.8,55.3,55.3,55.3,55.8,55.8,55.3,55.8,55.8,55.8,55.8,55.8,54.8,55.8,55.8,55.8,56.4,56.4,55.8,55.8,55.8,55.8,56.4,55.8,55.8,55.8,55.8,56.4,56.9,55.8,55.8,55.8,55.8,55.8,56.4,56.4,55.8,55.8,55.8,55.8,56.9,56.4,56.4,55.8,55.8,55.8,61.8,64.5,66.6,67.7,69.8,70.9,71.4,72.5,73.1,73.6,74.1,75.2,75.2,76.3,76.8,76.8,77.4,77.9,77.9,78.4,78.4,67.1,66.6,73.6,75.2,76.3,77.9,77.9,78.4,79,79,79.5,79.5,80.6,80.6,80.1,80.6,80.6,80.6,80.6,81.1,81.1,80.6,81.1,80.6,80.6,81.7,81.1,81.1,80.6,81.1,81.7,81.7,81.1,81.7,81.1,81.7,81.1,81.1,81.7,81.7,81.7,81.1,81.7,82.2,81.7,81.1,82.2,81.7,82.2,81.7,81.7,81.7,81.7,82.2,81.7,82.2,81.7,82.2,81.7,81.7,81.7,82.2,82.2,82.2,81.7,81.7,81.7,82.2,81.7,81.7,81.7,82.7,81.7,81.7,82.2,82.2,82.2,81.7,82.2,82.2,82.7,82.2,82.7,82.7,82.2,82.7,82.2,82.7,81.7,82.2,82.7,82.2,82.2,82.7,82.2,82.7,82.7,81.7,82.2,82.7,82.7,82.7,82.7,82.7,82.7,82.7,82.2,82.7,82.7,82.7,82.2,82.2,82.7,81.7,82.7,82.2,82.2,82.7,82.7,82.2,82.7,82.7,82.7,78.4,75.8,75.2,73.1,73.1,71.4,69.8,69.8,69.3,68.8,67.7,67.7,67.7,67.7,66.6,66.6,65.5,66.6,66.6,65.5,65.5,65.5,65,65.5,65.5,65.5,64.5,65,64.5,64.5,65,64.5,63.9,63.4,63.4,63.9,63.4,63.9,63.4,63.4,62.8,63.4,62.8,63.4,62.3,62.8,62.3,62.3,62.8,62.8,62.8,62.3,61.8,62.3,62.3,62.3,62.3,61.8,61.8,61.2,62.3,61.8,62.3,61.8,61.8,61.8,61.2,61.8,61.8,61.2,60.7,60.7,61.2,60.7,56.4,56.4,55.8,55.8,56.4,55.8,56.9,56.4,56.9,55.8,56.4,55.8,56.9,55.8,55.8,55.3,55.8,52.6,46.2,46.2,48.3,49.9,51.5,52.1,53.2,53.7,54.2,54.8,54.8,54.8,55.3,55.3,55.3,55.8,55.8,55.3,55.8,55.8,55.8,55.8,55.8,54.8,55.8,55.8,55.8,56.4,56.4,55.8,55.8,55.8,55.8,56.4,55.8,55.8,55.8,55.8,56.4,56.9,55.8,55.8,55.8,55.8,55.8,56.4,56.4,55.8,55.8,55.8,55.8,56.9,56.4,56.4,55.8,55.8,55.8,61.8,64.5,66.6,67.7,69.8,70.9,71.4,72.5,73.1,73.6,74.1,75.2,75.2,76.3,76.8,76.8,77.4,77.9,77.9,78.4,78.4,67.1,66.6,73.6,75.2,76.3,77.9,77.9,78.4,79,79,79.5,79.5,80.6,80.6,80.1,80.6,80.6,80.6,80.6,81.1,81.1,80.6,81.1,80.6,80.6,81.7,81.1,81.1,80.6,81.1,81.7,81.7,81.1,81.7,81.1,81.7,81.1,81.1,81.7,81.7,81.7,81.1,81.7,82.2,81.7,81.1,82.2,81.7,82.2,81.7,81.7,81.7,81.7,82.2,81.7,82.2,81.7,82.2,81.7,81.7,81.7,82.2,82.2,82.2,81.7,81.7,81.7,82.2,81.7,81.7,81.7,82.7,81.7,81.7,82.2,82.2,82.2,81.7,82.2,82.2,82.7,82.2,82.7,82.7,82.2,82.7,82.2,82.7,81.7,82.2,82.7,82.2,82.2,82.7,82.2,82.7,82.7,81.7,82.2,82.7,82.7,82.7,82.7,82.7,82.7,82.7,82.2,82.7,82.7,82.7,82.2,82.2,82.7,81.7,82.7,82.2,82.2,82.7,82.7,82.2,82.7,82.7,82.7,78.4,75.8,75.2,73.1,73.1,71.4,69.8,69.8,69.3,68.8,67.7,67.7,67.7,67.7,66.6,66.6,65.5,66.6,66.6,65.5,65.5,65.5,65,65.5,65.5,65.5,64.5,65,64.5,64.5,65,64.5,63.9,63.4,63.4,63.9,63.4,63.9,63.4,63.4,62.8,63.4,62.8,63.4,62.3,62.8,62.3,62.3,62.8,62.8,62.8,62.3,61.8,62.3,62.3,62.3,62.3,61.8,61.8,61.2,62.3,61.8,62.3,61.8,61.8,61.8,61.2,61.8,61.8,61.2,60.7,60.7,61.2,60.7,56.4,56.4,55.8,55.8,56.4,55.8,56.9,56.4,56.9,55.8,56.4,55.8,56.9,55.8,55.8,55.3,55.8,52.6,46.2,46.2,48.3,49.9,51.5,52.1,53.2,53.7,54.2,54.8,54.8,54.8,55.3,55.3,55.3,55.8,55.8,55.3,55.8,55.8,55.8,55.8,55.8,54.8,55.8,55.8,55.8,56.4,56.4,55.8,55.8,55.8,55.8,56.4,55.8,55.8,55.8,55.8,56.4,56.9,55.8,55.8,55.8,55.8,55.8,56.4,56.4,55.8,55.8,55.8,55.8,56.9,56.4,56.4,55.8,55.8,55.8,61.8,64.5,66.6,67.7,69.8,70.9,71.4,72.5,73.1,73.6,74.1,75.2,75.2,76.3,76.8,76.8,77.4,77.9,77.9,78.4,78.4,67.1,66.6,73.6,75.2,76.3,77.9,77.9,78.4,79,79,79.5,79.5,80.6,80.6,80.1,80.6,80.6,80.6,80.6,81.1,81.1,80.6,81.1,80.6,80.6,81.7,81.1,81.1,80.6,81.1,81.7,81.7,81.1,81.7,81.1,81.7,81.1,81.1,81.7,81.7,81.7,81.1,81.7,82.2,81.7,81.1,82.2,81.7,82.2,81.7,81.7,81.7,81.7,82.2,81.7,82.2,81.7,82.2,81.7,81.7,81.7,82.2,82.2,82.2,81.7,81.7,81.7,82.2,81.7,81.7,81.7,82.7,81.7,81.7,82.2,82.2,82.2,81.7,82.2,82.2,82.7,82.2,82.7,82.7,82.2,82.7,82.2,82.7,81.7,82.2,82.7,82.2,82.2,82.7,82.2,82.7,82.7,81.7,82.2,82.7,82.7,82.7,82.7,82.7,82.7,82.7,82.2,82.7,82.7,82.7,82.2,82.2,82.7,81.7,82.7,82.2,82.2,82.7,82.7,82.2,82.7,82.7,82.7,78.4,75.8,75.2,73.1,73.1,71.4,69.8,69.8,69.3,68.8,67.7,67.7,67.7,67.7,66.6,66.6,65.5,66.6,66.6,65.5,65.5,65.5,65,65.5,65.5,65.5,64.5,65,64.5,64.5,65,64.5,63.9,63.4,63.4,63.9,63.4,63.9,63.4,63.4,62.8,63.4,62.8,63.4,62.3,62.8,62.3,62.3,62.8,62.8,62.8,62.3,61.8,62.3,62.3,62.3,62.3,61.8,61.8,61.2,62.3,61.8,62.3,61.8,61.8,61.8,61.2,61.8,61.8,61.2,60.7,60.7,61.2,60.7,56.4,56.4,55.8,55.8,56.4,55.8,56.9,56.4,56.9,55.8,56.4,55.8,56.9,55.8,55.8,55.3,55.8,52.6,46.2,46.2,48.3,49.9,51.5,52.1,53.2,53.7,54.2,54.8,54.8,54.8,55.3,55.3,55.3,55.8,55.8,55.3,55.8,55.8,55.8,55.8,55.8,54.8,55.8,55.8,55.8,56.4,56.4,55.8,55.8,55.8,55.8,56.4,55.8,55.8,55.8,55.8,56.4,56.9,55.8,55.8,55.8,55.8,55.8,56.4,56.4,55.8,55.8,55.8,55.8,56.9,56.4,56.4,55.8,55.8,55.8,61.8,64.5,66.6,67.7,69.8,70.9,71.4,72.5,73.1,73.6,74.1,75.2,75.2,76.3,76.8,76.8,77.4,77.9,77.9,78.4,78.4,67.1,66.6,73.6,75.2,76.3,77.9,77.9,78.4,79,79,79.5,79.5,80.6,80.6,80.1,80.6,80.6,80.6,80.6,81.1,81.1,80.6,81.1,80.6,80.6,81.7,81.1,81.1,80.6,81.1,81.7,81.7,81.1,81.7,81.1,81.7,81.1,81.1,81.7,81.7,81.7,81.1,81.7,82.2,81.7,81.1,82.2,81.7
time:,0,2.0430634021759,4.0611412525177,6.08889389038086,8.10684871673584,10.1240530014038,12.1439349651337,14.1723763942719,16.2021059989929,18.2197334766388,20.2491343021393,22.2667925357819,24.2956039905548,26.3139333724976,28.3432157039642,30.3726329803467,32.4025659561157,34.4237823486328,36.4529547691345,38.4717869758606,40.5016806125641,42.5203216075897,44.5496225357056,46.567569732666,48.5974223613739,50.6157732009888,52.6340594291687,54.6526556015015,56.6813418865204,58.699893951416,60.7336041927338,62.7510251998901,64.7692756652832,66.7870237827301,68.8152136802673,70.8335354328156,72.8626747131348,74.8804869651795,76.909895658493,78.929324388504,80.9606263637543,82.9784367084503,85.007173538208,87.0372214317322,89.0633316040039,91.0825731754303,93.1113057136536,95.1472346782684,97.1654121875763,99.1958708763123,101.225579023361,103.244912862778,105.274403810501,107.307671070099,109.336863040924,111.37109375,113.400277853012,115.419087409973,117.436378002167,119.478282690048,121.511415243149,123.543177127838,125.561918973923,127.592016935349,129.62092924118,131.648842573166,133.667221069336,135.7039539814,137.722374916077,139.7514564991,141.770483970642,143.807866096497,145.825715780258,147.874282598495,149.892668485641,151.932218074799,154.018209695816,156.097846269608,158.177874326706,160.267795562744,162.35781621933,164.438061714172,166.518124341965,168.588093757629,170.66806936264,172.747773885727,174.838358640671,176.911116123199,178.987806797028,181.061308145523,183.157283306122,185.247876644135,187.337845563889,189.428703069687,191.507836580276,193.588299036026,195.667746305466,197.748089313507,199.827767372131,201.927868843079,204.007815599442,206.088629722595,208.188742160797,210.277931451797,212.367989063263,214.448360919952,216.537862539291,218.618182182312,220.697799682617,222.79834318161,224.887824296951,226.978365182877,229.081339597702,231.165157556534,233.240647315979,235.317858934402,237.387836694717,239.448203086853,241.517877578735,243.590728282928,245.687974452972,247.757841587067,249.839190721512,251.927915811539,253.997848510742,256.078256130218,258.153203725815,260.238333702087,262.328393697739,264.407913923264,266.497842073441,268.598560810089,270.688955545425,272.764405727386,274.84824180603,276.942530155182,279.018727064133,281.119141101837,283.208950281143,285.278345584869,287.367834806442,289.447910547256,291.527820825577,293.609333753586,295.691210269928,297.777868747711,299.858290195465,301.957953691483,304.020638227463,306.098038196564,308.178290367126,310.264246225357,312.328288078308,314.412239789963,316.478460073471,318.568316698074,320.640281438828,322.763333320618,324.847883701324,326.92822265625,329.019460201263,331.090309381485,333.16809463501,335.247878313065,337.328382015228,339.417879343033,341.508336544037,343.619435548782,345.698324680328,347.7955327034,349.888313055038,351.979286193848,354.068316698074,356.149410963058,358.227997303009,360.30845618248,362.38839673996,364.468410253525,366.547993898392,368.63840341568,370.728437423706,372.818430900574,374.917445898056,376.987112522125,379.075651168823,381.168388843536,383.258413314819,385.348955631256,387.425184488296,389.509034156799,391.598972558975,393.688902378082,395.778965950012,397.869100809097,399.969016551971,402.049010753632,404.12912940979,406.220234155655,408.315129041672,410.402706861496,412.482814788818,414.569470643997,416.648376226425,418.73937869072,420.828248262405,422.938366651535,425.018870592117,427.098383665085,429.17803144455,431.248900651932,433.328807592392,435.428537368774,437.55245256424,439.638835668564,441.728896141052,443.803016662598,445.889620780945,447.968302488327,450.038589239121,452.072729587555,454.090981483459,456.118942022324,458.136565208435,460.165280103684,462.185635328293,464.215067625046,466.233202695847,468.261345624924,470.279323339462,472.29771900177,474.33540558815,476.364159345627,478.382434606552,480.419417619705,482.448710203171,484.477253913879,486.494845867157,488.513037919998,490.54194355011,492.560495138168,494.595129966736,496.613149642944,498.641996145248,500.660018444061,502.701023340225,504.718879461288,506.76738357544,508.784927606583,510.814095973969,512.832947254181,514.861609458923,516.880096435547,518.908801794052,520.926037311554,522.954658508301,524.97230386734,526.990412712097,529.00890660286,531.038059711456,533.055599451065,535.085271596909,537.114023923874,539.144055604935,541.161014318466,543.188093900681,545.204806089401,547.232070446014,549.248799562454,551.277552843094,553.295216083527,555.323723316193,557.341860532761,559.370183467865,561.389157772064,563.418779373169,565.437786817551,567.467848539352,569.485643625259,571.503530502319,573.537260293961,575.556877374649,577.578807830811,579.596683740616,581.627195596695,583.644663333893,585.674626111984,587.692812204361,589.72531747818,591.743873357773,593.77378821373,595.802172183991,597.825263977051,599.851637840271,,,,,,,,,,,,,,,,,,,,,,,,,,,,,,,,,,,,,,,,,,,,,,,,,,,,,,,,,,,,,,,,,,,,,,,,,,,,,,,,,,,,,,,,,,,,,,,,,,,,,,,,,,,,,,,,,,,,,,,,,,,,,,,,,,,,,,,,,,,,,,,,,,,,,,,,,,,,,,,,,,,,,,,,,,,,,,,,,,,,,,,,,,,,,,,,,,,,,,,,,,,,,,,,,,,,,,,,,,,,,,,,,,,,,,,,,,,,,,,,,,,,,,,,,,,,,,,,,,,,,,,,,,,,,,,,,,,,,,,,,,,,,,,,,,,,,,,,,,,,,,,,,,,,,,,,,,,,,,,,,,,,,,,,,,,,,,,,,,,,,,,,,,,,,,,,,,,,,,,,,,,,,,,,,,,,,,,,,,,,,,,,,,,,,,,,,,,,,,,,,,,,,,,,,,,,,,,,,,,,,,,,,,,,,,,,,,,,,,,,,,,,,,,,,,,,,,,,,,,,,,,,,,,,,,,,,,,,,,,,,,,,,,,,,,,,,,,,,,,,,,,,,,,,,,,,,,,,,,,,,,,,,,,,,,,,,,,,,,,,,,,,,,,,,,,,,,,,,,,,,,,,,,,,,,,,,,,,,,,,,,,,,,,,,,,,,,,,,,,,,,,,,,,,,,,,,,,,,,,,,,,,,,,,,,,,,,,,,,,,,,,,,,,,,,,,,,,,,,,,,,,,,,,,,,,,,,,,,,,,,,,,,,,,,,,,,,,,,,,,,,,,,,,,,,,,,,,,,,,,,,,,,,,,,,
,,,,,,,,,,,,,,,,,,,,,,,,,,,,,,,,,,,,,,,,,,,,,,,,,,,,,,,,,,,,,,,,,,,,,,,,,,,,,,,,,,,,,,,,,,,,,,,,,,,,,,,,,,,,,,,,,,,,,,,,,,,,,,,,,,,,,,,,,,,,,,,,,,,,,,,,,,,,,,,,,,,,,,,,,,,,,,,,,,,,,,,,,,,,,,,,,,,,,,,,,,,,,,,,,,,,,,,,,,,,,,,,,,,,,,,,,,,,,,,,,,,,,,,,,,,,,,,,,,,,,,,,,,,,,,,,,,,,,,,,,,,,,,,,,,,,,,,,,,,,,,,,,,,,,,,,,,,,,,,,,,,,,,,,,,,,,,,,,,,,,,,,,,,,,,,,,,,,,,,,,,,,,,,,,,,,,,,,,,,,,,,,,,,,,,,,,,,,,,,,,,,,,,,,,,,,,,,,,,,,,,,,,,,,,,,,,,,,,,,,,,,,,,,,,,,,,,,,,,,,,,,,,,,,,,,,,,,,,,,,,,,,,,,,,,,,,,,,,,,,,,,,,,,,,,,,,,,,,,,,,,,,,,,,,,,,,,,,,,,,,,,,,,,,,,,,,,,,,,,,,,,,,,,,,,,,,,,,,,,,,,,,,,,,,,,,,,,,,,,,,,,,,,,,,,,,,,,,,,,,,,,,,,,,,,,,,,,,,,,,,,,,,,,,,,,,,,,,,,,,,,,,,,,,,,,,,,,,,,,,,,,,,,,,,,,,,,,,,,,,,,,,,,,,,,,,,,,,,,,,,,,,,,,,,,,,,,,,,,,,,,,,,,,,,,,,,,,,,,,,,,,,,,,,,,,,,,,,,,,,,,,,,,,,,,,,,,,,,,,,,,,,,,,,,,,,,,,,,,,,,,,,,,,,,,,,,,,,,,,,,,,,,,,,,,,,,,,,,,,,,,,,,,,,,,,,,,,,,,,,,,,,,,,,,,,,,,,,,,,,,,,,,,,,,,,,,,,,,,,,,,,,,,,,,,,,,,,,,,,,,,,,,,,,,,,,,,,,,,,,,,,,,,,,,,,,,,,,,,,,,,,,,,,,,,,,,,,,,,,,,,,,,,,,,,,,,,,,,,,,,,,
"Deltaco 5V 2,4A:",,,,,,,,,,,,,,,,,,,,,,,,,,,,,,,,,,,,,,,,,,,,,,,,,,,,,,,,,,,,,,,,,,,,,,,,,,,,,,,,,,,,,,,,,,,,,,,,,,,,,,,,,,,,,,,,,,,,,,,,,,,,,,,,,,,,,,,,,,,,,,,,,,,,,,,,,,,,,,,,,,,,,,,,,,,,,,,,,,,,,,,,,,,,,,,,,,,,,,,,,,,,,,,,,,,,,,,,,,,,,,,,,,,,,,,,,,,,,,,,,,,,,,,,,,,,,,,,,,,,,,,,,,,,,,,,,,,,,,,,,,,,,,,,,,,,,,,,,,,,,,,,,,,,,,,,,,,,,,,,,,,,,,,,,,,,,,,,,,,,,,,,,,,,,,,,,,,,,,,,,,,,,,,,,,,,,,,,,,,,,,,,,,,,,,,,,,,,,,,,,,,,,,,,,,,,,,,,,,,,,,,,,,,,,,,,,,,,,,,,,,,,,,,,,,,,,,,,,,,,,,,,,,,,,,,,,,,,,,,,,,,,,,,,,,,,,,,,,,,,,,,,,,,,,,,,,,,,,,,,,,,,,,,,,,,,,,,,,,,,,,,,,,,,,,,,,,,,,,,,,,,,,,,,,,,,,,,,,,,,,,,,,,,,,,,,,,,,,,,,,,,,,,,,,,,,,,,,,,,,,,,,,,,,,,,,,,,,,,,,,,,,,,,,,,,,,,,,,,,,,,,,,,,,,,,,,,,,,,,,,,,,,,,,,,,,,,,,,,,,,,,,,,,,,,,,,,,,,,,,,,,,,,,,,,,,,,,,,,,,,,,,,,,,,,,,,,,,,,,,,,,,,,,,,,,,,,,,,,,,,,,,,,,,,,,,,,,,,,,,,,,,,,,,,,,,,,,,,,,,,,,,,,,,,,,,,,,,,,,,,,,,,,,,,,,,,,,,,,,,,,,,,,,,,,,,,,,,,,,,,,,,,,,,,,,,,,,,,,,,,,,,,,,,,,,,,,,,,,,,,,,,,,,,,,,,,,,,,,,,,,,,,,,,,,,,,,,,,,,,,,,,,,,,,,,,,,,,,,,,,,,,,,,,,,,,,,,,,,,,,,,,,,,,,,,,,,,,,,,,,,,
cpu frequency:,600.064,600,600,600,600,600,600,600,600,600,600,600,600,600,600,600,600,600,600,600,1200,600,600,600,1200,600,600,600,600,600,600,600,600,600,600,600,600,600,600,600,600,1200,600,600,600,600,600,600,600,600,600,600,1200,600,599.998,600,600,600,600,600,600,600,600,600,599.998,600,600,600,600,600,600,600,1200,600,600,600,600,600,600,600,600,600,600,600.002,600,600,600,600,600,600,600,600,600,600,600,600,600,600,600,600,600,600,600,600,600,600,600,600,600,600,600,600,600,599.998,600,600,600,600,600,600,600,600.002,600,600,599.998,600,600,600,600,600,600,600,600,600.002,600,600,600,600,600,600,600,600,600,600.002,600,600,600,600,600,600,600,600,600,600,600,600,600,600,600,600,600,600,600,600,600,600,600,600,600,600,600,600,600,600,600,600,600,600,600,600,600,600,600,600,600,600,600,600,600,600,600,600,600,600,600,600,600,600,600,600,600,600,600,600,600,600.002,600,600,600,600,600,600,600,600,600,600,600,600,600,600,600,600,600,599.998,600,600,600,600,600,600,600,600.002,600,600,600,600,600,600,600,600,600,600,600,600,600,600,600,600,600,600,600.002,600,600,600,600,600,600,600,600,600,600.002,600,600,600,600,600,600,600,600,600,600,600,600,600,600,600,600,600,600,600,600,600,600,600,600,600,600,600,600,600,600,600,,,,,,,,,,,,,,,,,,,,,,,,,,,,,,,,,,,,,,,,,,,,,,,,,,,,,,,,,,,,,,,,,,,,,,,,,,,,,,,,,,,,,,,,,,,,,,,,,,,,,,,,,,,,,,,,,,,,,,,,,,,,,,,,,,,,,,,,,,,,,,,,,,,,,,,,,,,,,,,,,,,,,,,,,,,,,,,,,,,,,,,,,,,,,,,,,,,,,,,,,,,,,,,,,,,,,,,,,,,,,,,,,,,,,,,,,,,,,,,,,,,,,,,,,,,,,,,,,,,,,,,,,,,,,,,,,,,,,,,,,,,,,,,,,,,,,,,,,,,,,,,,,,,,,,,,,,,,,,,,,,,,,,,,,,,,,,,,,,,,,,,,,,,,,,,,,,,,,,,,,,,,,,,,,,,,,,,,,,,,,,,,,,,,,,,,,,,,,,,,,,,,,,,,,,,,,,,,,,,,,,,,,,,,,,,,,,,,,,,,,,,,,,,,,,,,,,,,,,,,,,,,,,,,,,,,,,,,,,,,,,,,,,,,,,,,,,,,,,,,,,,,,,,,,,,,,,,,,,,,,,,,,,,,,,,,,,,,,,,,,,,,,,,,,,,,,,,,,,,,,,,,,,,,,,,,,,,,,,,,,,,,,,,,,,,,,,,,,,,,,,,,,,,,,,,,,,,,,,,,,,,,,,,,,,,,,,,,,,,,,,,,,,,,,,,,,,,,,,,,,,,,,,,,,,,,,,,,,,,,,,,,,,,,,,,,,,,,,,,,,,,,,,,,,,,,,,,,,,,,,,,,,,,,,,,
temperature:,53.7,53.7,53.7,53.2,53.2,53.7,53.7,53.2,53.7,53.7,53.7,53.7,53.7,53.2,53.2,53.7,53.7,53.7,53.7,53.7,53.7,53.7,53.2,53.7,53.7,54.2,53.7,53.7,53.7,53.2,53.7,53.7,53.7,53.7,54.2,53.7,53.7,53.7,53.7,53.7,53.7,53.7,53.7,53.7,53.7,53.7,53.7,53.7,53.2,53.2,53.7,53.7,53.7,53.7,53.7,53.7,53.7,53.7,53.7,53.7,53.7,53.7,53.2,53.7,53.7,53.7,53.7,53.2,53.7,53.7,53.7,53.2,53.2,53.7,53.7,55.8,56.9,58,58,59.1,59.1,60.1,60.1,60.1,60.1,60.1,60.1,60.7,61.2,61.2,61.2,62.3,62.3,62.3,62.3,62.3,62.3,62.3,62.3,62.8,62.3,62.3,62.3,62.8,62.8,62.3,62.8,62.8,62.8,63.4,63.4,63.4,63.4,63.4,62.8,63.4,63.4,63.4,63.4,63.9,63.4,63.4,63.9,63.4,63.9,63.4,63.4,63.4,64.5,64.5,63.4,64.5,64.5,63.4,64.5,64.5,64.5,64.5,64.5,63.9,64.5,64.5,64.5,64.5,64.5,64.5,64.5,65,64.5,65,65,64.5,64.5,65,64.5,65,65,65,65,65,64.5,64.5,65,65.5,65.5,65.5,65.5,65,65.5,65,65,65.5,65,65.5,65.5,65.5,65,65.5,65.5,65,65.5,65.5,65,65,65,65.5,65,65.5,65.5,65.5,65.5,65.5,65.5,65.5,65.5,64.5,65.5,65.5,65.5,65,65.5,65.5,65.5,65.5,66.1,65.5,65.5,66.1,65.5,65.5,66.1,65.5,65.5,65.5,65.5,65.5,65.5,65.5,64.5,62.8,62.3,61.2,61.2,60.1,60.1,59.6,59.1,59.1,59.1,58.5,58.5,59.1,58,58,58,58,58,56.9,57.5,57.5,58,56.9,58,57.5,56.9,56.9,56.9,56.9,56.9,56.9,56.9,56.4,56.9,56.4,56.9,56.9,56.4,56.4,56.9,55.8,56.4,56.4,56.4,55.8,55.8,55.8,55.8,56.4,55.8,55.8,55.8,55.8,55.8,55.8,55.8,55.8,55.8,54.8,55.3,55.8,55.8,55.3,55.8,55.8,55.3,55.3,55.8,55.8,54.8,55.3,55.8,54.8,,,,,,,,,,,,,,,,,,,,,,,,,,,,,,,,,,,,,,,,,,,,,,,,,,,,,,,,,,,,,,,,,,,,,,,,,,,,,,,,,,,,,,,,,,,,,,,,,,,,,,,,,,,,,,,,,,,,,,,,,,,,,,,,,,,,,,,,,,,,,,,,,,,,,,,,,,,,,,,,,,,,,,,,,,,,,,,,,,,,,,,,,,,,,,,,,,,,,,,,,,,,,,,,,,,,,,,,,,,,,,,,,,,,,,,,,,,,,,,,,,,,,,,,,,,,,,,,,,,,,,,,,,,,,,,,,,,,,,,,,,,,,,,,,,,,,,,,,,,,,,,,,,,,,,,,,,,,,,,,,,,,,,,,,,,,,,,,,,,,,,,,,,,,,,,,,,,,,,,,,,,,,,,,,,,,,,,,,,,,,,,,,,,,,,,,,,,,,,,,,,,,,,,,,,,,,,,,,,,,,,,,,,,,,,,,,,,,,,,,,,,,,,,,,,,,,,,,,,,,,,,,,,,,,,,,,,,,,,,,,,,,,,,,,,,,,,,,,,,,,,,,,,,,,,,,,,,,,,,,,,,,,,,,,,,,,,,,,,,,,,,,,,,,,,,,,,,,,,,,,,,,,,,,,,,,,,,,,,,,,,,,,,,,,,,,,,,,,,,,,,,,,,,,,,,,,,,,,,,,,,,,,,,,,,,,,,,,,,,,,,,,,,,,,,,,,,,,,,,,,,,,,,,,,,,,,,,,,,,,,,,,,,,,,,,,,,,,,,,,,,,,,,,,,,,,,,,,,,,,,,,,,,,,,,,
time:,0,2.0297954082489,4.05851554870606,6.08566689491272,8.11400079727173,10.1423969268799,12.1710453033447,14.1993727684021,16.2290344238281,18.25705909729,20.2853140830994,22.3134467601776,24.3420827388763,26.37065076828,28.39976978302,30.4280135631561,32.4558384418488,34.4839956760406,36.5133907794952,38.5426697731018,40.5728154182434,42.5908849239349,44.6200830936432,46.6491239070892,48.678638458252,50.6967141628265,52.7265417575836,54.7554113864899,56.7847657203674,58.8125534057617,60.8418765068054,62.8698437213898,64.8993601799011,66.9269871711731,68.9549708366394,70.9833188056946,73.0120837688446,75.0451014041901,77.0755887031555,79.1036739349365,81.1338906288147,83.1619815826416,85.1793622970581,87.2073404788971,89.2376432418823,91.266321182251,93.2953252792358,95.3243916034699,97.353550195694,99.3827972412109,101.406783342361,103.438742160797,105.466662883759,107.484146595001,109.513036966324,111.541122913361,113.570301294327,115.599726200104,117.630259275436,119.658858537674,121.688214540482,123.715469121933,125.743790864944,127.771869897842,129.799910545349,131.827495574951,133.85612988472,135.884260416031,137.912295103073,139.93985915184,141.969819307327,143.998494386673,146.026942253113,148.044398069382,150.072881937027,152.100910186768,154.183562040329,156.275221347809,158.375138044357,160.455535411835,162.539220333099,164.634362459183,166.714668989182,168.814525604248,170.900379419327,172.985522508621,175.068774461746,177.174122095108,179.294445753098,181.406010389328,183.494141340256,185.59442782402,187.694212198257,189.774295806885,191.865375041962,193.954641580582,196.045308828354,198.147619485855,200.224194526672,202.315368175507,204.404174089432,206.48549413681,208.565199136734,210.665284156799,212.768797874451,214.854336261749,216.935903549194,219.034603118896,221.115345239639,223.20436167717,225.289294481277,227.384334564209,229.485565662384,231.585535764694,233.685307025909,235.766185283661,237.855120182037,239.952661037445,242.046533584595,244.126305580139,246.235144615173,248.316205263138,250.40624666214,252.48636341095,254.585451126099,256.667433261871,258.762825250626,260.856469869614,262.955305814743,265.045077085495,267.151973724365,269.245500564575,271.335621833801,273.445345640182,275.510666131973,277.587187290192,279.685099840164,281.785311698914,283.886219739914,285.977116584778,288.065480709076,290.156398534775,292.255290746689,294.356590747833,296.446278095245,298.555321931839,300.644529819488,302.745057582855,304.844702005386,306.935606241226,309.034524679184,311.114360809326,313.205676794052,315.29749250412,317.38578248024,319.487123727798,321.56538438797,323.664562940598,325.794255971909,327.904378890991,329.98556637764,332.08426618576,334.174700260162,336.265526294708,338.354460716248,340.445348024368,342.534251689911,344.624656677246,346.734531641006,348.824383497238,350.915490150452,352.995480060577,355.085370779037,357.16540145874,359.245468854904,361.325384378433,363.415414094925,365.505273580551,367.596088886261,369.676231622696,371.780383825302,373.866400718689,375.965162992477,378.056085586548,380.156712293625,382.24618935585,384.355256080627,386.436258077621,388.545339345932,390.646379232407,392.740238904953,394.825169563293,396.915090799332,399.015173435211,401.106175899506,403.19435095787,405.276307106018,407.386295318604,409.493524074555,411.585550546646,413.676166057587,415.767806053162,417.865223646164,419.955127239227,422.045254230499,424.145431756973,426.236161231995,428.3344373703,430.432202100754,432.515201330185,434.615413427353,436.703701496124,438.794345140457,440.895257234573,443.00412607193,445.085161447525,447.165344715118,449.245373725891,451.325335741043,453.353579759598,455.381423711777,457.409597635269,459.437670946121,461.465472459793,463.498547315598,465.526547431946,467.554820537567,469.583700895309,471.612630128861,473.640906810761,475.672258615494,477.700504302979,479.729038238525,481.756577253342,483.78532242775,485.81418633461,487.84398651123,489.872184991837,491.900677442551,493.930635452271,495.959374427795,497.988047838211,500.016511917114,502.044440031052,504.073474407196,506.101648807526,508.130349397659,510.158712148666,512.186299085617,514.214269399643,516.2425096035,518.271160125732,520.299162626267,522.329401016235,524.35847568512,526.38779759407,528.416576862335,530.444812059402,532.473844051361,534.502411365509,536.531333684921,538.561158657074,540.591781139374,542.619773864746,544.648842096329,546.677216291428,548.70605134964,550.733597993851,552.762052059174,554.791586875916,556.822159290314,558.850964784622,560.87989449501,562.909358739853,564.938644886017,566.968112468719,568.998279094696,571.025835514069,573.054930686951,575.083805084229,577.113105773926,579.143713712692,581.172441244125,583.200448036194,585.229001522064,587.256967544556,589.286904335022,591.314948558807,593.344049453735,595.372300624847,597.402656316757,599.430574655533,,,,,,,,,,,,,,,,,,,,,,,,,,,,,,,,,,,,,,,,,,,,,,,,,,,,,,,,,,,,,,,,,,,,,,,,,,,,,,,,,,,,,,,,,,,,,,,,,,,,,,,,,,,,,,,,,,,,,,,,,,,,,,,,,,,,,,,,,,,,,,,,,,,,,,,,,,,,,,,,,,,,,,,,,,,,,,,,,,,,,,,,,,,,,,,,,,,,,,,,,,,,,,,,,,,,,,,,,,,,,,,,,,,,,,,,,,,,,,,,,,,,,,,,,,,,,,,,,,,,,,,,,,,,,,,,,,,,,,,,,,,,,,,,,,,,,,,,,,,,,,,,,,,,,,,,,,,,,,,,,,,,,,,,,,,,,,,,,,,,,,,,,,,,,,,,,,,,,,,,,,,,,,,,,,,,,,,,,,,,,,,,,,,,,,,,,,,,,,,,,,,,,,,,,,,,,,,,,,,,,,,,,,,,,,,,,,,,,,,,,,,,,,,,,,,,,,,,,,,,,,,,,,,,,,,,,,,,,,,,,,,,,,,,,,,,,,,,,,,,,,,,,,,,,,,,,,,,,,,,,,,,,,,,,,,,,,,,,,,,,,,,,,,,,,,,,,,,,,,,,,,,,,,,,,,,,,,,,,,,,,,,,,,,,,,,,,,,,,,,,,,,,,,,,,,,,,,,,,,,,,,,,,,,,,,,,,,,,,,,,,,,,,,,,,,,,,,,,,,,,,,,,,,,,,,,,,,,,,,,,,,,,,,,,,,,,,,,,,,,,,,,,,,,,,,,,,,,,,,,,,,,,,,,,,,
,,,,,,,,,,,,,,,,,,,,,,,,,,,,,,,,,,,,,,,,,,,,,,,,,,,,,,,,,,,,,,,,,,,,,,,,,,,,,,,,,,,,,,,,,,,,,,,,,,,,,,,,,,,,,,,,,,,,,,,,,,,,,,,,,,,,,,,,,,,,,,,,,,,,,,,,,,,,,,,,,,,,,,,,,,,,,,,,,,,,,,,,,,,,,,,,,,,,,,,,,,,,,,,,,,,,,,,,,,,,,,,,,,,,,,,,,,,,,,,,,,,,,,,,,,,,,,,,,,,,,,,,,,,,,,,,,,,,,,,,,,,,,,,,,,,,,,,,,,,,,,,,,,,,,,,,,,,,,,,,,,,,,,,,,,,,,,,,,,,,,,,,,,,,,,,,,,,,,,,,,,,,,,,,,,,,,,,,,,,,,,,,,,,,,,,,,,,,,,,,,,,,,,,,,,,,,,,,,,,,,,,,,,,,,,,,,,,,,,,,,,,,,,,,,,,,,,,,,,,,,,,,,,,,,,,,,,,,,,,,,,,,,,,,,,,,,,,,,,,,,,,,,,,,,,,,,,,,,,,,,,,,,,,,,,,,,,,,,,,,,,,,,,,,,,,,,,,,,,,,,,,,,,,,,,,,,,,,,,,,,,,,,,,,,,,,,,,,,,,,,,,,,,,,,,,,,,,,,,,,,,,,,,,,,,,,,,,,,,,,,,,,,,,,,,,,,,,,,,,,,,,,,,,,,,,,,,,,,,,,,,,,,,,,,,,,,,,,,,,,,,,,,,,,,,,,,,,,,,,,,,,,,,,,,,,,,,,,,,,,,,,,,,,,,,,,,,,,,,,,,,,,,,,,,,,,,,,,,,,,,,,,,,,,,,,,,,,,,,,,,,,,,,,,,,,,,,,,,,,,,,,,,,,,,,,,,,,,,,,,,,,,,,,,,,,,,,,,,,,,,,,,,,,,,,,,,,,,,,,,,,,,,,,,,,,,,,,,,,,,,,,,,,,,,,,,,,,,,,,,,,,,,,,,,,,,,,,,,,,,,,,,,,,,,,,,,,,,,,,,,,,,,,,,,,,,,,,,,,,,,,,,,,,,,,,,,,,,,,,,,,,,,,,,,,,,,,,,,,,,,,,
"deltaco good cable  5V 2,4A:",,,,,,,,,,,,,,,,,,,,,,,,,,,,,,,,,,,,,,,,,,,,,,,,,,,,,,,,,,,,,,,,,,,,,,,,,,,,,,,,,,,,,,,,,,,,,,,,,,,,,,,,,,,,,,,,,,,,,,,,,,,,,,,,,,,,,,,,,,,,,,,,,,,,,,,,,,,,,,,,,,,,,,,,,,,,,,,,,,,,,,,,,,,,,,,,,,,,,,,,,,,,,,,,,,,,,,,,,,,,,,,,,,,,,,,,,,,,,,,,,,,,,,,,,,,,,,,,,,,,,,,,,,,,,,,,,,,,,,,,,,,,,,,,,,,,,,,,,,,,,,,,,,,,,,,,,,,,,,,,,,,,,,,,,,,,,,,,,,,,,,,,,,,,,,,,,,,,,,,,,,,,,,,,,,,,,,,,,,,,,,,,,,,,,,,,,,,,,,,,,,,,,,,,,,,,,,,,,,,,,,,,,,,,,,,,,,,,,,,,,,,,,,,,,,,,,,,,,,,,,,,,,,,,,,,,,,,,,,,,,,,,,,,,,,,,,,,,,,,,,,,,,,,,,,,,,,,,,,,,,,,,,,,,,,,,,,,,,,,,,,,,,,,,,,,,,,,,,,,,,,,,,,,,,,,,,,,,,,,,,,,,,,,,,,,,,,,,,,,,,,,,,,,,,,,,,,,,,,,,,,,,,,,,,,,,,,,,,,,,,,,,,,,,,,,,,,,,,,,,,,,,,,,,,,,,,,,,,,,,,,,,,,,,,,,,,,,,,,,,,,,,,,,,,,,,,,,,,,,,,,,,,,,,,,,,,,,,,,,,,,,,,,,,,,,,,,,,,,,,,,,,,,,,,,,,,,,,,,,,,,,,,,,,,,,,,,,,,,,,,,,,,,,,,,,,,,,,,,,,,,,,,,,,,,,,,,,,,,,,,,,,,,,,,,,,,,,,,,,,,,,,,,,,,,,,,,,,,,,,,,,,,,,,,,,,,,,,,,,,,,,,,,,,,,,,,,,,,,,,,,,,,,,,,,,,,,,,,,,,,,,,,,,,,,,,,,,,,,,,,,,,,,,,,,,,,,,,,,,,,,,,,,,,,,,,,,,,,,,,,,,,,,,,,,,,,,,,,,,,,,,
cpu frequency:,1200.126,1200,600,1200,600,600,1200,600,1200,1200,1200,600,1200,600,1200,600,1200,599.998,1200,600,1200,600,1200,600,1200,600,1200,600,1200,600,1200,600,1200,600,1200,600,1199.998,600,1200,600,1200,600,1200,600,600,600,1200,600,1200,600,1199.998,600,1200,600,1200,600,1200,600,1200,600,1200,600,1200,600,1200.002,600,1200,600,600,600,1200,600,1199.998,600,1200,1200,1200,1200,1200,1200,1200,1200,1200,1200,1200,1200,1200,1200,1200,1200.002,1200,1200,1200,1200,1199.998,1200,1199.998,1200,1200,1199.998,1200,1200,1200,1200,1200,1200,1199.998,1200,1200,1199.998,1200,1200,1200,1200,1199.998,1200,1200,1200,1200,1200,1200,1200,1200,1200,1200,1200,1199.998,1200,1200,1200,1200.002,1200,1195,1200,1195,1195,1200,1200,1195,1195,1195,1195,1141,1195.002,1141,1140.998,1141,1141,1195,1141,1141,1141,1141,1087,1141,1141,1141,1141,1141,1141,1087,1140.998,1141,1034,1141,1141,1141,1141,1087,1140.998,1141,1141,1087,1087,1087,1141,1034,1141,1141,1141.002,1141,1087,1141,1141,1141,1141,1087,1034,1141,1141,1087,1086.998,1141,1141,1087,1140.998,1141,1141,1141,1141,1141,1087,1141,1087,1141,1087,1087,1141,1141,1034,1034,1034.002,1141,1087,1141,1141,1141.002,1087,1034,600,1200,600,1200,600,1200,600,1200,599.998,1200,600,1200,600,600,600,1200,1200,600,1199.998,600,1200,1200,1200,600,600,600,1200,600,1200,600,1200,600,1200,600,1200,600,1200,1200,1200,600.002,1200,600,1200,600,600,600,1200,600,1199.998,600,1200,600,1199.998,600,1200,600,1200,600,1199.998,600,1200,600,1200,600,1200,600,1200,1200,600,1200,1200,1200,600,1199.998,,,,,,,,,,,,,,,,,,,,,,,,,,,,,,,,,,,,,,,,,,,,,,,,,,,,,,,,,,,,,,,,,,,,,,,,,,,,,,,,,,,,,,,,,,,,,,,,,,,,,,,,,,,,,,,,,,,,,,,,,,,,,,,,,,,,,,,,,,,,,,,,,,,,,,,,,,,,,,,,,,,,,,,,,,,,,,,,,,,,,,,,,,,,,,,,,,,,,,,,,,,,,,,,,,,,,,,,,,,,,,,,,,,,,,,,,,,,,,,,,,,,,,,,,,,,,,,,,,,,,,,,,,,,,,,,,,,,,,,,,,,,,,,,,,,,,,,,,,,,,,,,,,,,,,,,,,,,,,,,,,,,,,,,,,,,,,,,,,,,,,,,,,,,,,,,,,,,,,,,,,,,,,,,,,,,,,,,,,,,,,,,,,,,,,,,,,,,,,,,,,,,,,,,,,,,,,,,,,,,,,,,,,,,,,,,,,,,,,,,,,,,,,,,,,,,,,,,,,,,,,,,,,,,,,,,,,,,,,,,,,,,,,,,,,,,,,,,,,,,,,,,,,,,,,,,,,,,,,,,,,,,,,,,,,,,,,,,,,,,,,,,,,,,,,,,,,,,,,,,,,,,,,,,,,,,,,,,,,,,,,,,,,,,,,,,,,,,,,,,,,,,,,,,,,,,,,,,,,,,,,,,,,,,,,,,,,,,,,,,,,,,,,,,,,,,,,,,,,,,,,,,,,,,,,,,,,,,,,,,,,,,,,,,,,,,,,,,,,,,,,,,,,,,,,,,,,,,,,,,,,,,,,,,,,
temperature:,52.1,52.1,52.1,51.5,51.5,51.5,52.1,51.5,52.6,52.1,51.5,51.5,51.5,51.5,52.6,51.5,52.1,51.5,52.1,51.5,52.6,52.1,51.5,52.1,52.1,52.1,52.6,52.1,52.1,51.5,52.1,51.5,52.6,52.1,52.6,52.1,52.1,51.5,52.6,52.6,52.1,52.1,52.1,52.1,52.1,52.6,52.1,52.1,52.6,52.1,51.5,52.6,52.6,52.1,52.1,52.1,52.1,52.1,52.6,52.6,52.1,52.1,52.1,52.1,52.1,52.1,52.1,51.5,52.1,52.1,51.5,51.5,51.5,52.1,51.5,56.9,60.1,62.3,63.4,65,65.5,67.1,68.2,68.8,69.8,70.9,70.9,70.9,70.9,72,72,72.5,73.1,73.1,73.1,74.1,73.6,74.1,74.1,75.2,75.2,75.2,75.2,75.8,75.2,75.8,76.3,76.3,76.3,76.3,77.4,76.3,77.4,77.4,77.9,77.9,77.9,77.9,77.9,77.9,78.4,78.4,78.4,79.5,78.4,79.5,79.5,79.5,79,79.5,79.5,79,80.1,80.1,79.5,79.5,80.1,80.1,80.1,80.1,80.6,80.6,80.1,80.6,80.6,80.1,80.6,80.6,80.6,80.6,80.6,80.6,80.6,81.1,80.6,80.6,80.6,80.6,80.6,80.6,81.1,80.6,80.6,80.6,80.6,80.6,80.6,80.6,80.6,80.6,80.6,80.6,80.1,80.6,80.6,80.6,80.6,80.6,81.1,80.6,80.6,81.1,80.6,81.1,80.6,80.6,80.6,80.6,80.6,80.6,80.6,81.1,81.1,81.1,80.6,80.6,80.6,80.6,80.6,81.1,81.1,81.1,80.6,81.7,80.6,81.7,80.6,81.1,81.7,81.7,80.6,81.7,80.6,81.1,81.7,80.6,80.6,81.1,80.6,77.9,74.7,72,70.4,69.3,68.8,67.7,66.1,66.1,65,64.5,64.5,64.5,63.4,62.8,62.3,62.3,61.2,62.3,61.8,60.7,60.7,60.7,60.1,60.7,60.1,60.1,60.1,59.1,59.6,59.1,59.1,59.1,58,58.5,58,58,59.1,58,58,58,56.9,56.9,58,58,56.9,56.4,56.9,56.4,56.9,56.9,55.8,55.8,55.8,55.8,55.8,55.8,55.8,55.8,55.8,55.3,55.3,55.8,55.8,55.3,55.3,55.3,55.3,55.3,54.8,54.8,54.8,54.8,54.8,,,,,,,,,,,,,,,,,,,,,,,,,,,,,,,,,,,,,,,,,,,,,,,,,,,,,,,,,,,,,,,,,,,,,,,,,,,,,,,,,,,,,,,,,,,,,,,,,,,,,,,,,,,,,,,,,,,,,,,,,,,,,,,,,,,,,,,,,,,,,,,,,,,,,,,,,,,,,,,,,,,,,,,,,,,,,,,,,,,,,,,,,,,,,,,,,,,,,,,,,,,,,,,,,,,,,,,,,,,,,,,,,,,,,,,,,,,,,,,,,,,,,,,,,,,,,,,,,,,,,,,,,,,,,,,,,,,,,,,,,,,,,,,,,,,,,,,,,,,,,,,,,,,,,,,,,,,,,,,,,,,,,,,,,,,,,,,,,,,,,,,,,,,,,,,,,,,,,,,,,,,,,,,,,,,,,,,,,,,,,,,,,,,,,,,,,,,,,,,,,,,,,,,,,,,,,,,,,,,,,,,,,,,,,,,,,,,,,,,,,,,,,,,,,,,,,,,,,,,,,,,,,,,,,,,,,,,,,,,,,,,,,,,,,,,,,,,,,,,,,,,,,,,,,,,,,,,,,,,,,,,,,,,,,,,,,,,,,,,,,,,,,,,,,,,,,,,,,,,,,,,,,,,,,,,,,,,,,,,,,,,,,,,,,,,,,,,,,,,,,,,,,,,,,,,,,,,,,,,,,,,,,,,,,,,,,,,,,,,,,,,,,,,,,,,,,,,,,,,,,,,,,,,,,,,,,,,,,,,,,,,,,,,,,,,,,,,,,,,,,,,,,,,,,,,,,,,,,,,,,,,,,,,,,,
time:,0,2.02227687835693,4.04812479019165,6.06931090354919,8.0862193107605,10.1132433414459,12.1418726444244,14.159453868866,16.1881129741669,18.2226965427399,20.250714302063,22.2675170898437,24.2958672046661,26.3127372264862,28.3406262397766,30.3593547344208,32.406699180603,34.4236214160919,36.4510321617126,38.4678254127502,40.4979405403137,42.5148887634277,44.5418989658356,46.5587496757507,48.5857586860657,50.6026685237885,52.6311330795288,54.6480307579041,56.6760289669037,58.6934788227081,60.7212858200073,62.7378973960876,64.7663440704346,66.7832770347595,68.8105671405792,70.8274145126343,72.854793548584,74.8719198703766,76.8995299339295,78.916312456131,80.9435510635376,82.9609060287476,84.9880602359772,87.0050919055939,89.0321271419525,91.0597901344299,93.0877711772919,95.1045873165131,97.1332807540894,99.151093006134,101.178487300873,103.195513010025,105.223924636841,107.240765810013,109.268150091171,111.285020589829,113.313072443008,115.33043718338,117.360627651215,119.377560138702,121.404992341995,123.422481298447,125.449975728989,127.466749429703,129.493402004242,131.511297702789,133.540099143982,135.557442903519,137.584963798523,139.613097667694,141.641280651093,143.659036159515,145.686820983887,147.704190015793,149.731511592865,151.748705387115,153.833341598511,155.920220375061,157.990358829498,160.05514383316,162.140321731567,164.220352649689,166.290639400482,168.370340108871,170.440706014633,172.520368337631,174.600267410278,176.670697927475,178.760392427444,180.839212179184,182.930391788483,185.010199785233,187.078643083572,189.15025305748,191.23046875,193.312521696091,195.423792600632,197.500406742096,199.570398330688,201.640384674072,203.71036696434,205.780446529388,207.860312700272,209.930474758148,212.000306844711,214.071795940399,216.150339365005,218.223390102386,220.320348024368,222.400376319885,224.470404624939,226.550405979156,228.620364189148,230.687692880631,232.770359754562,234.840328454971,236.910337209702,238.990376710892,241.060403347015,243.130403995514,245.212630987167,247.290295124054,249.360857486725,251.440332889557,253.51037311554,255.590376377106,257.694871664047,259.760897397995,261.850409030914,263.930341482162,266.010408878326,268.080287694931,270.150369882584,272.233148336411,274.31036233902,276.380359888077,278.450354337692,280.520362615585,282.600377321243,284.672906637192,286.750367164612,288.820433139801,290.890330791473,292.960240840912,295.03590297699,297.101960659027,299.192372083664,301.260926008224,303.341026782989,305.412553548813,307.508945703506,309.561201810837,311.640961885452,313.721354961395,315.800979375839,317.880954027176,319.961221456528,322.051027774811,324.130889892578,326.221002101898,328.318470954895,330.382562875748,332.481011629105,334.571028232574,336.661543607712,338.740986824036,340.800865888596,342.886123180389,344.960345983505,347.041373252869,349.1310069561,351.210652112961,353.300341844559,355.390350818634,357.480339288712,359.564946889877,361.65074634552,363.730381965637,365.820363759995,367.900894880295,369.980397462845,372.052616596222,374.141039848328,376.210602283478,378.290246963501,380.360237360001,382.450964927673,384.530416488647,386.610706329346,388.69056224823,390.770286083221,392.84986615181,394.957881689072,397.030967235565,399.121248245239,401.211022138596,403.283409357071,405.370782613754,407.440254211426,409.51066160202,411.600889921188,413.680907964706,415.751792907715,417.831681489944,419.910927057266,421.983484745026,424.071042060852,426.161027908325,428.241180896759,430.342373371124,432.431143760681,434.511088371277,436.591237783432,438.671613454819,440.75105547905,442.841191291809,444.920953512192,447.010915994644,449.090889215469,451.151654005051,453.180157184601,455.196877717972,457.223746061325,459.240791082382,461.268237352371,463.285507202148,465.312655687332,467.329881668091,469.357401609421,471.37472486496,473.40203499794,475.420072078705,477.448256015778,479.475987195969,481.503655910492,483.525005578995,485.54123044014,487.569412231445,489.585916042328,491.612293958664,493.628133058548,495.645890951157,497.662048578262,499.690196990967,501.717990398407,503.74530005455,505.761854410172,507.789182662964,509.80588555336,511.833161830902,513.850752830505,515.878130674362,517.895542860031,519.922759771347,521.941047430038,523.968437671661,525.985584020615,528.00275683403,530.019379615784,532.046874523163,534.063516616821,536.090454101563,538.107460975647,540.133849859238,542.160665512085,544.188018798828,546.204716444016,548.231016397476,550.246890306473,552.272960662842,554.289641857147,556.315967559814,558.332739591599,560.359245538712,562.375252723694,564.401381492615,566.417991161346,568.446043014526,570.462763309479,572.48935508728,574.505372285843,576.531298398972,578.547894239426,580.573977947235,582.5909948349,584.616921424866,586.63371515274,588.64997792244,590.677999019623,592.694221973419,594.72162771225,596.737416744232,598.764837741852,,,,,,,,,,,,,,,,,,,,,,,,,,,,,,,,,,,,,,,,,,,,,,,,,,,,,,,,,,,,,,,,,,,,,,,,,,,,,,,,,,,,,,,,,,,,,,,,,,,,,,,,,,,,,,,,,,,,,,,,,,,,,,,,,,,,,,,,,,,,,,,,,,,,,,,,,,,,,,,,,,,,,,,,,,,,,,,,,,,,,,,,,,,,,,,,,,,,,,,,,,,,,,,,,,,,,,,,,,,,,,,,,,,,,,,,,,,,,,,,,,,,,,,,,,,,,,,,,,,,,,,,,,,,,,,,,,,,,,,,,,,,,,,,,,,,,,,,,,,,,,,,,,,,,,,,,,,,,,,,,,,,,,,,,,,,,,,,,,,,,,,,,,,,,,,,,,,,,,,,,,,,,,,,,,,,,,,,,,,,,,,,,,,,,,,,,,,,,,,,,,,,,,,,,,,,,,,,,,,,,,,,,,,,,,,,,,,,,,,,,,,,,,,,,,,,,,,,,,,,,,,,,,,,,,,,,,,,,,,,,,,,,,,,,,,,,,,,,,,,,,,,,,,,,,,,,,,,,,,,,,,,,,,,,,,,,,,,,,,,,,,,,,,,,,,,,,,,,,,,,,,,,,,,,,,,,,,,,,,,,,,,,,,,,,,,,,,,,,,,,,,,,,,,,,,,,,,,,,,,,,,,,,,,,,,,,,,,,,,,,,,,,,,,,,,,,,,,,,,,,,,,,,,,,,,,,,,,,,,,,,,,,,,,,,,,,,,,,,,,,,,,,,,,,,,,,,,,,,,,,,,,,,,,,,
,,,,,,,,,,,,,,,,,,,,,,,,,,,,,,,,,,,,,,,,,,,,,,,,,,,,,,,,,,,,,,,,,,,,,,,,,,,,,,,,,,,,,,,,,,,,,,,,,,,,,,,,,,,,,,,,,,,,,,,,,,,,,,,,,,,,,,,,,,,,,,,,,,,,,,,,,,,,,,,,,,,,,,,,,,,,,,,,,,,,,,,,,,,,,,,,,,,,,,,,,,,,,,,,,,,,,,,,,,,,,,,,,,,,,,,,,,,,,,,,,,,,,,,,,,,,,,,,,,,,,,,,,,,,,,,,,,,,,,,,,,,,,,,,,,,,,,,,,,,,,,,,,,,,,,,,,,,,,,,,,,,,,,,,,,,,,,,,,,,,,,,,,,,,,,,,,,,,,,,,,,,,,,,,,,,,,,,,,,,,,,,,,,,,,,,,,,,,,,,,,,,,,,,,,,,,,,,,,,,,,,,,,,,,,,,,,,,,,,,,,,,,,,,,,,,,,,,,,,,,,,,,,,,,,,,,,,,,,,,,,,,,,,,,,,,,,,,,,,,,,,,,,,,,,,,,,,,,,,,,,,,,,,,,,,,,,,,,,,,,,,,,,,,,,,,,,,,,,,,,,,,,,,,,,,,,,,,,,,,,,,,,,,,,,,,,,,,,,,,,,,,,,,,,,,,,,,,,,,,,,,,,,,,,,,,,,,,,,,,,,,,,,,,,,,,,,,,,,,,,,,,,,,,,,,,,,,,,,,,,,,,,,,,,,,,,,,,,,,,,,,,,,,,,,,,,,,,,,,,,,,,,,,,,,,,,,,,,,,,,,,,,,,,,,,,,,,,,,,,,,,,,,,,,,,,,,,,,,,,,,,,,,,,,,,,,,,,,,,,,,,,,,,,,,,,,,,,,,,,,,,,,,,,,,,,,,,,,,,,,,,,,,,,,,,,,,,,,,,,,,,,,,,,,,,,,,,,,,,,,,,,,,,,,,,,,,,,,,,,,,,,,,,,,,,,,,,,,,,,,,,,,,,,,,,,,,,,,,,,,,,,,,,,,,,,,,,,,,,,,,,,,,,,,,,,,,,,,,,,,,,,,,,,,,,,,,,,,,,,,,,,,,,,,,,,,,,,,,,,,,,,
"deltaco good cable USB-c 5V 2,4A:",,,,,,,,,,,,,,,,,,,,,,,,,,,,,,,,,,,,,,,,,,,,,,,,,,,,,,,,,,,,,,,,,,,,,,,,,,,,,,,,,,,,,,,,,,,,,,,,,,,,,,,,,,,,,,,,,,,,,,,,,,,,,,,,,,,,,,,,,,,,,,,,,,,,,,,,,,,,,,,,,,,,,,,,,,,,,,,,,,,,,,,,,,,,,,,,,,,,,,,,,,,,,,,,,,,,,,,,,,,,,,,,,,,,,,,,,,,,,,,,,,,,,,,,,,,,,,,,,,,,,,,,,,,,,,,,,,,,,,,,,,,,,,,,,,,,,,,,,,,,,,,,,,,,,,,,,,,,,,,,,,,,,,,,,,,,,,,,,,,,,,,,,,,,,,,,,,,,,,,,,,,,,,,,,,,,,,,,,,,,,,,,,,,,,,,,,,,,,,,,,,,,,,,,,,,,,,,,,,,,,,,,,,,,,,,,,,,,,,,,,,,,,,,,,,,,,,,,,,,,,,,,,,,,,,,,,,,,,,,,,,,,,,,,,,,,,,,,,,,,,,,,,,,,,,,,,,,,,,,,,,,,,,,,,,,,,,,,,,,,,,,,,,,,,,,,,,,,,,,,,,,,,,,,,,,,,,,,,,,,,,,,,,,,,,,,,,,,,,,,,,,,,,,,,,,,,,,,,,,,,,,,,,,,,,,,,,,,,,,,,,,,,,,,,,,,,,,,,,,,,,,,,,,,,,,,,,,,,,,,,,,,,,,,,,,,,,,,,,,,,,,,,,,,,,,,,,,,,,,,,,,,,,,,,,,,,,,,,,,,,,,,,,,,,,,,,,,,,,,,,,,,,,,,,,,,,,,,,,,,,,,,,,,,,,,,,,,,,,,,,,,,,,,,,,,,,,,,,,,,,,,,,,,,,,,,,,,,,,,,,,,,,,,,,,,,,,,,,,,,,,,,,,,,,,,,,,,,,,,,,,,,,,,,,,,,,,,,,,,,,,,,,,,,,,,,,,,,,,,,,,,,,,,,,,,,,,,,,,,,,,,,,,,,,,,,,,,,,,,,,,,,,,,,,,,,,,,,,,,,,,,,,,,,,,,,,,,,,,,,,,,,,,,,,,,,,,,,,,,,,,,
cpu frequency:,600.064,600,1200,600,1200,600,1200,600,1200,600,1200,600,600,600,1200,600,1200,600,1200,600,1200,600,1200,600,1200,600,600,600,1200,1200,1200,600,1200,1200,600,1200,600,1199.998,1200,1200,1200,600,1200,600,600,600,1200,600,600,1199.998,600,600,1200,1200,1200,600,1200,600,600,600,1200,600,1200,1199.998,600,600,1200,1200,600,1200,600,1200,600,1200,600,1200,1200.002,1200,1200,1200,1200,1200,1199.998,1200,1200,1200,1200,1200,1200,1200.002,1200,1200,1200,1200,1200,1200,1200.002,1200,1200,1200,1200,1200,1200,1200,1200,1200,1200,1200,1200,1200,1200,1200,1200,1199.998,1200,1200,1200,1200,1200.002,1200,1199.998,1200,1200,1200,1200,1200,1200,1200,1200,1200,1200.002,1195,1200,1200,1200,1195,1194.998,1200,1195,1194.998,1200,1141,1195,1195.002,1141,1195,1141,1141,1141,1141,1141,1141,1141,1141,1141,1141,1140.998,1141.002,1195,1141,1141,1141,1141,1140.998,1087,1141,1034,1141,1141,1141,1141,1141,1141,1087,1034,1087,1141,1141,1141,1087,1034,1034,1141,1141,1034,1141,1141,1034,1141,1034,1141,1141,1141,1087,1141,1087,1087,1086.998,1034,1087.002,1087,1141,1087,1087,1140.998,1141,1087,1087,1141,1087,1141,1034,1141,1087,1034,1087,1034.002,1034,1140.998,600,600,1200,600,1200,600,1200.002,600,600.002,600,1200,600,1199.998,600,1200,600,1200,600,1200,600,1200,600,1200,600,1200,600,600,600,1200,600.002,600,600,1200,600,1200,600,1200,600,1200,600,1200,600,1200,600,1200.002,600,1200,600,600,600,1200,600,600.002,600,1200,600,1200,600,1200,600,1200,600,1200,600,600,1200,1200,1200.002,600,1200,600,1200,600,1200,,,,,,,,,,,,,,,,,,,,,,,,,,,,,,,,,,,,,,,,,,,,,,,,,,,,,,,,,,,,,,,,,,,,,,,,,,,,,,,,,,,,,,,,,,,,,,,,,,,,,,,,,,,,,,,,,,,,,,,,,,,,,,,,,,,,,,,,,,,,,,,,,,,,,,,,,,,,,,,,,,,,,,,,,,,,,,,,,,,,,,,,,,,,,,,,,,,,,,,,,,,,,,,,,,,,,,,,,,,,,,,,,,,,,,,,,,,,,,,,,,,,,,,,,,,,,,,,,,,,,,,,,,,,,,,,,,,,,,,,,,,,,,,,,,,,,,,,,,,,,,,,,,,,,,,,,,,,,,,,,,,,,,,,,,,,,,,,,,,,,,,,,,,,,,,,,,,,,,,,,,,,,,,,,,,,,,,,,,,,,,,,,,,,,,,,,,,,,,,,,,,,,,,,,,,,,,,,,,,,,,,,,,,,,,,,,,,,,,,,,,,,,,,,,,,,,,,,,,,,,,,,,,,,,,,,,,,,,,,,,,,,,,,,,,,,,,,,,,,,,,,,,,,,,,,,,,,,,,,,,,,,,,,,,,,,,,,,,,,,,,,,,,,,,,,,,,,,,,,,,,,,,,,,,,,,,,,,,,,,,,,,,,,,,,,,,,,,,,,,,,,,,,,,,,,,,,,,,,,,,,,,,,,,,,,,,,,,,,,,,,,,,,,,,,,,,,,,,,,,,,,,,,,,,,,,,,,,,,,,,,,,,,,,,,,,,,,,,,,,,,,,,,,,,,,,,,,,,,,,,,,,,,,,,,
temperature:,50.5,50.5,50.5,51.5,51.5,51.5,52.1,51.5,51.5,51,51.5,51.5,51.5,51.5,51.5,51.5,51,51.5,51.5,51.5,51.5,51.5,51.5,51.5,51.5,52.1,51.5,51.5,51.5,51.5,51.5,52.1,51.5,51,51.5,51.5,51.5,51.5,51.5,52.1,50.5,51.5,51.5,52.1,51.5,51.5,51.5,51.5,51.5,51.5,51.5,51,51.5,51.5,51.5,51.5,51.5,52.1,51.5,51.5,50.5,50.5,51.5,51.5,51.5,51,51,51.5,51,51.5,51.5,51.5,51.5,51.5,51.5,56.9,59.1,61.2,63.4,64.5,65.5,66.6,67.7,68.8,68.8,69.8,69.8,70.9,70.9,70.9,70.9,72,72,73.1,73.1,73.1,73.1,74.1,74.1,74.1,74.1,74.7,75.2,75.2,75.2,75.2,75.8,75.2,76.8,76.3,76.3,77.4,76.8,77.4,77.4,77.4,77.4,77.9,77.9,77.9,78.4,78.4,78.4,78.4,79,78.4,79,79.5,79.5,79,79.5,79.5,79.5,79.5,80.1,80.1,79.5,80.1,79.5,80.6,79.5,80.6,80.1,80.6,80.1,80.6,80.1,80.6,80.6,80.6,80.1,80.6,80.6,80.6,80.6,80.6,80.6,80.6,80.6,81.1,80.6,80.6,81.7,81.1,81.1,80.6,81.1,80.6,80.6,80.6,80.6,80.6,80.6,80.6,80.6,81.1,80.6,80.6,81.1,81.7,81.1,80.6,81.7,80.6,81.1,80.6,80.6,81.1,81.1,81.7,80.6,81.1,80.6,80.6,81.1,81.1,81.7,81.1,81.7,80.6,81.7,81.1,81.7,80.6,81.1,81.1,80.6,80.6,80.6,81.7,81.7,81.7,81.7,81.1,80.6,81.1,80.6,81.7,81.1,79,75.2,73.6,70.9,70.9,68.8,67.7,66.6,65.5,65.5,65,64.5,64.5,63.4,63.4,62.3,62.8,62.8,62.3,62.3,61.8,61.2,60.7,61.2,60.7,60.7,60.1,59.6,59.6,60.1,59.6,59.6,59.6,59.1,59.1,59.1,58.5,59.1,58.5,58.5,58,58.5,58,58,57.5,58,57.5,56.9,58,57.5,56.9,57.5,56.9,56.9,56.9,56.4,56.9,56.4,56.4,55.8,56.4,56.4,56.4,55.8,55.8,55.3,54.8,55.8,56.4,55.8,55.8,55.3,54.8,55.8,,,,,,,,,,,,,,,,,,,,,,,,,,,,,,,,,,,,,,,,,,,,,,,,,,,,,,,,,,,,,,,,,,,,,,,,,,,,,,,,,,,,,,,,,,,,,,,,,,,,,,,,,,,,,,,,,,,,,,,,,,,,,,,,,,,,,,,,,,,,,,,,,,,,,,,,,,,,,,,,,,,,,,,,,,,,,,,,,,,,,,,,,,,,,,,,,,,,,,,,,,,,,,,,,,,,,,,,,,,,,,,,,,,,,,,,,,,,,,,,,,,,,,,,,,,,,,,,,,,,,,,,,,,,,,,,,,,,,,,,,,,,,,,,,,,,,,,,,,,,,,,,,,,,,,,,,,,,,,,,,,,,,,,,,,,,,,,,,,,,,,,,,,,,,,,,,,,,,,,,,,,,,,,,,,,,,,,,,,,,,,,,,,,,,,,,,,,,,,,,,,,,,,,,,,,,,,,,,,,,,,,,,,,,,,,,,,,,,,,,,,,,,,,,,,,,,,,,,,,,,,,,,,,,,,,,,,,,,,,,,,,,,,,,,,,,,,,,,,,,,,,,,,,,,,,,,,,,,,,,,,,,,,,,,,,,,,,,,,,,,,,,,,,,,,,,,,,,,,,,,,,,,,,,,,,,,,,,,,,,,,,,,,,,,,,,,,,,,,,,,,,,,,,,,,,,,,,,,,,,,,,,,,,,,,,,,,,,,,,,,,,,,,,,,,,,,,,,,,,,,,,,,,,,,,,,,,,,,,,,,,,,,,,,,,,,,,,,,,,,,,,,,,,,,,,,,,,,,,,,,,,,,,,,,,
time:,0,2.03081703186035,4.0587043762207,6.07664346694946,8.10501289367676,10.1219944953918,12.1522784233093,14.1691491603851,16.1973702907562,18.2154614925385,20.2436902523041,22.2608926296234,24.2888994216919,26.3187024593353,28.3512918949127,30.3690400123596,32.4031374454498,34.4202013015747,36.4483437538147,38.4657893180847,40.4938735961914,42.5115051269531,44.5404002666473,46.558263540268,48.5854318141937,50.6033477783203,52.6314356327057,54.6603417396545,56.6886551380158,58.7071709632874,60.7251427173614,62.7441871166229,64.7737104892731,66.7912445068359,68.8091924190521,70.8426284790039,72.8607482910156,74.8897018432617,76.9081840515137,78.9261751174927,80.9441792964935,82.9677412509918,84.9879932403564,87.0061206817627,89.0278942584991,91.0568780899048,93.0848634243012,95.1022572517395,97.1310386657715,99.1601960659027,101.179169654846,103.208603382111,105.236843347549,107.258184671402,109.275334119797,111.293383359909,113.320950031281,115.339076042175,117.367664337158,119.397574663162,121.424915313721,123.44224190712,125.470163106918,127.488108158112,129.505861759186,131.535129070282,133.563809394836,135.580894947052,137.598472356796,139.626395463943,141.644648075104,143.673717021942,145.690912723541,147.719390153885,149.736649751663,151.764713287354,153.834616184235,155.916539669037,157.994210004807,160.07451915741,162.144522190094,164.216998815537,166.304208517075,168.37425994873,170.444271802902,172.514211177826,174.594503641129,176.674165725708,178.744550228119,180.814155578613,182.884184122086,184.957921266556,187.044563531876,189.124256372452,191.184523105621,193.254497051239,195.344365119934,197.434432029724,199.514251947403,201.59009552002,203.678592681885,205.7541680336,207.83419919014,209.909213781357,211.974491596222,214.044847488403,216.137689113617,218.228764533997,220.314455270767,222.394507884979,224.474491357803,226.558045148849,228.632992744446,230.71451830864,232.794466018677,234.87418794632,236.979636669159,239.054196357727,241.154185533524,243.224474906921,245.304157972336,247.384247303009,249.454136610031,251.535616159439,253.627683162689,255.714479446411,257.804215431213,259.894203662872,261.994546175003,264.07418179512,266.152547359467,268.215158700943,270.294733524323,272.374650239944,274.444313049316,276.514199495316,278.586993694305,280.674216032028,282.744165182114,284.814226388931,286.884227514267,288.954582691193,291.024325847626,293.089700222015,295.164674043655,297.234225988388,299.304201602936,301.385623455048,303.464240789413,305.544275045395,307.614597558975,309.684669017792,311.745650053024,313.834293365479,315.904233455658,317.974655866623,320.034686803818,322.104578256607,324.184145689011,326.254281044006,328.344303369522,330.42424249649,332.504307746887,334.58423948288,336.674275159836,338.745713949203,340.824271678925,342.89469575882,344.960920572281,347.034324884415,349.12474656105,351.214284896851,353.284227609634,355.367317438126,357.454543828964,359.524349927902,361.59428191185,363.674259662628,365.754283666611,367.834347963333,369.923178911209,372.006405353546,374.084367513657,376.154283285141,378.224378347397,380.314347743988,382.395223617554,384.479691743851,386.564305782318,388.634739160538,390.714388370514,392.78431725502,394.845644712448,396.921588420868,399.004400968552,401.074299097061,403.144372224808,405.224364042282,407.303092956543,409.387434959412,411.474275588989,413.544342279434,415.606693267822,417.674699068069,419.774603128433,421.854184389114,423.934783220291,426.014363765717,428.104616641998,430.184233427048,432.260448694229,434.350584506989,436.417112827301,438.504364728928,440.594244241715,442.674660921097,444.764783859253,446.85527920723,448.945179462433,451.024277210236,453.053538560867,455.083364963532,457.106056451798,459.136048316956,461.154045343399,463.182219982147,465.199629545212,467.241543292999,469.269000291824,471.310978889465,473.328767061234,475.373815536499,477.391057729721,479.420005083084,481.43776512146,483.485127687454,485.50254034996,487.5314848423,489.549634456635,491.577487230301,493.595459222794,495.623577833176,497.640824079514,499.668772935867,501.686191797257,503.714600324631,505.743149280548,507.771009683609,509.788773536682,511.816525936127,513.845046520233,515.874504327774,517.891712188721,519.920515298843,521.938120365143,523.965328931809,525.983286380768,528.011971473694,530.029965400696,532.059254646301,534.077288150787,536.107169628143,538.125741958618,540.155350446701,542.173503160477,544.201283693314,546.218697071075,548.247077465057,550.275200605392,552.303561687469,554.320712566376,556.348680019379,558.376531839371,560.404317617416,562.421788930893,564.449963092804,566.46776676178,568.497018814087,570.51460981369,572.542924165726,574.560482025147,576.588244915009,578.605242013931,580.632380962372,582.660135030747,584.67661857605,586.694123506546,588.711023569107,590.737979412079,592.754477500916,594.781418561935,596.797819852829,598.825169801712,,,,,,,,,,,,,,,,,,,,,,,,,,,,,,,,,,,,,,,,,,,,,,,,,,,,,,,,,,,,,,,,,,,,,,,,,,,,,,,,,,,,,,,,,,,,,,,,,,,,,,,,,,,,,,,,,,,,,,,,,,,,,,,,,,,,,,,,,,,,,,,,,,,,,,,,,,,,,,,,,,,,,,,,,,,,,,,,,,,,,,,,,,,,,,,,,,,,,,,,,,,,,,,,,,,,,,,,,,,,,,,,,,,,,,,,,,,,,,,,,,,,,,,,,,,,,,,,,,,,,,,,,,,,,,,,,,,,,,,,,,,,,,,,,,,,,,,,,,,,,,,,,,,,,,,,,,,,,,,,,,,,,,,,,,,,,,,,,,,,,,,,,,,,,,,,,,,,,,,,,,,,,,,,,,,,,,,,,,,,,,,,,,,,,,,,,,,,,,,,,,,,,,,,,,,,,,,,,,,,,,,,,,,,,,,,,,,,,,,,,,,,,,,,,,,,,,,,,,,,,,,,,,,,,,,,,,,,,,,,,,,,,,,,,,,,,,,,,,,,,,,,,,,,,,,,,,,,,,,,,,,,,,,,,,,,,,,,,,,,,,,,,,,,,,,,,,,,,,,,,,,,,,,,,,,,,,,,,,,,,,,,,,,,,,,,,,,,,,,,,,,,,,,,,,,,,,,,,,,,,,,,,,,,,,,,,,,,,,,,,,,,,,,,,,,,,,,,,,,,,,,,,,,,,,,,,,,,,,,,,,,,,,,,,,,,,,,,,,,,,,,,,,,,,,,,,,,,,,,,,,,,,,,,,,
,,,,,,,,,,,,,,,,,,,,,,,,,,,,,,,,,,,,,,,,,,,,,,,,,,,,,,,,,,,,,,,,,,,,,,,,,,,,,,,,,,,,,,,,,,,,,,,,,,,,,,,,,,,,,,,,,,,,,,,,,,,,,,,,,,,,,,,,,,,,,,,,,,,,,,,,,,,,,,,,,,,,,,,,,,,,,,,,,,,,,,,,,,,,,,,,,,,,,,,,,,,,,,,,,,,,,,,,,,,,,,,,,,,,,,,,,,,,,,,,,,,,,,,,,,,,,,,,,,,,,,,,,,,,,,,,,,,,,,,,,,,,,,,,,,,,,,,,,,,,,,,,,,,,,,,,,,,,,,,,,,,,,,,,,,,,,,,,,,,,,,,,,,,,,,,,,,,,,,,,,,,,,,,,,,,,,,,,,,,,,,,,,,,,,,,,,,,,,,,,,,,,,,,,,,,,,,,,,,,,,,,,,,,,,,,,,,,,,,,,,,,,,,,,,,,,,,,,,,,,,,,,,,,,,,,,,,,,,,,,,,,,,,,,,,,,,,,,,,,,,,,,,,,,,,,,,,,,,,,,,,,,,,,,,,,,,,,,,,,,,,,,,,,,,,,,,,,,,,,,,,,,,,,,,,,,,,,,,,,,,,,,,,,,,,,,,,,,,,,,,,,,,,,,,,,,,,,,,,,,,,,,,,,,,,,,,,,,,,,,,,,,,,,,,,,,,,,,,,,,,,,,,,,,,,,,,,,,,,,,,,,,,,,,,,,,,,,,,,,,,,,,,,,,,,,,,,,,,,,,,,,,,,,,,,,,,,,,,,,,,,,,,,,,,,,,,,,,,,,,,,,,,,,,,,,,,,,,,,,,,,,,,,,,,,,,,,,,,,,,,,,,,,,,,,,,,,,,,,,,,,,,,,,,,,,,,,,,,,,,,,,,,,,,,,,,,,,,,,,,,,,,,,,,,,,,,,,,,,,,,,,,,,,,,,,,,,,,,,,,,,,,,,,,,,,,,,,,,,,,,,,,,,,,,,,,,,,,,,,,,,,,,,,,,,,,,,,,,,,,,,,,,,,,,,,,,,,,,,,,,,,,,,,,,,,,,,,,,,,,,,,,,,,,,,,,,,,,,,,,,,,
nätadapter,snitt cpuFreq,antal värden,,Snitt Temperatur,antal värden,,,,,,,,,,,,,,,,,,,,,,,,,,,,,,,,,,,,,,,,,,,,,,,,,,,,,,,,,,,,,,,,,,,,,,,,,,,,,,,,,,,,,,,,,,,,,,,,,,,,,,,,,,,,,,,,,,,,,,,,,,,,,,,,,,,,,,,,,,,,,,,,,,,,,,,,,,,,,,,,,,,,,,,,,,,,,,,,,,,,,,,,,,,,,,,,,,,,,,,,,,,,,,,,,,,,,,,,,,,,,,,,,,,,,,,,,,,,,,,,,,,,,,,,,,,,,,,,,,,,,,,,,,,,,,,,,,,,,,,,,,,,,,,,,,,,,,,,,,,,,,,,,,,,,,,,,,,,,,,,,,,,,,,,,,,,,,,,,,,,,,,,,,,,,,,,,,,,,,,,,,,,,,,,,,,,,,,,,,,,,,,,,,,,,,,,,,,,,,,,,,,,,,,,,,,,,,,,,,,,,,,,,,,,,,,,,,,,,,,,,,,,,,,,,,,,,,,,,,,,,,,,,,,,,,,,,,,,,,,,,,,,,,,,,,,,,,,,,,,,,,,,,,,,,,,,,,,,,,,,,,,,,,,,,,,,,,,,,,,,,,,,,,,,,,,,,,,,,,,,,,,,,,,,,,,,,,,,,,,,,,,,,,,,,,,,,,,,,,,,,,,,,,,,,,,,,,,,,,,,,,,,,,,,,,,,,,,,,,,,,,,,,,,,,,,,,,,,,,,,,,,,,,,,,,,,,,,,,,,,,,,,,,,,,,,,,,,,,,,,,,,,,,,,,,,,,,,,,,,,,,,,,,,,,,,,,,,,,,,,,,,,,,,,,,,,,,,,,,,,,,,,,,,,,,,,,,,,,,,,,,,,,,,,,,,,,,,,,,,,,,,,,,,,,,,,,,,,,,,,,,,,,,,,,,,,,,,,,,,,,,,,,,,,,,,,,,,,,,,,,,,,,,,,,,,,,,,,,,,,,,,,,,,,,,,,,,,,,,,,,,,,,,,,,,,,,,,,,,,,,,,,,,,,,,,,,,,,,,,,,,,,,,,,,,,,,,,,,,,,,,,,,,,,,,,,,,,,,,,,,,,,,,,,,,,,,,,,,,,,,,,,,,,,,,,,,,,,,,
goobay,978.68619112628,293,,69.3264907135877,1023,,,,,,,,,,,,,,,,,,,,,,,,,,,,,,,,,,,,,,,,,,,,,,,,,,,,,,,,,,,,,,,,,,,,,,,,,,,,,,,,,,,,,,,,,,,,,,,,,,,,,,,,,,,,,,,,,,,,,,,,,,,,,,,,,,,,,,,,,,,,,,,,,,,,,,,,,,,,,,,,,,,,,,,,,,,,,,,,,,,,,,,,,,,,,,,,,,,,,,,,,,,,,,,,,,,,,,,,,,,,,,,,,,,,,,,,,,,,,,,,,,,,,,,,,,,,,,,,,,,,,,,,,,,,,,,,,,,,,,,,,,,,,,,,,,,,,,,,,,,,,,,,,,,,,,,,,,,,,,,,,,,,,,,,,,,,,,,,,,,,,,,,,,,,,,,,,,,,,,,,,,,,,,,,,,,,,,,,,,,,,,,,,,,,,,,,,,,,,,,,,,,,,,,,,,,,,,,,,,,,,,,,,,,,,,,,,,,,,,,,,,,,,,,,,,,,,,,,,,,,,,,,,,,,,,,,,,,,,,,,,,,,,,,,,,,,,,,,,,,,,,,,,,,,,,,,,,,,,,,,,,,,,,,,,,,,,,,,,,,,,,,,,,,,,,,,,,,,,,,,,,,,,,,,,,,,,,,,,,,,,,,,,,,,,,,,,,,,,,,,,,,,,,,,,,,,,,,,,,,,,,,,,,,,,,,,,,,,,,,,,,,,,,,,,,,,,,,,,,,,,,,,,,,,,,,,,,,,,,,,,,,,,,,,,,,,,,,,,,,,,,,,,,,,,,,,,,,,,,,,,,,,,,,,,,,,,,,,,,,,,,,,,,,,,,,,,,,,,,,,,,,,,,,,,,,,,,,,,,,,,,,,,,,,,,,,,,,,,,,,,,,,,,,,,,,,,,,,,,,,,,,,,,,,,,,,,,,,,,,,,,,,,,,,,,,,,,,,,,,,,,,,,,,,,,,,,,,,,,,,,,,,,,,,,,,,,,,,,,,,,,,,,,,,,,,,,,,,,,,,,,,,,,,,,,,,,,,,,,,,,,,,,,,,,,,,,,,,,,,,,,,,,,,,,,,,,,,,,,,,,,,,,,,,,,,,,,,,,,,,,,,,,,,,,,,,,,,,,,
deltaco,610.274212328767,292,,59.5496575342465,292,,,,,,,,,,,,,,,,,,,,,,,,,,,,,,,,,,,,,,,,,,,,,,,,,,,,,,,,,,,,,,,,,,,,,,,,,,,,,,,,,,,,,,,,,,,,,,,,,,,,,,,,,,,,,,,,,,,,,,,,,,,,,,,,,,,,,,,,,,,,,,,,,,,,,,,,,,,,,,,,,,,,,,,,,,,,,,,,,,,,,,,,,,,,,,,,,,,,,,,,,,,,,,,,,,,,,,,,,,,,,,,,,,,,,,,,,,,,,,,,,,,,,,,,,,,,,,,,,,,,,,,,,,,,,,,,,,,,,,,,,,,,,,,,,,,,,,,,,,,,,,,,,,,,,,,,,,,,,,,,,,,,,,,,,,,,,,,,,,,,,,,,,,,,,,,,,,,,,,,,,,,,,,,,,,,,,,,,,,,,,,,,,,,,,,,,,,,,,,,,,,,,,,,,,,,,,,,,,,,,,,,,,,,,,,,,,,,,,,,,,,,,,,,,,,,,,,,,,,,,,,,,,,,,,,,,,,,,,,,,,,,,,,,,,,,,,,,,,,,,,,,,,,,,,,,,,,,,,,,,,,,,,,,,,,,,,,,,,,,,,,,,,,,,,,,,,,,,,,,,,,,,,,,,,,,,,,,,,,,,,,,,,,,,,,,,,,,,,,,,,,,,,,,,,,,,,,,,,,,,,,,,,,,,,,,,,,,,,,,,,,,,,,,,,,,,,,,,,,,,,,,,,,,,,,,,,,,,,,,,,,,,,,,,,,,,,,,,,,,,,,,,,,,,,,,,,,,,,,,,,,,,,,,,,,,,,,,,,,,,,,,,,,,,,,,,,,,,,,,,,,,,,,,,,,,,,,,,,,,,,,,,,,,,,,,,,,,,,,,,,,,,,,,,,,,,,,,,,,,,,,,,,,,,,,,,,,,,,,,,,,,,,,,,,,,,,,,,,,,,,,,,,,,,,,,,,,,,,,,,,,,,,,,,,,,,,,,,,,,,,,,,,,,,,,,,,,,,,,,,,,,,,,,,,,,,,,,,,,,,,,,,,,,,,,,,,,,,,,,,,,,,,,,,,,,,,,,,,,,,,,,,,,,,,,,,,,,,,,,,,,,,,,,,,,,,,,,,,,
"deltaco good cable  5V 2,4A:",1027.51910580205,293,,66.7515358361775,293,,,,,,,,,,,,,,,,,,,,,,,,,,,,,,,,,,,,,,,,,,,,,,,,,,,,,,,,,,,,,,,,,,,,,,,,,,,,,,,,,,,,,,,,,,,,,,,,,,,,,,,,,,,,,,,,,,,,,,,,,,,,,,,,,,,,,,,,,,,,,,,,,,,,,,,,,,,,,,,,,,,,,,,,,,,,,,,,,,,,,,,,,,,,,,,,,,,,,,,,,,,,,,,,,,,,,,,,,,,,,,,,,,,,,,,,,,,,,,,,,,,,,,,,,,,,,,,,,,,,,,,,,,,,,,,,,,,,,,,,,,,,,,,,,,,,,,,,,,,,,,,,,,,,,,,,,,,,,,,,,,,,,,,,,,,,,,,,,,,,,,,,,,,,,,,,,,,,,,,,,,,,,,,,,,,,,,,,,,,,,,,,,,,,,,,,,,,,,,,,,,,,,,,,,,,,,,,,,,,,,,,,,,,,,,,,,,,,,,,,,,,,,,,,,,,,,,,,,,,,,,,,,,,,,,,,,,,,,,,,,,,,,,,,,,,,,,,,,,,,,,,,,,,,,,,,,,,,,,,,,,,,,,,,,,,,,,,,,,,,,,,,,,,,,,,,,,,,,,,,,,,,,,,,,,,,,,,,,,,,,,,,,,,,,,,,,,,,,,,,,,,,,,,,,,,,,,,,,,,,,,,,,,,,,,,,,,,,,,,,,,,,,,,,,,,,,,,,,,,,,,,,,,,,,,,,,,,,,,,,,,,,,,,,,,,,,,,,,,,,,,,,,,,,,,,,,,,,,,,,,,,,,,,,,,,,,,,,,,,,,,,,,,,,,,,,,,,,,,,,,,,,,,,,,,,,,,,,,,,,,,,,,,,,,,,,,,,,,,,,,,,,,,,,,,,,,,,,,,,,,,,,,,,,,,,,,,,,,,,,,,,,,,,,,,,,,,,,,,,,,,,,,,,,,,,,,,,,,,,,,,,,,,,,,,,,,,,,,,,,,,,,,,,,,,,,,,,,,,,,,,,,,,,,,,,,,,,,,,,,,,,,,,,,,,,,,,,,,,,,,,,,,,,,,,,,,,,,,,,,,,,,,,,,,,,,,,,,,,,,,,,,,,,,,,,,,,,,,,
"deltaco good cable USB-c 5V 2,4A:",1011.55995221843,293,,66.6959044368602,293,,,,,,,,,,,,,,,,,,,,,,,,,,,,,,,,,,,,,,,,,,,,,,,,,,,,,,,,,,,,,,,,,,,,,,,,,,,,,,,,,,,,,,,,,,,,,,,,,,,,,,,,,,,,,,,,,,,,,,,,,,,,,,,,,,,,,,,,,,,,,,,,,,,,,,,,,,,,,,,,,,,,,,,,,,,,,,,,,,,,,,,,,,,,,,,,,,,,,,,,,,,,,,,,,,,,,,,,,,,,,,,,,,,,,,,,,,,,,,,,,,,,,,,,,,,,,,,,,,,,,,,,,,,,,,,,,,,,,,,,,,,,,,,,,,,,,,,,,,,,,,,,,,,,,,,,,,,,,,,,,,,,,,,,,,,,,,,,,,,,,,,,,,,,,,,,,,,,,,,,,,,,,,,,,,,,,,,,,,,,,,,,,,,,,,,,,,,,,,,,,,,,,,,,,,,,,,,,,,,,,,,,,,,,,,,,,,,,,,,,,,,,,,,,,,,,,,,,,,,,,,,,,,,,,,,,,,,,,,,,,,,,,,,,,,,,,,,,,,,,,,,,,,,,,,,,,,,,,,,,,,,,,,,,,,,,,,,,,,,,,,,,,,,,,,,,,,,,,,,,,,,,,,,,,,,,,,,,,,,,,,,,,,,,,,,,,,,,,,,,,,,,,,,,,,,,,,,,,,,,,,,,,,,,,,,,,,,,,,,,,,,,,,,,,,,,,,,,,,,,,,,,,,,,,,,,,,,,,,,,,,,,,,,,,,,,,,,,,,,,,,,,,,,,,,,,,,,,,,,,,,,,,,,,,,,,,,,,,,,,,,,,,,,,,,,,,,,,,,,,,,,,,,,,,,,,,,,,,,,,,,,,,,,,,,,,,,,,,,,,,,,,,,,,,,,,,,,,,,,,,,,,,,,,,,,,,,,,,,,,,,,,,,,,,,,,,,,,,,,,,,,,,,,,,,,,,,,,,,,,,,,,,,,,,,,,,,,,,,,,,,,,,,,,,,,,,,,,,,,,,,,,,,,,,,,,,,,,,,,,,,,,,,,,,,,,,,,,,,,,,,,,,,,,,,,,,,,,,,,,,,,,,,,,,,,,,,,,,,,,,,,,,,,,,,,,,,,,,,
