{
  "variables": {
    "name": "testProg",
    "mainClass": "it.lundstedt.erik.Main",
    "mainPath": "it/lundstedt/erik/",
    "//ClassPath": "\n",
    "ClassPath": "Class-Path: lib/openMenuLib.jar\n"
  },
  "targets":{
    "custom":"setup;testing;"    
  },
  "doDebug": true,
  "doBeVerbose": true,
  "version": 123
}
