<?xml version="1.0" encoding="UTF-8" standalone="no"?>
<!-- Created with Inkscape (http://www.inkscape.org/) -->

<svg
   xmlns:dc="http://purl.org/dc/elements/1.1/"
   xmlns:cc="http://creativecommons.org/ns#"
   xmlns:rdf="http://www.w3.org/1999/02/22-rdf-syntax-ns#"
   xmlns:svg="http://www.w3.org/2000/svg"
   xmlns="http://www.w3.org/2000/svg"
   xmlns:xlink="http://www.w3.org/1999/xlink"
   xmlns:sodipodi="http://sodipodi.sourceforge.net/DTD/sodipodi-0.dtd"
   xmlns:inkscape="http://www.inkscape.org/namespaces/inkscape"
   version="1.1"
   width="64"
   height="22"
   id="svg3273"
   inkscape:version="0.48.2 r9819"
   sodipodi:docname="toggle-off-intl.svg">
  <sodipodi:namedview
     pagecolor="#1e1e1e"
     bordercolor="#bc1010"
     borderopacity="1"
     objecttolerance="10"
     gridtolerance="10"
     guidetolerance="10"
     inkscape:pageopacity="1"
     inkscape:pageshadow="2"
     inkscape:window-width="1280"
     inkscape:window-height="740"
     id="namedview68"
     showgrid="true"
     showguides="true"
     inkscape:guide-bbox="true"
     inkscape:showpageshadow="false"
     showborder="false"
     inkscape:zoom="11.971257"
     inkscape:cx="4.2457376"
     inkscape:cy="10.414796"
     inkscape:window-x="0"
     inkscape:window-y="25"
     inkscape:window-maximized="1"
     inkscape:current-layer="layer2">
    <inkscape:grid
       type="xygrid"
       id="grid3045"
       empspacing="8"
       visible="true"
       enabled="true"
       snapvisiblegridlinesonly="true" />
    <sodipodi:guide
       orientation="1,0"
       position="0,14"
       id="guide4279" />
    <sodipodi:guide
       orientation="0,1"
       position="38,22"
       id="guide4281" />
    <sodipodi:guide
       orientation="0,1"
       position="35,0"
       id="guide4283" />
    <sodipodi:guide
       orientation="1,0"
       position="64,7"
       id="guide4285" />
  </sodipodi:namedview>
  <defs
     id="defs3275">
    <linearGradient
       id="linearGradient3883">
      <stop
         id="stop3885"
         style="stop-color:#242837;stop-opacity:1"
         offset="0" />
      <stop
         id="stop3887"
         style="stop-color:#242837;stop-opacity:1"
         offset="1" />
    </linearGradient>
    <linearGradient
       id="linearGradient4649">
      <stop
         id="stop4651"
         style="stop-color:#000000;stop-opacity:0;"
         offset="0" />
      <stop
         id="stop4653"
         style="stop-color:#000000;stop-opacity:0.27450982;"
         offset="1" />
    </linearGradient>
    <linearGradient
       id="linearGradient3921">
      <stop
         offset="0"
         style="stop-color:#ffffff;stop-opacity:0;"
         id="stop3923" />
      <stop
         offset="1"
         style="stop-color:#ffffff;stop-opacity:0.15686275;"
         id="stop3925" />
    </linearGradient>
    <linearGradient
       inkscape:collect="always"
       id="linearGradient3985">
      <stop
         style="stop-color:#ffffff;stop-opacity:1;"
         offset="0"
         id="stop3987" />
      <stop
         style="stop-color:#ffffff;stop-opacity:0;"
         offset="1"
         id="stop3989" />
    </linearGradient>
    <linearGradient
       id="linearGradient3938">
      <stop
         style="stop-color:#a0a0a0;stop-opacity:1;"
         offset="0"
         id="stop3940" />
      <stop
         style="stop-color:#dcdcdc;stop-opacity:1;"
         offset="1"
         id="stop3942" />
    </linearGradient>
    <linearGradient
       id="linearGradient4095">
      <stop
         id="stop4097"
         style="stop-color:#131313;stop-opacity:1"
         offset="0" />
      <stop
         id="stop4099"
         style="stop-color:#131313;stop-opacity:0"
         offset="1" />
    </linearGradient>
    <linearGradient
       inkscape:collect="always"
       xlink:href="#linearGradient3921"
       id="linearGradient3152"
       gradientUnits="userSpaceOnUse"
       gradientTransform="translate(-64.499996,-20.499994)"
       x1="40.8125"
       y1="19.5"
       x2="40.8125"
       y2="-0.5" />
    <linearGradient
       inkscape:collect="always"
       xlink:href="#linearGradient3938"
       id="linearGradient3128"
       gradientUnits="userSpaceOnUse"
       gradientTransform="translate(-32,0)"
       x1="48"
       y1="21"
       x2="48"
       y2="2" />
    <linearGradient
       id="linearGradient3990-9">
      <stop
         id="stop3992-5"
         style="stop-color:#ffffff;stop-opacity:1"
         offset="0" />
      <stop
         id="stop3994-0"
         style="stop-color:#ffffff;stop-opacity:0"
         offset="1" />
    </linearGradient>
    <linearGradient
       y2="39"
       x2="41"
       y1="1"
       x1="41"
       gradientUnits="userSpaceOnUse"
       id="linearGradient3077-4"
       xlink:href="#linearGradient4095"
       inkscape:collect="always"
       gradientTransform="matrix(1,0,0,-1,-32,22)" />
    <radialGradient
       inkscape:collect="always"
       xlink:href="#linearGradient3988"
       id="radialGradient4013"
       gradientUnits="userSpaceOnUse"
       gradientTransform="matrix(11,0,0,10,-448,-99)"
       cx="42.5"
       cy="11"
       fx="42.5"
       fy="11"
       r="0.5" />
    <linearGradient
       id="linearGradient3988">
      <stop
         id="stop3990"
         offset="0"
         style="stop-color:#000000;stop-opacity:1;" />
      <stop
         style="stop-color:#000000;stop-opacity:0.70588237;"
         offset="0.60000002"
         id="stop3997" />
      <stop
         id="stop3993"
         offset="1"
         style="stop-color:#000000;stop-opacity:0;" />
    </linearGradient>
    <radialGradient
       inkscape:collect="always"
       xlink:href="#linearGradient3976"
       id="radialGradient4011"
       gradientUnits="userSpaceOnUse"
       gradientTransform="matrix(11,0,0,10,-447,-99)"
       cx="42.5"
       cy="11"
       fx="42.5"
       fy="11"
       r="0.5" />
    <linearGradient
       id="linearGradient3976">
      <stop
         style="stop-color:#ffffff;stop-opacity:1;"
         offset="0"
         id="stop3978" />
      <stop
         id="stop3995"
         offset="0.60000002"
         style="stop-color:#ffffff;stop-opacity:0.70588237;" />
      <stop
         style="stop-color:#ffffff;stop-opacity:0;"
         offset="1"
         id="stop3980" />
    </linearGradient>
    <radialGradient
       inkscape:collect="always"
       xlink:href="#linearGradient3988"
       id="radialGradient4005"
       gradientUnits="userSpaceOnUse"
       gradientTransform="matrix(11,0,0,10,-452,-99)"
       cx="42.5"
       cy="11"
       fx="42.5"
       fy="11"
       r="0.5" />
    <radialGradient
       inkscape:collect="always"
       xlink:href="#linearGradient3976"
       id="radialGradient4003"
       gradientUnits="userSpaceOnUse"
       gradientTransform="matrix(11,0,0,10,-451,-99)"
       cx="42.5"
       cy="11"
       fx="42.5"
       fy="11"
       r="0.5" />
    <radialGradient
       inkscape:collect="always"
       xlink:href="#linearGradient3988"
       id="radialGradient3986"
       gradientUnits="userSpaceOnUse"
       gradientTransform="matrix(11,0,0,10,-456,-99)"
       cx="42.5"
       cy="11"
       fx="42.5"
       fy="11"
       r="0.5" />
    <radialGradient
       r="0.5"
       fy="11"
       fx="42.5"
       cy="11"
       cx="42.5"
       gradientTransform="matrix(11,0,0,10,-455,-99)"
       gradientUnits="userSpaceOnUse"
       id="radialGradient4077"
       xlink:href="#linearGradient3976"
       inkscape:collect="always" />
    <linearGradient
       inkscape:collect="always"
       xlink:href="#linearGradient3938"
       id="linearGradient3951"
       gradientUnits="userSpaceOnUse"
       gradientTransform="translate(-32,0)"
       x1="48"
       y1="21"
       x2="48"
       y2="2" />
    <linearGradient
       inkscape:collect="always"
       xlink:href="#linearGradient3990-9"
       id="linearGradient3953"
       gradientUnits="userSpaceOnUse"
       gradientTransform="translate(-32,0)"
       x1="41"
       y1="1"
       x2="41"
       y2="28" />
    <radialGradient
       inkscape:collect="always"
       xlink:href="#linearGradient3976"
       id="radialGradient3955"
       gradientUnits="userSpaceOnUse"
       gradientTransform="matrix(11,0,0,10,-455,-99)"
       cx="42.5"
       cy="11"
       fx="42.5"
       fy="11"
       r="0.5" />
    <radialGradient
       inkscape:collect="always"
       xlink:href="#linearGradient3988"
       id="radialGradient3957"
       gradientUnits="userSpaceOnUse"
       gradientTransform="matrix(11,0,0,10,-456,-99)"
       cx="42.5"
       cy="11"
       fx="42.5"
       fy="11"
       r="0.5" />
    <radialGradient
       inkscape:collect="always"
       xlink:href="#linearGradient3976"
       id="radialGradient3959"
       gradientUnits="userSpaceOnUse"
       gradientTransform="matrix(11,0,0,10,-451,-99)"
       cx="42.5"
       cy="11"
       fx="42.5"
       fy="11"
       r="0.5" />
    <radialGradient
       inkscape:collect="always"
       xlink:href="#linearGradient3988"
       id="radialGradient3961"
       gradientUnits="userSpaceOnUse"
       gradientTransform="matrix(11,0,0,10,-452,-99)"
       cx="42.5"
       cy="11"
       fx="42.5"
       fy="11"
       r="0.5" />
    <radialGradient
       inkscape:collect="always"
       xlink:href="#linearGradient3976"
       id="radialGradient3963"
       gradientUnits="userSpaceOnUse"
       gradientTransform="matrix(11,0,0,10,-447,-99)"
       cx="42.5"
       cy="11"
       fx="42.5"
       fy="11"
       r="0.5" />
    <radialGradient
       inkscape:collect="always"
       xlink:href="#linearGradient3988"
       id="radialGradient3965"
       gradientUnits="userSpaceOnUse"
       gradientTransform="matrix(11,0,0,10,-448,-99)"
       cx="42.5"
       cy="11"
       fx="42.5"
       fy="11"
       r="0.5" />
    <linearGradient
       inkscape:collect="always"
       xlink:href="#linearGradient3938"
       id="linearGradient3971"
       gradientUnits="userSpaceOnUse"
       gradientTransform="translate(-32,0)"
       x1="48"
       y1="21"
       x2="48"
       y2="2" />
    <linearGradient
       inkscape:collect="always"
       xlink:href="#linearGradient3938"
       id="linearGradient3975"
       gradientUnits="userSpaceOnUse"
       gradientTransform="translate(-32,0)"
       x1="48"
       y1="21"
       x2="48"
       y2="2" />
    <linearGradient
       inkscape:collect="always"
       xlink:href="#linearGradient3938"
       id="linearGradient3978"
       gradientUnits="userSpaceOnUse"
       gradientTransform="translate(-32,0)"
       x1="48"
       y1="21"
       x2="48"
       y2="2" />
    <linearGradient
       inkscape:collect="always"
       xlink:href="#linearGradient3938"
       id="linearGradient3983"
       gradientUnits="userSpaceOnUse"
       gradientTransform="translate(-32,0)"
       x1="48"
       y1="21"
       x2="48"
       y2="2" />
    <linearGradient
       inkscape:collect="always"
       xlink:href="#linearGradient3938"
       id="linearGradient4062"
       gradientUnits="userSpaceOnUse"
       gradientTransform="translate(-32,0)"
       x1="48"
       y1="21"
       x2="48"
       y2="2" />
    <linearGradient
       inkscape:collect="always"
       xlink:href="#linearGradient3938"
       id="linearGradient4066"
       gradientUnits="userSpaceOnUse"
       gradientTransform="translate(-32,0)"
       x1="48"
       y1="21"
       x2="48"
       y2="2" />
    <linearGradient
       inkscape:collect="always"
       xlink:href="#linearGradient3938"
       id="linearGradient4071"
       gradientUnits="userSpaceOnUse"
       gradientTransform="translate(-32,0)"
       x1="48"
       y1="21"
       x2="48"
       y2="2" />
    <linearGradient
       inkscape:collect="always"
       xlink:href="#linearGradient3985"
       id="linearGradient4074"
       gradientUnits="userSpaceOnUse"
       gradientTransform="matrix(1,0,0,-1,-32,22)"
       x1="48"
       y1="21"
       x2="48"
       y2="-4" />
    <radialGradient
       inkscape:collect="always"
       xlink:href="#linearGradient3988-5"
       id="radialGradient4013-9"
       gradientUnits="userSpaceOnUse"
       gradientTransform="matrix(11,0,0,10,-448,-99)"
       cx="42.5"
       cy="11"
       fx="42.5"
       fy="11"
       r="0.5" />
    <linearGradient
       id="linearGradient3988-5">
      <stop
         id="stop3990-8"
         offset="0"
         style="stop-color:#000000;stop-opacity:1;" />
      <stop
         style="stop-color:#000000;stop-opacity:0.70588237;"
         offset="0.60000002"
         id="stop3997-5" />
      <stop
         id="stop3993-8"
         offset="1"
         style="stop-color:#000000;stop-opacity:0;" />
    </linearGradient>
    <radialGradient
       inkscape:collect="always"
       xlink:href="#linearGradient3976-2"
       id="radialGradient4011-7"
       gradientUnits="userSpaceOnUse"
       gradientTransform="matrix(11,0,0,10,-447,-99)"
       cx="42.5"
       cy="11"
       fx="42.5"
       fy="11"
       r="0.5" />
    <linearGradient
       id="linearGradient3976-2">
      <stop
         style="stop-color:#ffffff;stop-opacity:1;"
         offset="0"
         id="stop3978-8" />
      <stop
         id="stop3995-9"
         offset="0.60000002"
         style="stop-color:#ffffff;stop-opacity:0.70588237;" />
      <stop
         style="stop-color:#ffffff;stop-opacity:0;"
         offset="1"
         id="stop3980-6" />
    </linearGradient>
    <radialGradient
       inkscape:collect="always"
       xlink:href="#linearGradient3988-5"
       id="radialGradient4005-9"
       gradientUnits="userSpaceOnUse"
       gradientTransform="matrix(11,0,0,10,-452,-99)"
       cx="42.5"
       cy="11"
       fx="42.5"
       fy="11"
       r="0.5" />
    <radialGradient
       inkscape:collect="always"
       xlink:href="#linearGradient3976-2"
       id="radialGradient4003-1"
       gradientUnits="userSpaceOnUse"
       gradientTransform="matrix(11,0,0,10,-451,-99)"
       cx="42.5"
       cy="11"
       fx="42.5"
       fy="11"
       r="0.5" />
    <radialGradient
       inkscape:collect="always"
       xlink:href="#linearGradient3988-5"
       id="radialGradient3986-1"
       gradientUnits="userSpaceOnUse"
       gradientTransform="matrix(11,0,0,10,-456,-99)"
       cx="42.5"
       cy="11"
       fx="42.5"
       fy="11"
       r="0.5" />
    <radialGradient
       r="0.5"
       fy="11"
       fx="42.5"
       cy="11"
       cx="42.5"
       gradientTransform="matrix(11,0,0,10,-455,-99)"
       gradientUnits="userSpaceOnUse"
       id="radialGradient4077-8"
       xlink:href="#linearGradient3976-2"
       inkscape:collect="always" />
    <linearGradient
       y2="28"
       x2="41"
       y1="1"
       x1="41"
       gradientUnits="userSpaceOnUse"
       id="linearGradient3077-4-9"
       xlink:href="#linearGradient3990-9-4"
       inkscape:collect="always"
       gradientTransform="translate(-32,0)" />
    <linearGradient
       id="linearGradient3990-9-4">
      <stop
         id="stop3992-5-7"
         style="stop-color:#ffffff;stop-opacity:1"
         offset="0" />
      <stop
         id="stop3994-0-8"
         style="stop-color:#ffffff;stop-opacity:0"
         offset="1" />
    </linearGradient>
    <linearGradient
       id="linearGradient3938-4">
      <stop
         style="stop-color:#a0a0a0;stop-opacity:1;"
         offset="0"
         id="stop3940-9" />
      <stop
         style="stop-color:#dcdcdc;stop-opacity:1;"
         offset="1"
         id="stop3942-9" />
    </linearGradient>
    <linearGradient
       y2="2"
       x2="48"
       y1="21"
       x1="48"
       gradientTransform="translate(-32,0)"
       gradientUnits="userSpaceOnUse"
       id="linearGradient3228"
       xlink:href="#linearGradient3938-4"
       inkscape:collect="always" />
    <linearGradient
       inkscape:collect="always"
       xlink:href="#linearGradient3938-4"
       id="linearGradient4265"
       gradientUnits="userSpaceOnUse"
       gradientTransform="translate(-32,0)"
       x1="48"
       y1="21"
       x2="48"
       y2="2" />
    <radialGradient
       inkscape:collect="always"
       xlink:href="#linearGradient3988-5-7"
       id="radialGradient4013-9-2"
       gradientUnits="userSpaceOnUse"
       gradientTransform="matrix(11,0,0,10,-447,-99)"
       cx="42.5"
       cy="11"
       fx="42.5"
       fy="11"
       r="0.5" />
    <linearGradient
       id="linearGradient3988-5-7">
      <stop
         id="stop3990-8-2"
         offset="0"
         style="stop-color:#000000;stop-opacity:1;" />
      <stop
         style="stop-color:#000000;stop-opacity:0.70588237;"
         offset="0.60000002"
         id="stop3997-5-7" />
      <stop
         id="stop3993-8-6"
         offset="1"
         style="stop-color:#000000;stop-opacity:0;" />
    </linearGradient>
    <radialGradient
       inkscape:collect="always"
       xlink:href="#linearGradient3976-2-0"
       id="radialGradient4011-7-2"
       gradientUnits="userSpaceOnUse"
       gradientTransform="matrix(11,0,0,10,-446,-99)"
       cx="42.5"
       cy="11"
       fx="42.5"
       fy="11"
       r="0.5" />
    <linearGradient
       id="linearGradient3976-2-0">
      <stop
         style="stop-color:#ffffff;stop-opacity:1;"
         offset="0"
         id="stop3978-8-5" />
      <stop
         id="stop3995-9-0"
         offset="0.60000002"
         style="stop-color:#ffffff;stop-opacity:0.70588237;" />
      <stop
         style="stop-color:#ffffff;stop-opacity:0;"
         offset="1"
         id="stop3980-6-1" />
    </linearGradient>
    <radialGradient
       inkscape:collect="always"
       xlink:href="#linearGradient3988-5-7"
       id="radialGradient4005-9-8"
       gradientUnits="userSpaceOnUse"
       gradientTransform="matrix(11,0,0,10,-451,-99)"
       cx="42.5"
       cy="11"
       fx="42.5"
       fy="11"
       r="0.5" />
    <radialGradient
       inkscape:collect="always"
       xlink:href="#linearGradient3976-2-0"
       id="radialGradient4003-1-6"
       gradientUnits="userSpaceOnUse"
       gradientTransform="matrix(11,0,0,10,-450,-99)"
       cx="42.5"
       cy="11"
       fx="42.5"
       fy="11"
       r="0.5" />
    <radialGradient
       inkscape:collect="always"
       xlink:href="#linearGradient3988-5-7"
       id="radialGradient3986-1-3"
       gradientUnits="userSpaceOnUse"
       gradientTransform="matrix(11,0,0,10,-455,-99)"
       cx="42.5"
       cy="11"
       fx="42.5"
       fy="11"
       r="0.5" />
    <radialGradient
       r="0.5"
       fy="11"
       fx="42.5"
       cy="11"
       cx="42.5"
       gradientTransform="matrix(11,0,0,10,-454,-99)"
       gradientUnits="userSpaceOnUse"
       id="radialGradient4077-8-1"
       xlink:href="#linearGradient3976-2-0"
       inkscape:collect="always" />
    <linearGradient
       y2="28"
       x2="41"
       y1="1"
       x1="41"
       gradientUnits="userSpaceOnUse"
       id="linearGradient3077-4-9-4"
       xlink:href="#linearGradient3990-9-4-5"
       inkscape:collect="always"
       gradientTransform="translate(-32,-1)" />
    <linearGradient
       id="linearGradient3990-9-4-5">
      <stop
         id="stop3992-5-7-1"
         style="stop-color:#bebebe;stop-opacity:1"
         offset="0" />
      <stop
         id="stop3994-0-8-2"
         style="stop-color:#bebebe;stop-opacity:0"
         offset="1" />
    </linearGradient>
    <linearGradient
       y2="2"
       x2="48"
       y1="21"
       x1="48"
       gradientTransform="translate(-32,-1)"
       gradientUnits="userSpaceOnUse"
       id="linearGradient3228-0"
       xlink:href="#linearGradient3938-4-7"
       inkscape:collect="always" />
    <linearGradient
       id="linearGradient3938-4-7">
      <stop
         style="stop-color:#242837;stop-opacity:1;"
         offset="0"
         id="stop3940-9-2" />
      <stop
         style="stop-color:#242837;stop-opacity:1;"
         offset="1"
         id="stop3942-9-2" />
    </linearGradient>
    <linearGradient
       inkscape:collect="always"
       xlink:href="#linearGradient3921-5"
       id="linearGradient3152-1"
       gradientUnits="userSpaceOnUse"
       gradientTransform="translate(-64.499996,-20.499994)"
       x1="40.8125"
       y1="18.499994"
       x2="40.8125"
       y2="0.49999401" />
    <linearGradient
       id="linearGradient3921-5">
      <stop
         offset="0"
         style="stop-color:#ffffff;stop-opacity:0;"
         id="stop3923-6" />
      <stop
         offset="1"
         style="stop-color:#ffffff;stop-opacity:0.15686275;"
         id="stop3925-4" />
    </linearGradient>
    <filter
       inkscape:collect="always"
       id="filter4131-3"
       x="-0.12"
       width="1.24"
       y="-0.12"
       height="1.24"
       color-interpolation-filters="sRGB">
      <feGaussianBlur
         inkscape:collect="always"
         stdDeviation="0.5"
         id="feGaussianBlur4133-2" />
    </filter>
    <linearGradient
       inkscape:collect="always"
       xlink:href="#linearGradient3921-5"
       id="linearGradient4525"
       gradientUnits="userSpaceOnUse"
       gradientTransform="translate(-64.499996,-20.499994)"
       x1="40.8125"
       y1="18.499994"
       x2="40.8125"
       y2="0.49999401" />
    <linearGradient
       inkscape:collect="always"
       xlink:href="#linearGradient3938-4-7"
       id="linearGradient4529"
       gradientUnits="userSpaceOnUse"
       gradientTransform="translate(-32,-1)"
       x1="48"
       y1="21"
       x2="48"
       y2="2" />
    <linearGradient
       inkscape:collect="always"
       xlink:href="#linearGradient4649"
       id="linearGradient4550"
       gradientUnits="userSpaceOnUse"
       gradientTransform="matrix(-1,0,0,1,64.499996,1.500006)"
       x1="40.8125"
       y1="18.499994"
       x2="40.8125"
       y2="0.49999401" />
    <linearGradient
       y2="0.49999401"
       x2="40.8125"
       y1="18.499994"
       x1="40.8125"
       gradientTransform="matrix(-1,0,0,-1,64.499996,20.499994)"
       gradientUnits="userSpaceOnUse"
       id="linearGradient4443"
       xlink:href="#linearGradient3921-5-9"
       inkscape:collect="always" />
    <linearGradient
       id="linearGradient3921-5-9">
      <stop
         offset="0"
         style="stop-color:#ffffff;stop-opacity:0;"
         id="stop3923-6-1" />
      <stop
         offset="1"
         style="stop-color:#ffffff;stop-opacity:0.11764706;"
         id="stop3925-4-6" />
    </linearGradient>
    <linearGradient
       y2="0.49999401"
       x2="40.8125"
       y1="18.499994"
       x1="40.8125"
       gradientTransform="matrix(-1,0,0,-1,64.499996,20.499994)"
       gradientUnits="userSpaceOnUse"
       id="linearGradient4615"
       xlink:href="#linearGradient3921-5-9"
       inkscape:collect="always" />
    <linearGradient
       inkscape:collect="always"
       xlink:href="#linearGradient3921-5-9-9"
       id="linearGradient4621"
       gradientUnits="userSpaceOnUse"
       gradientTransform="matrix(-1,0,0,-1,64.499996,20.499994)"
       x1="40.8125"
       y1="18.499994"
       x2="40.8125"
       y2="0.49999401" />
    <linearGradient
       id="linearGradient3921-5-9-9">
      <stop
         offset="0"
         style="stop-color:#333333;stop-opacity:1;"
         id="stop3923-6-1-6" />
      <stop
         offset="1"
         style="stop-color:#555555;stop-opacity:1;"
         id="stop3925-4-6-6" />
    </linearGradient>
    <linearGradient
       y2="0.49999401"
       x2="40.8125"
       y1="18.499994"
       x1="40.8125"
       gradientTransform="matrix(-1,0,0,-1,64.499996,20.499994)"
       gradientUnits="userSpaceOnUse"
       id="linearGradient4641"
       xlink:href="#linearGradient3883"
       inkscape:collect="always" />
  </defs>
  <metadata
     id="metadata3278">
    <rdf:RDF>
      <cc:Work
         rdf:about="">
        <dc:format>image/svg+xml</dc:format>
        <dc:type
           rdf:resource="http://purl.org/dc/dcmitype/StillImage" />
        <dc:title />
      </cc:Work>
    </rdf:RDF>
  </metadata>
  <g
     inkscape:groupmode="layer"
     id="layer2"
     inkscape:label="Trough">
    <path
       sodipodi:type="inkscape:offset"
       inkscape:radius="-1.0053965"
       inkscape:original="M 5 2 C 3.338 2 2 3.338 2 5 L 2 17 C 2 18.662 3.338 20 5 20 L 59 20 C 60.662 20 62 18.662 62 17 L 62 5 C 62 3.338 60.662 2 59 2 L 5 2 z "
       style="color:#000000;fill:url(#linearGradient4641);fill-opacity:1;stroke:none;stroke-width:0.99999994;marker:none;visibility:visible;display:inline;overflow:visible;enable-background:accumulate"
       id="path4619"
       d="M 5,3 C 3.8775991,3 3,3.8775991 3,5 l 0,12 c 0,1.122401 0.8775991,2 2,2 l 54,0 c 1.122401,0 2,-0.877599 2,-2 L 61,5 C 61,3.8775991 60.122401,3 59,3 L 5,3 z" />
    <path
       sodipodi:nodetypes="sssssssssccccc"
       inkscape:connector-curvature="0"
       style="opacity:0.07999998;color:#000000;fill:#000000;fill-opacity:1;stroke:none;stroke-width:0.99999994;marker:none;visibility:visible;display:inline;overflow:visible;enable-background:accumulate"
       d="M 5,2 C 3.338,2 2,3.338 2,5 l 0,12 c 0,1.662 1.338,3 3,3 l 54,0 c 1.662,0 3,-1.338 3,-3 L 62,5 C 62,3.338 60.662,2 59,2 z m 0,3 54,0 0,12 -54,0 z"
       id="rect4052" />
    <path
       sodipodi:nodetypes="ssssssssssssssssss"
       inkscape:connector-curvature="0"
       style="opacity:0.12000002;color:#000000;fill:#000000;fill-opacity:1;stroke:none;stroke-width:0.99999994;marker:none;visibility:visible;display:inline;overflow:visible;enable-background:accumulate"
       d="M 5,2 C 3.338,2 2,3.338 2,5 l 0,12 c 0,1.662 1.338,3 3,3 l 54,0 c 1.662,0 3,-1.338 3,-3 L 62,5 C 62,3.338 60.662,2 59,2 z m 0,2 54,0 c 0.5825,0 1,0.4175 1,1 l 0,12 c 0,0.5825 -0.4175,1 -1,1 L 5,18 C 4.4175,18 4,17.5825 4,17 L 4,5 C 4,4.4175 4.4175,4 5,4 z"
       id="rect4042" />
    <path
       sodipodi:nodetypes="ssssssssssssssssss"
       inkscape:connector-curvature="0"
       style="opacity:0.2;color:#000000;fill:#bebebe;fill-opacity:1;stroke:none;stroke-width:0.99999994;marker:none;visibility:visible;display:inline;overflow:visible;enable-background:accumulate"
       d="M 5,2 C 3.338,2 2,3.338 2,5 l 0,12 c 0,1.662 1.338,3 3,3 l 54,0 c 1.662,0 3,-1.338 3,-3 L 62,5 C 62,3.338 60.662,2 59,2 z m 0,1 54,0 c 1.117387,0 2,0.882613 2,2 l 0,12 c 0,1.117387 -0.882613,2 -2,2 L 5,19 C 3.8826128,19 3,18.117387 3,17 L 3,5 C 3,3.882613 3.8826128,3 5,3 z"
       id="rect4038" />
    <g
       id="g4655"
       transform="translate(-1,0)"
       style="opacity:0.5">
      <path
         inkscape:connector-curvature="0"
         style="opacity:0.5;color:#000000;fill:#000000;fill-opacity:1;fill-rule:nonzero;stroke:none;stroke-width:2;marker:none;visibility:visible;display:inline;overflow:visible;filter:url(#filter4131-3);enable-background:accumulate"
         d="m 48,6.5 c -2.761424,0 -5,2.2385763 -5,5 0,2.761424 2.238576,5 5,5 2.761424,0 5,-2.238576 5,-5 0,-2.7614237 -2.238576,-5 -5,-5 z m 0,2 c 1.656854,0 3,1.3431458 3,3 0,1.656854 -1.343146,3 -3,3 -1.656854,0 -3,-1.343146 -3,-3 0,-1.6568542 1.343146,-3 3,-3 z"
         id="path4125" />
      <path
         id="path4120"
         d="m 48,6 c -2.761424,0 -5,2.2385763 -5,5 0,2.761424 2.238576,5 5,5 2.761424,0 5,-2.238576 5,-5 0,-2.7614237 -2.238576,-5 -5,-5 z m 0,2 c 1.656854,0 3,1.3431458 3,3 0,1.656854 -1.343146,3 -3,3 -1.656854,0 -3,-1.343146 -3,-3 0,-1.6568542 1.343146,-3 3,-3 z"
         style="color:#000000;fill:#bebebe;fill-opacity:1;fill-rule:nonzero;stroke:none;stroke-width:2;marker:none;visibility:visible;display:inline;overflow:visible;enable-background:accumulate"
         inkscape:connector-curvature="0" />
    </g>
  </g>
  <g
     inkscape:groupmode="layer"
     id="layer1"
     inkscape:label="Button"
     style="display:inline">
    <path
       sodipodi:type="inkscape:offset"
       inkscape:radius="0.94267464"
       inkscape:original="M 5 0 C 2.2642981 0 0 2.2642981 0 5 L 0 17 C 0 19.735702 2.2642982 22 5 22 L 29 22 C 31.735702 22 34 19.735702 34 17 L 34 5 C 34 2.2642982 31.735702 0 29 0 L 5 0 z "
       style="opacity:0.05;color:#000000;fill:#000000;fill-opacity:1;fill-rule:nonzero;stroke:none;stroke-width:2;marker:none;visibility:visible;display:inline;overflow:visible;enable-background:accumulate"
       id="path4541"
       d="m 5,-0.9375 c -3.25586,0 -5.9375,2.68164 -5.9375,5.9375 l 0,12 c 0,3.25586 2.6816401,5.9375 5.9375,5.9375 l 24,0 c 3.25586,0 5.9375,-2.68164 5.9375,-5.9375 l 0,-12 c 0,-3.2558599 -2.68164,-5.9375 -5.9375,-5.9375 l -24,0 z" />
    <path
       sodipodi:type="inkscape:offset"
       inkscape:radius="1.0204744"
       inkscape:original="M 5 1.03125 C 2.8258474 1.03125 1.03125 2.8258474 1.03125 5 L 1.03125 17 C 1.03125 19.174153 2.8258474 20.96875 5 20.96875 L 29 20.96875 C 31.174153 20.96875 32.96875 19.174153 32.96875 17 L 32.96875 5 C 32.96875 2.8258474 31.174153 1.03125 29 1.03125 L 5 1.03125 z "
       style="opacity:0.1;color:#000000;fill:#000000;fill-opacity:1;fill-rule:nonzero;stroke:none;stroke-width:2;marker:none;visibility:visible;display:inline;overflow:visible;enable-background:accumulate"
       id="path4537"
       d="M 5,0 C 2.2642981,0 0,2.2642981 0,5 l 0,12 c 0,2.735702 2.2642982,5 5,5 l 24,0 c 2.735702,0 5,-2.264298 5,-5 L 34,5 C 34,2.2642982 31.735702,0 29,0 L 5,0 z" />
    <path
       sodipodi:type="inkscape:offset"
       inkscape:radius="0.95425737"
       inkscape:original="M 5 2 C 3.338 2 2 3.338 2 5 L 2 17 C 2 18.662 3.338 20 5 20 L 29 20 C 30.662 20 32 18.662 32 17 L 32 5 C 32 3.338 30.662 2 29 2 L 5 2 z "
       style="opacity:0.2;color:#000000;fill:#000000;fill-opacity:1;fill-rule:nonzero;stroke:none;stroke-width:2;marker:none;visibility:visible;display:inline;overflow:visible;enable-background:accumulate"
       id="path4531"
       d="M 5,1.03125 C 2.8258474,1.03125 1.03125,2.8258474 1.03125,5 l 0,12 c 0,2.174153 1.7945974,3.96875 3.96875,3.96875 l 24,0 c 2.174153,0 3.96875,-1.794597 3.96875,-3.96875 l 0,-12 C 32.96875,2.8258474 31.174153,1.03125 29,1.03125 l -24,0 z" />
    <rect
       style="color:#000000;fill:url(#linearGradient3228-0);fill-opacity:1;fill-rule:nonzero;stroke:none;stroke-width:2;marker:none;visibility:visible;display:inline;overflow:visible;enable-background:accumulate"
       id="rect3936"
       width="30.00001"
       height="18.00001"
       x="2"
       y="2"
       rx="3"
       ry="3" />
    <path
       style="opacity:0.6;color:#000000;fill:url(#linearGradient3077-4-9-4);fill-opacity:1;fill-rule:nonzero;stroke:none;stroke-width:2;marker:none;visibility:visible;display:inline;overflow:visible;enable-background:accumulate"
       d="M 5,2 C 3.338,2 2,3.338 2,5 l 0,12 c 0,1.662 1.338,3 3,3 l 24,0 c 1.662,0 3,-1.338 3,-3 L 32,5 C 32,3.338 30.662,2 29,2 z m 0,1 24,0 c 1.12561,0 2,0.8743885 2,2 l 0,12 c 0,1.125612 -0.87439,2 -2,2 L 5,19 C 3.874388,19 3,18.125612 3,17 L 3,5 C 3,3.8743885 3.874388,3 5,3 z"
       id="rect4059"
       inkscape:connector-curvature="0"
       sodipodi:nodetypes="ssssssssssssssssss" />
  </g>
</svg>
